Hospital Service Area,Hospital County,Operating Certificate Number,Permanent Facility Id,Facility Name,Age Group,Zip Code - 3 digits,Gender,Race,Ethnicity,Length of Stay,Type of Admission,Patient Disposition,Discharge Year,CCS Diagnosis Code,CCS Diagnosis Description,CCS Procedure Code,CCS Procedure Description,APR DRG Code,APR DRG Description,APR MDC Code,APR MDC Description,APR Severity of Illness Code,APR Severity of Illness Description,APR Risk of Mortality,APR Medical Surgical Description,Payment Typology 1,Payment Typology 2,Payment Typology 3,Birth Weight,Abortion Edit Indicator,Emergency Department Indicator,Total Charges,Total Costs
Long Island,Suffolk,5123000,000885,Long Island Community Hospital,30 to 49,117,M,White,Not Span/Hispanic,8,Emergency,Home w/ Home Health Services,2020,DIG024,POSTPROCEDURAL OR POSTOPERATIVE DIGESTIVE SYSTEM COMPLICATION,GIS021,GI SYSTEM REPAIR (EXCLUDING ANORECTAL),223,OTHER SMALL & LARGE BOWEL PROCEDURES,06,DISEASES AND DISORDERS OF THE DIGESTIVE SYSTEM,2,Moderate,Minor,Surgical,Private Health Insurance,,,,,Y,101121.23,20951.15
Long Island,Suffolk,5123000,000885,Long Island Community Hospital,50 to 69,119,M,White,Not Span/Hispanic,5,Elective,Home w/ Home Health Services,2020,FAC010,OTHER AFTERCARE ENCOUNTER,GIS028,"LOWER GI THERAPEUTIC PROCEDURES, NEC (OPEN AND LAPAROSCOPIC)",223,OTHER SMALL & LARGE BOWEL PROCEDURES,06,DISEASES AND DISORDERS OF THE DIGESTIVE SYSTEM,1,Minor,Minor,Surgical,Private Health Insurance,Medicaid,,,,N,77843.7,16329.17
Long Island,Suffolk,5123000,000885,Long Island Community Hospital,70 or Older,119,F,White,Not Span/Hispanic,9,Emergency,Skilled Nursing Home,2020,DIG010,ABDOMINAL HERNIA,GIS021,GI SYSTEM REPAIR (EXCLUDING ANORECTAL),223,OTHER SMALL & LARGE BOWEL PROCEDURES,06,DISEASES AND DISORDERS OF THE DIGESTIVE SYSTEM,3,Major,Major,Surgical,Medicare,Medicare,Blue Cross/Blue Shield,,,Y,122034.81,23033.42
Long Island,Suffolk,5123000,000885,Long Island Community Hospital,70 or Older,117,F,White,Not Span/Hispanic,26,Emergency,Skilled Nursing Home,2020,DIG025,OTHER SPECIFIED AND UNSPECIFIED GASTROINTESTINAL DISORDERS,GIS022,GI SYSTEM LYSIS OF ADHESIONS,223,OTHER SMALL & LARGE BOWEL PROCEDURES,06,DISEASES AND DISORDERS OF THE DIGESTIVE SYSTEM,4,Extreme,Extreme,Surgical,Medicare,Medicare,Blue Cross/Blue Shield,,,Y,271345.38,51741.88
Long Island,Suffolk,5123000,000885,Long Island Community Hospital,30 to 49,117,M,White,Not Span/Hispanic,5,Elective,Left Against Medical Advice,2020,FAC010,OTHER AFTERCARE ENCOUNTER,GIS028,"LOWER GI THERAPEUTIC PROCEDURES, NEC (OPEN AND LAPAROSCOPIC)",223,OTHER SMALL & LARGE BOWEL PROCEDURES,06,DISEASES AND DISORDERS OF THE DIGESTIVE SYSTEM,1,Minor,Minor,Surgical,Medicare,Medicare,Medicaid,,,N,53412.3,12808.33
Long Island,Suffolk,5123000,000885,Long Island Community Hospital,50 to 69,119,F,White,Not Span/Hispanic,12,Elective,Home w/ Home Health Services,2020,FAC010,OTHER AFTERCARE ENCOUNTER,GIS021,GI SYSTEM REPAIR (EXCLUDING ANORECTAL),223,OTHER SMALL & LARGE BOWEL PROCEDURES,06,DISEASES AND DISORDERS OF THE DIGESTIVE SYSTEM,2,Moderate,Major,Surgical,Medicare,Medicare,Private Health Insurance,,,N,158805.49,33814.13
Long Island,Suffolk,5123000,000885,Long Island Community Hospital,30 to 49,119,F,Other Race,Not Span/Hispanic,4,Emergency,Home or Self Care,2020,INJ020,"EFFECT OF FOREIGN BODY ENTERING OPENING, INITIAL ENCOUNTER",GIS026,"UPPER GI THERAPEUTIC PROCEDURES, NEC (OPEN AND LAPAROSCOPIC)",223,OTHER SMALL & LARGE BOWEL PROCEDURES,06,DISEASES AND DISORDERS OF THE DIGESTIVE SYSTEM,1,Minor,Minor,Surgical,Medicaid,,,,,Y,45517.44,9158.99
Long Island,Suffolk,5123000,000885,Long Island Community Hospital,30 to 49,117,M,White,Not Span/Hispanic,4,Elective,Home or Self Care,2020,DIG013,DIVERTICULOSIS AND DIVERTICULITIS,GIS022,GI SYSTEM LYSIS OF ADHESIONS,223,OTHER SMALL & LARGE BOWEL PROCEDURES,06,DISEASES AND DISORDERS OF THE DIGESTIVE SYSTEM,1,Minor,Minor,Surgical,Private Health Insurance,,,,,N,89240.88,18112.3
Long Island,Suffolk,5123000,000885,Long Island Community Hospital,30 to 49,117,M,White,Not Span/Hispanic,3,Elective,Home or Self Care,2020,FAC010,OTHER AFTERCARE ENCOUNTER,GIS028,"LOWER GI THERAPEUTIC PROCEDURES, NEC (OPEN AND LAPAROSCOPIC)",223,OTHER SMALL & LARGE BOWEL PROCEDURES,06,DISEASES AND DISORDERS OF THE DIGESTIVE SYSTEM,1,Minor,Minor,Surgical,Private Health Insurance,,,,,N,48296.8,11218.46
