Hospital Service Area,Hospital County,Operating Certificate Number,Permanent Facility Id,Facility Name,Age Group,Zip Code - 3 digits,Gender,Race,Ethnicity,Length of Stay,Type of Admission,Patient Disposition,Discharge Year,CCS Diagnosis Code,CCS Diagnosis Description,CCS Procedure Code,CCS Procedure Description,APR DRG Code,APR DRG Description,APR MDC Code,APR MDC Description,APR Severity of Illness Code,APR Severity of Illness Description,APR Risk of Mortality,APR Medical Surgical Description,Payment Typology 1,Payment Typology 2,Payment Typology 3,Birth Weight,Abortion Edit Indicator,Emergency Department Indicator,Total Charges,Total Costs
Hudson Valley,Westchester,5920000,001117,Northern Westchester Hospital,70 or Older,105,F,White,Not Span/Hispanic,12,Emergency,Short-term Hospital,2018,DIG012,INTESTINAL OBSTRUCTION AND ILEUS,GIS022,GI SYSTEM LYSIS OF ADHESIONS,224,PERITONEAL ADHESIOLYSIS,06,DISEASES AND DISORDERS OF THE DIGESTIVE SYSTEM,2,Moderate,Moderate,Surgical,Medicare,Private Health Insurance,,,,true,74011.06,33539.85
New York City,Manhattan,7002020,001453,Memorial Hospital for Cancer and Allied Diseases,50 to 69,OOS,M,White,Not Span/Hispanic,14,Elective,Home or Self Care,2018,NEO012,GASTROINTESTINAL CANCERS - ESOPHAGUS,GIS014,ESOPHAGECTOMY,224,PERITONEAL ADHESIOLYSIS,06,DISEASES AND DISORDERS OF THE DIGESTIVE SYSTEM,2,Moderate,Major,Surgical,Blue Cross/Blue Shield,,,,,false,114638.36,45470.18
Long Island,Nassau,2951001,000541,North Shore University Hospital,70 or Older,115,F,White,Not Span/Hispanic,1,Emergency,Home or Self Care,2018,DIG012,INTESTINAL OBSTRUCTION AND ILEUS,GIS022,GI SYSTEM LYSIS OF ADHESIONS,224,PERITONEAL ADHESIOLYSIS,06,DISEASES AND DISORDERS OF THE DIGESTIVE SYSTEM,1,Minor,Minor,Surgical,Medicare,Blue Cross/Blue Shield,,,,true,34795.23,7533.03
Capital/Adirond,Albany,0101004,000005,St. Peter's Hospital,50 to 69,122,M,White,Not Span/Hispanic,4,Emergency,Home or Self Care,2018,DIG012,INTESTINAL OBSTRUCTION AND ILEUS,GIS022,GI SYSTEM LYSIS OF ADHESIONS,224,PERITONEAL ADHESIOLYSIS,06,DISEASES AND DISORDERS OF THE DIGESTIVE SYSTEM,2,Moderate,Minor,Surgical,Private Health Insurance,Medicare,,,,true,27443.15,11073.33
New York City,Queens,7003004,001638,Long Island Jewish Forest Hills,50 to 69,114,M,Other Race,Not Span/Hispanic,5,Emergency,Home or Self Care,2018,DIG012,INTESTINAL OBSTRUCTION AND ILEUS,GIS022,GI SYSTEM LYSIS OF ADHESIONS,224,PERITONEAL ADHESIOLYSIS,06,DISEASES AND DISORDERS OF THE DIGESTIVE SYSTEM,2,Moderate,Minor,Surgical,Medicaid,Medicaid,,,,true,59283.51,10688.28
Long Island,Nassau,2951001,000550,Syosset Hospital,70 or Older,114,M,White,Not Span/Hispanic,11,Emergency,Home or Self Care,2018,DIG012,INTESTINAL OBSTRUCTION AND ILEUS,GIS022,GI SYSTEM LYSIS OF ADHESIONS,224,PERITONEAL ADHESIOLYSIS,06,DISEASES AND DISORDERS OF THE DIGESTIVE SYSTEM,2,Moderate,Moderate,Surgical,Medicare,Medicare,,,,true,201030.83,37425.06
New York City,Kings,7002053,001304,NYU Langone Hospital-Brooklyn,50 to 69,112,F,Black/African American,Not Span/Hispanic,45,Emergency,Home w/ Home Health Services,2018,DIG012,INTESTINAL OBSTRUCTION AND ILEUS,GIS022,GI SYSTEM LYSIS OF ADHESIONS,224,PERITONEAL ADHESIOLYSIS,06,DISEASES AND DISORDERS OF THE DIGESTIVE SYSTEM,4,Extreme,Extreme,Surgical,Medicare,,,,,true,609009.81,190396.6
New York City,Queens,7003001,001628,Flushing Hospital Medical Center,0 to 17,113,F,White,Spanish/Hispanic,7,Emergency,Home or Self Care,2018,DIG009,APPENDICITIS AND OTHER APPENDICEAL CONDITIONS,GIS007,GI SYSTEM DRAINAGE (EXCLUDING PARACENTESIS),224,PERITONEAL ADHESIOLYSIS,06,DISEASES AND DISORDERS OF THE DIGESTIVE SYSTEM,3,Major,Minor,Surgical,Medicaid,,,,,true,37013.11,26450.41
Capital/Adirond,Albany,0101004,000005,St. Peter's Hospital,30 to 49,121,F,White,Not Span/Hispanic,3,Elective,Home or Self Care,2018,DIG012,INTESTINAL OBSTRUCTION AND ILEUS,GIS022,GI SYSTEM LYSIS OF ADHESIONS,224,PERITONEAL ADHESIOLYSIS,06,DISEASES AND DISORDERS OF THE DIGESTIVE SYSTEM,1,Minor,Minor,Surgical,Private Health Insurance,,,,,false,16169.45,7734.29
New York City,Kings,7001021,001306,New York - Presbyterian Brooklyn Methodist Hospital,30 to 49,112,F,White,Not Span/Hispanic,2,Emergency,Home or Self Care,2018,DIG010,ABDOMINAL HERNIA,GIS022,GI SYSTEM LYSIS OF ADHESIONS,224,PERITONEAL ADHESIOLYSIS,06,DISEASES AND DISORDERS OF THE DIGESTIVE SYSTEM,1,Minor,Minor,Surgical,"Managed Care, Unspecified",Medicaid,Self-Pay,,,true,26409.78,9470.26
New York City,Manhattan,7002054,001464,New York-Presbyterian Hospital - Columbia Presbyterian Center,50 to 69,125,M,White,Not Span/Hispanic,5,Emergency,Home w/ Home Health Services,2018,DIG012,INTESTINAL OBSTRUCTION AND ILEUS,GIS022,GI SYSTEM LYSIS OF ADHESIONS,224,PERITONEAL ADHESIOLYSIS,06,DISEASES AND DISORDERS OF THE DIGESTIVE SYSTEM,1,Minor,Minor,Surgical,Private Health Insurance,Self-Pay,,,,true,54292.36,12087.49
New York City,Kings,7001037,001320,University Hospital of Brooklyn,50 to 69,112,F,Black/African American,Not Span/Hispanic,7,Emergency,Home or Self Care,2018,DIG012,INTESTINAL OBSTRUCTION AND ILEUS,GIS022,GI SYSTEM LYSIS OF ADHESIONS,224,PERITONEAL ADHESIOLYSIS,06,DISEASES AND DISORDERS OF THE DIGESTIVE SYSTEM,2,Moderate,Minor,Surgical,Self-Pay,Self-Pay,,,,true,54230,29843.51
Long Island,Nassau,2908000,000511,NYU Langone Hospital-Long Island,30 to 49,115,M,Other Race,Spanish/Hispanic,3,Emergency,Home or Self Care,2018,DIG012,INTESTINAL OBSTRUCTION AND ILEUS,GIS022,GI SYSTEM LYSIS OF ADHESIONS,224,PERITONEAL ADHESIOLYSIS,06,DISEASES AND DISORDERS OF THE DIGESTIVE SYSTEM,2,Moderate,Minor,Surgical,Private Health Insurance,,,,,true,81266.29,12927.59
Hudson Valley,Westchester,5922000,001122,New York - Presbyterian Hospital,70 or Older,104,F,Other Race,Not Span/Hispanic,15,Emergency,Home w/ Home Health Services,2018,DIG012,INTESTINAL OBSTRUCTION AND ILEUS,GIS022,GI SYSTEM LYSIS OF ADHESIONS,224,PERITONEAL ADHESIOLYSIS,06,DISEASES AND DISORDERS OF THE DIGESTIVE SYSTEM,2,Moderate,Moderate,Surgical,Medicare,Blue Cross/Blue Shield,,,,true,190898.37,80973.36
New York City,Kings,7001037,001320,University Hospital of Brooklyn,30 to 49,112,F,Black/African American,Not Span/Hispanic,7,Emergency,Home or Self Care,2018,DIG009,APPENDICITIS AND OTHER APPENDICEAL CONDITIONS,GIS008,APPENDECTOMY,224,PERITONEAL ADHESIOLYSIS,06,DISEASES AND DISORDERS OF THE DIGESTIVE SYSTEM,2,Moderate,Minor,Surgical,Medicaid,Medicaid,Self-Pay,,,true,59051,33786.75
Long Island,Suffolk,5154001,000925,Good Samaritan Hospital Medical Center,0 to 17,117,M,Other Race,Spanish/Hispanic,5,Emergency,Home or Self Care,2018,DIG012,INTESTINAL OBSTRUCTION AND ILEUS,GIS022,GI SYSTEM LYSIS OF ADHESIONS,224,PERITONEAL ADHESIOLYSIS,06,DISEASES AND DISORDERS OF THE DIGESTIVE SYSTEM,1,Minor,Minor,Surgical,Medicaid,Medicaid,,,,true,49984.63,11033.06
New York City,Manhattan,7002032,001469,Mount Sinai Morningside,70 or Older,100,F,Black/African American,Not Span/Hispanic,14,Emergency,Home w/ Home Health Services,2018,DIG012,INTESTINAL OBSTRUCTION AND ILEUS,GIS022,GI SYSTEM LYSIS OF ADHESIONS,224,PERITONEAL ADHESIOLYSIS,06,DISEASES AND DISORDERS OF THE DIGESTIVE SYSTEM,2,Moderate,Moderate,Surgical,Medicare,Medicare,Self-Pay,,,true,203554.81,53248.7
New York City,Manhattan,7002054,001464,New York-Presbyterian Hospital - Columbia Presbyterian Center,30 to 49,110,M,White,Not Span/Hispanic,5,Emergency,Home or Self Care,2018,DIG012,INTESTINAL OBSTRUCTION AND ILEUS,GIS022,GI SYSTEM LYSIS OF ADHESIONS,224,PERITONEAL ADHESIOLYSIS,06,DISEASES AND DISORDERS OF THE DIGESTIVE SYSTEM,2,Moderate,Minor,Surgical,Medicaid,Medicaid,Self-Pay,,,true,62119.94,13701.37
New York City,Bronx,7000006,001169,Montefiore Medical Center - Henry & Lucy Moses Div,30 to 49,104,F,Other Race,Unknown,5,Emergency,Home or Self Care,2018,DIG025,OTHER SPECIFIED AND UNSPECIFIED GASTROINTESTINAL DISORDERS,GIS022,GI SYSTEM LYSIS OF ADHESIONS,224,PERITONEAL ADHESIOLYSIS,06,DISEASES AND DISORDERS OF THE DIGESTIVE SYSTEM,1,Minor,Minor,Surgical,Medicaid,,,,,true,84962.48,15849.99
New York City,Manhattan,7002017,001450,Lenox Hill Hospital,30 to 49,104,F,Black/African American,Not Span/Hispanic,3,Emergency,Home or Self Care,2018,DIG012,INTESTINAL OBSTRUCTION AND ILEUS,GIS022,GI SYSTEM LYSIS OF ADHESIONS,224,PERITONEAL ADHESIOLYSIS,06,DISEASES AND DISORDERS OF THE DIGESTIVE SYSTEM,2,Moderate,Minor,Surgical,Private Health Insurance,,,,,true,58343.2,12413.72
New York City,Manhattan,7002053,001463,NYU Langone Hospitals,50 to 69,100,F,Black/African American,Unknown,14,Emergency,Home w/ Home Health Services,2018,DIG012,INTESTINAL OBSTRUCTION AND ILEUS,GIS022,GI SYSTEM LYSIS OF ADHESIONS,224,PERITONEAL ADHESIOLYSIS,06,DISEASES AND DISORDERS OF THE DIGESTIVE SYSTEM,3,Major,Major,Surgical,Medicare,,,,,true,269493.63,103172.39
New York City,Manhattan,7002054,001458,New York-Presbyterian Hospital - New York Weill Cornell Center,50 to 69,112,M,White,Not Span/Hispanic,6,Emergency,Home or Self Care,2018,DIG009,APPENDICITIS AND OTHER APPENDICEAL CONDITIONS,GIS008,APPENDECTOMY,224,PERITONEAL ADHESIOLYSIS,06,DISEASES AND DISORDERS OF THE DIGESTIVE SYSTEM,3,Major,Minor,Surgical,Blue Cross/Blue Shield,Self-Pay,,,,true,101336.11,23164.1
Hudson Valley,Dutchess,5957001,000180,Mid-Hudson Valley Division of Westchester Medical Center,70 or Older,125,M,White,Not Span/Hispanic,5,Emergency,Home or Self Care,2018,DIG012,INTESTINAL OBSTRUCTION AND ILEUS,GIS022,GI SYSTEM LYSIS OF ADHESIONS,224,PERITONEAL ADHESIOLYSIS,06,DISEASES AND DISORDERS OF THE DIGESTIVE SYSTEM,2,Moderate,Minor,Surgical,Medicare,Blue Cross/Blue Shield,,,,true,99970.91,28228.61
New York City,Manhattan,7002053,001463,NYU Langone Hospitals,30 to 49,100,F,White,Not Span/Hispanic,2,Emergency,Home or Self Care,2018,DIG012,INTESTINAL OBSTRUCTION AND ILEUS,GIS022,GI SYSTEM LYSIS OF ADHESIONS,224,PERITONEAL ADHESIOLYSIS,06,DISEASES AND DISORDERS OF THE DIGESTIVE SYSTEM,2,Moderate,Minor,Surgical,Private Health Insurance,,,,,true,106061.99,23430.62
New York City,Queens,7003004,001630,Long Island Jewish Medical Center,50 to 69,114,F,Other Race,Not Span/Hispanic,8,Emergency,Home or Self Care,2018,DIG012,INTESTINAL OBSTRUCTION AND ILEUS,GIS022,GI SYSTEM LYSIS OF ADHESIONS,224,PERITONEAL ADHESIOLYSIS,06,DISEASES AND DISORDERS OF THE DIGESTIVE SYSTEM,2,Moderate,Moderate,Surgical,Blue Cross/Blue Shield,Self-Pay,,,,false,121305.5,24690.66
Western NY,Erie,1401005,000210,Erie County Medical Center,50 to 69,142,F,Other Race,Not Span/Hispanic,14,Emergency,Home w/ Home Health Services,2018,DIG012,INTESTINAL OBSTRUCTION AND ILEUS,GIS022,GI SYSTEM LYSIS OF ADHESIONS,224,PERITONEAL ADHESIOLYSIS,06,DISEASES AND DISORDERS OF THE DIGESTIVE SYSTEM,2,Moderate,Minor,Surgical,Medicaid,Medicaid,,,,true,39467.34,24746.78
Finger Lakes,Steuben,5002001,000870,St. James Hospital,50 to 69,148,M,White,Not Span/Hispanic,2,Emergency,Home or Self Care,2018,DIG012,INTESTINAL OBSTRUCTION AND ILEUS,GIS022,GI SYSTEM LYSIS OF ADHESIONS,224,PERITONEAL ADHESIOLYSIS,06,DISEASES AND DISORDERS OF THE DIGESTIVE SYSTEM,1,Minor,Minor,Surgical,Self-Pay,,,,,true,15128,5714.52
New York City,Manhattan,7002017,001450,Lenox Hill Hospital,30 to 49,,F,Other Race,Not Span/Hispanic,5,Emergency,Home or Self Care,2018,DIG012,INTESTINAL OBSTRUCTION AND ILEUS,GIS022,GI SYSTEM LYSIS OF ADHESIONS,224,PERITONEAL ADHESIOLYSIS,06,DISEASES AND DISORDERS OF THE DIGESTIVE SYSTEM,2,Moderate,Minor,Surgical,Private Health Insurance,,,,,true,73495.15,13939.58
Capital/Adirond,Albany,0101000,000001,Albany Medical Center Hospital,50 to 69,120,F,White,Not Span/Hispanic,8,Emergency,Home or Self Care,2018,DIG016,PERITONITIS AND INTRA-ABDOMINAL ABSCESS,GIS024,OTHER PERITONEAL CAVITY PROCEDURES,224,PERITONEAL ADHESIOLYSIS,06,DISEASES AND DISORDERS OF THE DIGESTIVE SYSTEM,3,Major,Minor,Surgical,Private Health Insurance,,,,,true,68757.7,31436.68
Capital/Adirond,Albany,0101000,000001,Albany Medical Center Hospital,30 to 49,121,F,Black/African American,Not Span/Hispanic,3,Emergency,Home or Self Care,2018,DIG012,INTESTINAL OBSTRUCTION AND ILEUS,GIS022,GI SYSTEM LYSIS OF ADHESIONS,224,PERITONEAL ADHESIOLYSIS,06,DISEASES AND DISORDERS OF THE DIGESTIVE SYSTEM,2,Moderate,Minor,Surgical,"Managed Care, Unspecified",,,,,true,35621.68,11900.37
Capital/Adirond,Albany,0101000,000001,Albany Medical Center Hospital,30 to 49,121,F,White,Not Span/Hispanic,6,Elective,Home or Self Care,2018,DIG012,INTESTINAL OBSTRUCTION AND ILEUS,GIS022,GI SYSTEM LYSIS OF ADHESIONS,224,PERITONEAL ADHESIOLYSIS,06,DISEASES AND DISORDERS OF THE DIGESTIVE SYSTEM,2,Moderate,Moderate,Surgical,Medicare,Medicaid,,,,false,27095.74,10885.88
Capital/Adirond,Schenectady,4601001,000829,Ellis Hospital,70 or Older,123,F,White,Not Span/Hispanic,10,Emergency,Home or Self Care,2018,DIG012,INTESTINAL OBSTRUCTION AND ILEUS,GIS022,GI SYSTEM LYSIS OF ADHESIONS,224,PERITONEAL ADHESIOLYSIS,06,DISEASES AND DISORDERS OF THE DIGESTIVE SYSTEM,3,Major,Major,Surgical,Medicare,Medicare,,,,true,56339.1,16413.58
Hudson Valley,Orange,3523000,000699,Garnet Health Medical Center,18 to 29,109,F,White,Not Span/Hispanic,11,Emergency,Home or Self Care,2018,SYM006,ABDOMINAL PAIN AND OTHER DIGESTIVE/ABDOMEN SIGNS AND SYMPTOMS,GIS022,GI SYSTEM LYSIS OF ADHESIONS,224,PERITONEAL ADHESIOLYSIS,06,DISEASES AND DISORDERS OF THE DIGESTIVE SYSTEM,1,Minor,Minor,Surgical,Blue Cross/Blue Shield,,,,,true,93785.17,24618.12
Central NY,Cayuga,0501000,000085,Auburn Community Hospital,50 to 69,131,F,White,Not Span/Hispanic,2,Emergency,Home or Self Care,2018,DIG009,APPENDICITIS AND OTHER APPENDICEAL CONDITIONS,GIS008,APPENDECTOMY,224,PERITONEAL ADHESIOLYSIS,06,DISEASES AND DISORDERS OF THE DIGESTIVE SYSTEM,3,Major,Minor,Surgical,Blue Cross/Blue Shield,,,,,false,25373.01,7394.92
Central NY,Madison,2601001,000397,Oneida Health Hospital,70 or Older,134,M,White,Not Span/Hispanic,8,Emergency,Home or Self Care,2018,DIG012,INTESTINAL OBSTRUCTION AND ILEUS,GIS022,GI SYSTEM LYSIS OF ADHESIONS,224,PERITONEAL ADHESIOLYSIS,06,DISEASES AND DISORDERS OF THE DIGESTIVE SYSTEM,2,Moderate,Moderate,Surgical,Medicare,Medicare,Blue Cross/Blue Shield,,,true,32972.35,15642.03
New York City,Bronx,7000006,001169,Montefiore Medical Center - Henry & Lucy Moses Div,50 to 69,104,F,Other Race,Spanish/Hispanic,4,Emergency,Home or Self Care,2018,DIG012,INTESTINAL OBSTRUCTION AND ILEUS,GIS022,GI SYSTEM LYSIS OF ADHESIONS,224,PERITONEAL ADHESIOLYSIS,06,DISEASES AND DISORDERS OF THE DIGESTIVE SYSTEM,1,Minor,Minor,Surgical,Private Health Insurance,,,,,true,70988.95,10374.6
New York City,Manhattan,7002054,001464,New York-Presbyterian Hospital - Columbia Presbyterian Center,30 to 49,100,F,Black/African American,Not Span/Hispanic,4,Emergency,Home or Self Care,2018,DIG012,INTESTINAL OBSTRUCTION AND ILEUS,GIS022,GI SYSTEM LYSIS OF ADHESIONS,224,PERITONEAL ADHESIOLYSIS,06,DISEASES AND DISORDERS OF THE DIGESTIVE SYSTEM,1,Minor,Minor,Surgical,Private Health Insurance,Medicaid,Self-Pay,,,false,38374.72,8384.51
New York City,Manhattan,7002009,001445,Harlem Hospital Center,18 to 29,100,F,Black/African American,Not Span/Hispanic,1,Emergency,Home or Self Care,2018,DIG012,INTESTINAL OBSTRUCTION AND ILEUS,GIS022,GI SYSTEM LYSIS OF ADHESIONS,224,PERITONEAL ADHESIOLYSIS,06,DISEASES AND DISORDERS OF THE DIGESTIVE SYSTEM,2,Moderate,Minor,Surgical,Private Health Insurance,Medicaid,Medicaid,,,true,12207.65,9071.88
New York City,Bronx,7000006,003058,Montefiore Med Center - Jack D Weiler Hosp of A Einstein College Div,50 to 69,113,F,Black/African American,Not Span/Hispanic,9,Emergency,Home or Self Care,2018,DIG012,INTESTINAL OBSTRUCTION AND ILEUS,GIS007,GI SYSTEM DRAINAGE (EXCLUDING PARACENTESIS),224,PERITONEAL ADHESIOLYSIS,06,DISEASES AND DISORDERS OF THE DIGESTIVE SYSTEM,2,Moderate,Minor,Surgical,Medicare,Private Health Insurance,,,,true,110992.48,21553.18
New York City,Queens,7003000,001626,Elmhurst Hospital Center,50 to 69,113,M,Other Race,Spanish/Hispanic,2,Emergency,Home or Self Care,2018,DIG009,APPENDICITIS AND OTHER APPENDICEAL CONDITIONS,GIS008,APPENDECTOMY,224,PERITONEAL ADHESIOLYSIS,06,DISEASES AND DISORDERS OF THE DIGESTIVE SYSTEM,2,Moderate,Minor,Surgical,Self-Pay,,,,,false,28375.31,16882.34
New York City,Queens,7003004,001638,Long Island Jewish Forest Hills,30 to 49,114,F,Other Race,Spanish/Hispanic,1,Emergency,Home or Self Care,2018,DIG009,APPENDICITIS AND OTHER APPENDICEAL CONDITIONS,GIS008,APPENDECTOMY,224,PERITONEAL ADHESIOLYSIS,06,DISEASES AND DISORDERS OF THE DIGESTIVE SYSTEM,2,Moderate,Minor,Surgical,Medicaid,,,,,true,34897.96,6709.24
Hudson Valley,Orange,3522000,000694,St Luke's Cornwall Hospital/Newburgh,18 to 29,125,M,Black/African American,Not Span/Hispanic,8,Emergency,Home or Self Care,2018,DIG012,INTESTINAL OBSTRUCTION AND ILEUS,GIS022,GI SYSTEM LYSIS OF ADHESIONS,224,PERITONEAL ADHESIOLYSIS,06,DISEASES AND DISORDERS OF THE DIGESTIVE SYSTEM,1,Minor,Minor,Surgical,Medicaid,,,,,true,61440.6,14718.76
Hudson Valley,Orange,3522000,000694,St Luke's Cornwall Hospital/Newburgh,70 or Older,125,F,Other Race,Unknown,10,Emergency,Home w/ Home Health Services,2018,DIG012,INTESTINAL OBSTRUCTION AND ILEUS,GIS022,GI SYSTEM LYSIS OF ADHESIONS,224,PERITONEAL ADHESIOLYSIS,06,DISEASES AND DISORDERS OF THE DIGESTIVE SYSTEM,4,Extreme,Extreme,Surgical,Medicare,Private Health Insurance,,,,true,97898.55,27748.41
Capital/Adirond,Otsego,3824000,000746,Mary Imogene Bassett Hospital,30 to 49,134,F,White,Not Span/Hispanic,3,Elective,Home or Self Care,2018,NEO073,BENIGN NEOPLASMS,HEP004,HEPATOBILIARY RESECTION AND ABLATION,224,PERITONEAL ADHESIOLYSIS,06,DISEASES AND DISORDERS OF THE DIGESTIVE SYSTEM,2,Moderate,Minor,Surgical,Private Health Insurance,,,,,false,57393.3,29463.09
Finger Lakes,Monroe,2701003,000411,Rochester General Hospital,50 to 69,146,F,Other Race,Spanish/Hispanic,8,Emergency,Home or Self Care,2018,DIG012,INTESTINAL OBSTRUCTION AND ILEUS,GIS022,GI SYSTEM LYSIS OF ADHESIONS,224,PERITONEAL ADHESIOLYSIS,06,DISEASES AND DISORDERS OF THE DIGESTIVE SYSTEM,2,Moderate,Minor,Surgical,Medicaid,,,,,true,33372.13,14366.17
Western NY,Erie,1401014,000207,Buffalo General Medical Center,70 or Older,142,F,Black/African American,Not Span/Hispanic,10,Emergency,Home w/ Home Health Services,2018,DIG012,INTESTINAL OBSTRUCTION AND ILEUS,GIS022,GI SYSTEM LYSIS OF ADHESIONS,224,PERITONEAL ADHESIOLYSIS,06,DISEASES AND DISORDERS OF THE DIGESTIVE SYSTEM,3,Major,Major,Surgical,Medicare,Medicaid,Self-Pay,,,true,68101.81,24187
Capital/Adirond,Franklin,1624000,000325,The University of Vermont Health Network - Alice Hyde Medical Center,50 to 69,129,M,White,Not Span/Hispanic,2,Elective,Home or Self Care,2018,DIG012,INTESTINAL OBSTRUCTION AND ILEUS,GIS022,GI SYSTEM LYSIS OF ADHESIONS,224,PERITONEAL ADHESIOLYSIS,06,DISEASES AND DISORDERS OF THE DIGESTIVE SYSTEM,2,Moderate,Minor,Surgical,Medicare,Blue Cross/Blue Shield,,,,false,15908.8,4869.56
New York City,Kings,7002053,001304,NYU Langone Hospital-Brooklyn,50 to 69,112,M,Other Race,Spanish/Hispanic,14,Emergency,Home or Self Care,2018,DIG012,INTESTINAL OBSTRUCTION AND ILEUS,GIS022,GI SYSTEM LYSIS OF ADHESIONS,224,PERITONEAL ADHESIOLYSIS,06,DISEASES AND DISORDERS OF THE DIGESTIVE SYSTEM,3,Major,Major,Surgical,Medicaid,,,,,true,229796.65,69151.84
New York City,Manhattan,7002024,001456,Mount Sinai Hospital,70 or Older,101,F,White,Not Span/Hispanic,9,Emergency,Skilled Nursing Home,2018,DIG012,INTESTINAL OBSTRUCTION AND ILEUS,GIS022,GI SYSTEM LYSIS OF ADHESIONS,224,PERITONEAL ADHESIOLYSIS,06,DISEASES AND DISORDERS OF THE DIGESTIVE SYSTEM,3,Major,Major,Surgical,Medicare,Blue Cross/Blue Shield,Self-Pay,,,true,111544.89,37206.5
Capital/Adirond,Otsego,3824000,000746,Mary Imogene Bassett Hospital,50 to 69,133,F,White,Not Span/Hispanic,3,Emergency,Home or Self Care,2018,DIG012,INTESTINAL OBSTRUCTION AND ILEUS,GIS022,GI SYSTEM LYSIS OF ADHESIONS,224,PERITONEAL ADHESIOLYSIS,06,DISEASES AND DISORDERS OF THE DIGESTIVE SYSTEM,2,Moderate,Minor,Surgical,Private Health Insurance,,,,,true,28401.36,12959.92
Capital/Adirond,Franklin,1624000,000325,The University of Vermont Health Network - Alice Hyde Medical Center,50 to 69,129,F,White,Not Span/Hispanic,2,Elective,Home or Self Care,2018,DIG025,OTHER SPECIFIED AND UNSPECIFIED GASTROINTESTINAL DISORDERS,GIS022,GI SYSTEM LYSIS OF ADHESIONS,224,PERITONEAL ADHESIOLYSIS,06,DISEASES AND DISORDERS OF THE DIGESTIVE SYSTEM,1,Minor,Minor,Surgical,Medicare,Medicaid,,,,false,12007.94,3675.54
Western NY,Erie,1401014,003067,Millard Fillmore Suburban Hospital,70 or Older,142,F,White,Not Span/Hispanic,9,Emergency,Home w/ Home Health Services,2018,DIG012,INTESTINAL OBSTRUCTION AND ILEUS,GIS022,GI SYSTEM LYSIS OF ADHESIONS,224,PERITONEAL ADHESIOLYSIS,06,DISEASES AND DISORDERS OF THE DIGESTIVE SYSTEM,3,Major,Moderate,Surgical,Medicare,Medicaid,Self-Pay,,,true,36276.1,15396.73
Western NY,Erie,1401014,003067,Millard Fillmore Suburban Hospital,18 to 29,140,M,White,Not Span/Hispanic,3,Emergency,Home or Self Care,2018,DIG012,INTESTINAL OBSTRUCTION AND ILEUS,GIS022,GI SYSTEM LYSIS OF ADHESIONS,224,PERITONEAL ADHESIOLYSIS,06,DISEASES AND DISORDERS OF THE DIGESTIVE SYSTEM,1,Minor,Minor,Surgical,Blue Cross/Blue Shield,Self-Pay,,,,true,26136,8341.52
New York City,Kings,7001033,001315,Kingsbrook Jewish Medical Center,70 or Older,112,F,Black/African American,Not Span/Hispanic,9,Emergency,Home or Self Care,2018,NEO066,MALIGNANT NEUROENDOCRINE TUMORS,GIS022,GI SYSTEM LYSIS OF ADHESIONS,224,PERITONEAL ADHESIOLYSIS,06,DISEASES AND DISORDERS OF THE DIGESTIVE SYSTEM,3,Major,Major,Surgical,Medicare,Medicare,Self-Pay,,,true,92895,29899.87
Capital/Adirond,Albany,0101000,000001,Albany Medical Center Hospital,30 to 49,120,F,Other Race,Spanish/Hispanic,6,Emergency,Home or Self Care,2018,DIG012,INTESTINAL OBSTRUCTION AND ILEUS,GIS022,GI SYSTEM LYSIS OF ADHESIONS,224,PERITONEAL ADHESIOLYSIS,06,DISEASES AND DISORDERS OF THE DIGESTIVE SYSTEM,1,Minor,Minor,Surgical,"Managed Care, Unspecified",,,,,true,38334.24,14425.25
Central NY,Onondaga,3301007,000635,University Hospital SUNY Health Science Center,70 or Older,133,M,White,Not Span/Hispanic,18,Emergency,Hospice - Home,2018,NEO013,GASTROINTESTINAL CANCERS - STOMACH,URN002,KIDNEY AND OTHER URINARY TRACT BIOPSY (NON-ENDOSCOPIC),224,PERITONEAL ADHESIOLYSIS,06,DISEASES AND DISORDERS OF THE DIGESTIVE SYSTEM,4,Extreme,Extreme,Surgical,Medicare,Federal/State/Local/VA,,,,false,150417.9,41782.46
New York City,Manhattan,7002032,001469,Mount Sinai Morningside,70 or Older,100,M,Other Race,Unknown,6,Emergency,Home w/ Home Health Services,2018,DIG012,INTESTINAL OBSTRUCTION AND ILEUS,GIS022,GI SYSTEM LYSIS OF ADHESIONS,224,PERITONEAL ADHESIOLYSIS,06,DISEASES AND DISORDERS OF THE DIGESTIVE SYSTEM,3,Major,Major,Surgical,Medicare,Medicare,Medicaid,,,true,66038.66,16154.65
Hudson Valley,Orange,3535001,000708,Bon Secours Community Hospital,70 or Older,OOS,F,White,Not Span/Hispanic,10,Emergency,Home w/ Home Health Services,2018,DIG012,INTESTINAL OBSTRUCTION AND ILEUS,GIS022,GI SYSTEM LYSIS OF ADHESIONS,224,PERITONEAL ADHESIOLYSIS,06,DISEASES AND DISORDERS OF THE DIGESTIVE SYSTEM,3,Major,Major,Surgical,Medicare,Private Health Insurance,,,,true,131852.17,23072.36
Capital/Adirond,Warren,5601000,001005,Glens Falls Hospital,70 or Older,OOS,F,White,Not Span/Hispanic,10,Emergency,Home or Self Care,2018,DIG010,ABDOMINAL HERNIA,GIS022,GI SYSTEM LYSIS OF ADHESIONS,224,PERITONEAL ADHESIOLYSIS,06,DISEASES AND DISORDERS OF THE DIGESTIVE SYSTEM,2,Moderate,Moderate,Surgical,Medicare,Private Health Insurance,,,,true,56739.94,22765.77
New York City,Manhattan,7002054,001464,New York-Presbyterian Hospital - Columbia Presbyterian Center,50 to 69,104,F,Black/African American,Not Span/Hispanic,2,Emergency,Home or Self Care,2018,DIG012,INTESTINAL OBSTRUCTION AND ILEUS,GIS022,GI SYSTEM LYSIS OF ADHESIONS,224,PERITONEAL ADHESIOLYSIS,06,DISEASES AND DISORDERS OF THE DIGESTIVE SYSTEM,1,Minor,Minor,Surgical,Medicaid,Medicaid,Self-Pay,,,true,47339.36,11599.18