Hospital Service Area,Hospital County,Operating Certificate Number,Permanent Facility Id,Facility Name,Age Group,Zip Code - 3 digits,Gender,Race,Ethnicity,Length of Stay,Type of Admission,Patient Disposition,Discharge Year,CCS Diagnosis Code,CCS Diagnosis Description,CCS Procedure Code,CCS Procedure Description,APR DRG Code,APR DRG Description,APR MDC Code,APR MDC Description,APR Severity of Illness Code,APR Severity of Illness Description,APR Risk of Mortality,APR Medical Surgical Description,Payment Typology 1,Payment Typology 2,Payment Typology 3,Birth Weight,Abortion Edit Indicator,Emergency Department Indicator,Total Charges,Total Costs
Long Island,Suffolk,5123000,000885,Long Island Community Hospital,70 or Older,117,F,White,Not Span/Hispanic,16,Emergency,Home or Self Care,2020,DIG012,INTESTINAL OBSTRUCTION AND ILEUS,GIS022,GI SYSTEM LYSIS OF ADHESIONS,224,PERITONEAL ADHESIOLYSIS,06,DISEASES AND DISORDERS OF THE DIGESTIVE SYSTEM,2,Moderate,Moderate,Surgical,Medicare,Medicare,Private Health Insurance,,,Y,142769.11,30464.7
Long Island,Suffolk,5123000,000885,Long Island Community Hospital,30 to 49,119,F,White,Not Span/Hispanic,8,Emergency,Home or Self Care,2020,DIG009,APPENDICITIS AND OTHER APPENDICEAL CONDITIONS,GIS008,APPENDECTOMY,224,PERITONEAL ADHESIOLYSIS,06,DISEASES AND DISORDERS OF THE DIGESTIVE SYSTEM,3,Major,Minor,Surgical,Private Health Insurance,Medicaid,,,,Y,87019.7,16997.63
Long Island,Suffolk,5123000,000885,Long Island Community Hospital,30 to 49,119,M,White,Not Span/Hispanic,3,Emergency,Home or Self Care,2020,DIG009,APPENDICITIS AND OTHER APPENDICEAL CONDITIONS,GIS022,GI SYSTEM LYSIS OF ADHESIONS,224,PERITONEAL ADHESIOLYSIS,06,DISEASES AND DISORDERS OF THE DIGESTIVE SYSTEM,2,Moderate,Minor,Surgical,Blue Cross/Blue Shield,,,,,Y,52124.01,9182.93
Long Island,Suffolk,5123000,000885,Long Island Community Hospital,50 to 69,117,F,Other Race,Not Span/Hispanic,7,Emergency,Home or Self Care,2020,DIG012,INTESTINAL OBSTRUCTION AND ILEUS,GIS022,GI SYSTEM LYSIS OF ADHESIONS,224,PERITONEAL ADHESIOLYSIS,06,DISEASES AND DISORDERS OF THE DIGESTIVE SYSTEM,1,Minor,Minor,Surgical,Private Health Insurance,,,,,Y,71867.83,14781.5
Long Island,Suffolk,5123000,000885,Long Island Community Hospital,30 to 49,119,F,White,Not Span/Hispanic,3,Emergency,Home or Self Care,2020,DIG009,APPENDICITIS AND OTHER APPENDICEAL CONDITIONS,GIS022,GI SYSTEM LYSIS OF ADHESIONS,224,PERITONEAL ADHESIOLYSIS,06,DISEASES AND DISORDERS OF THE DIGESTIVE SYSTEM,2,Moderate,Minor,Surgical,Blue Cross/Blue Shield,,,,,Y,40207.33,8815.53
Long Island,Suffolk,5123000,000885,Long Island Community Hospital,50 to 69,117,F,White,Not Span/Hispanic,13,Emergency,Home or Self Care,2020,DIG012,INTESTINAL OBSTRUCTION AND ILEUS,GIS022,GI SYSTEM LYSIS OF ADHESIONS,224,PERITONEAL ADHESIOLYSIS,06,DISEASES AND DISORDERS OF THE DIGESTIVE SYSTEM,2,Moderate,Minor,Surgical,Medicare,,,,,Y,128160.93,25542.2
Long Island,Suffolk,5123000,000885,Long Island Community Hospital,50 to 69,119,F,White,Not Span/Hispanic,5,Elective,Home or Self Care,2020,FAC010,OTHER AFTERCARE ENCOUNTER,GIS021,GI SYSTEM REPAIR (EXCLUDING ANORECTAL),224,PERITONEAL ADHESIOLYSIS,06,DISEASES AND DISORDERS OF THE DIGESTIVE SYSTEM,1,Minor,Minor,Surgical,Private Health Insurance,,,,,N,95860,20202.48
Long Island,Suffolk,5123000,000885,Long Island Community Hospital,30 to 49,117,F,White,Not Span/Hispanic,3,Emergency,Home w/ Home Health Services,2020,DIG009,APPENDICITIS AND OTHER APPENDICEAL CONDITIONS,GIS022,GI SYSTEM LYSIS OF ADHESIONS,224,PERITONEAL ADHESIOLYSIS,06,DISEASES AND DISORDERS OF THE DIGESTIVE SYSTEM,3,Major,Minor,Surgical,Blue Cross/Blue Shield,,,,,Y,65891.11,11262.26
Long Island,Suffolk,5123000,000885,Long Island Community Hospital,50 to 69,119,M,White,Not Span/Hispanic,5,Emergency,Home or Self Care,2020,DIG012,INTESTINAL OBSTRUCTION AND ILEUS,GIS022,GI SYSTEM LYSIS OF ADHESIONS,224,PERITONEAL ADHESIOLYSIS,06,DISEASES AND DISORDERS OF THE DIGESTIVE SYSTEM,1,Minor,Minor,Surgical,Blue Cross/Blue Shield,,,,,Y,76539.78,14013.58
Long Island,Suffolk,5123000,000885,Long Island Community Hospital,30 to 49,117,M,White,Not Span/Hispanic,2,Emergency,Left Against Medical Advice,2020,DIG012,INTESTINAL OBSTRUCTION AND ILEUS,GIS007,GI SYSTEM DRAINAGE (EXCLUDING PARACENTESIS),224,PERITONEAL ADHESIOLYSIS,06,DISEASES AND DISORDERS OF THE DIGESTIVE SYSTEM,2,Moderate,Minor,Surgical,Private Health Insurance,Medicaid,,,,Y,46474.13,7943.34
