Hospital Service Area,Hospital County,Operating Certificate Number,Permanent Facility Id,Facility Name,Age Group,Zip Code - 3 digits,Gender,Race,Ethnicity,Length of Stay,Type of Admission,Patient Disposition,Discharge Year,CCS Diagnosis Code,CCS Diagnosis Description,CCS Procedure Code,CCS Procedure Description,APR DRG Code,APR DRG Description,APR MDC Code,APR MDC Description,APR Severity of Illness Code,APR Severity of Illness Description,APR Risk of Mortality,APR Medical Surgical Description,Payment Typology 1,Payment Typology 2,Payment Typology 3,Birth Weight,Abortion Edit Indicator,Emergency Department Indicator,Total Charges,Total Costs
New York City,Manhattan,7002054,001437,New York-Presbyterian/Lower Manhattan Hospital,18 to 29,112,M,Other Race,Not Span/Hispanic,3,Emergency,Home or Self Care,2018,DIG016,PERITONITIS AND INTRA-ABDOMINAL ABSCESS,GIS007,GI SYSTEM DRAINAGE (EXCLUDING PARACENTESIS),226,ANAL PROCEDURES,06,DISEASES AND DISORDERS OF THE DIGESTIVE SYSTEM,1,Minor,Minor,Surgical,Blue Cross/Blue Shield,Self-Pay,,,,true,44002.83,11165.77
Long Island,Suffolk,5154001,000925,Good Samaritan Hospital Medical Center,70 or Older,117,F,Black/African American,Not Span/Hispanic,5,Emergency,Home w/ Home Health Services,2018,DIG014,HEMORRHOIDS,GIS002,COLONOSCOPY AND PROCTOSCOPY WITH BIOPSY,226,ANAL PROCEDURES,06,DISEASES AND DISORDERS OF THE DIGESTIVE SYSTEM,1,Minor,Moderate,Surgical,Medicare,,,,,true,56664.75,11135.36
Long Island,Nassau,2951001,000541,North Shore University Hospital,70 or Older,117,F,White,Not Span/Hispanic,4,Elective,Home or Self Care,2018,DIG015,ANAL AND RECTAL CONDITIONS,GIS020,ANORECTAL REPAIR (3RD AND 4TH DEGREE OBSTETRICAL REPAIRS AND OTHER),226,ANAL PROCEDURES,06,DISEASES AND DISORDERS OF THE DIGESTIVE SYSTEM,2,Moderate,Moderate,Surgical,Medicare,Blue Cross/Blue Shield,,,,false,78521.33,19628.9
New York City,Manhattan,7002024,001456,Mount Sinai Hospital,70 or Older,100,F,White,Not Span/Hispanic,2,Elective,Home or Self Care,2018,DIG015,ANAL AND RECTAL CONDITIONS,GIS016,GI SYSTEM ENDOSCOPIC THERAPEUTIC PROCEDURES,226,ANAL PROCEDURES,06,DISEASES AND DISORDERS OF THE DIGESTIVE SYSTEM,2,Moderate,Moderate,Surgical,Medicare,Blue Cross/Blue Shield,Self-Pay,,,false,29699.37,10962.47
New York City,Manhattan,7002021,001454,Metropolitan Hospital Center,30 to 49,100,M,Black/African American,Not Span/Hispanic,3,Emergency,Home or Self Care,2018,DIG014,HEMORRHOIDS,CAR020,SAPHENOUS VEIN HARVEST AND OTHER THERAPEUTIC VESSEL REMOVAL,226,ANAL PROCEDURES,06,DISEASES AND DISORDERS OF THE DIGESTIVE SYSTEM,1,Minor,Minor,Surgical,Medicaid,Medicaid,,,,true,19193.26,15507.19
New York City,Bronx,7000001,001178,BronxCare Hospital Center,50 to 69,104,M,Other Race,Unknown,1,Emergency,Left Against Medical Advice,2018,DIG014,HEMORRHOIDS,CAR020,SAPHENOUS VEIN HARVEST AND OTHER THERAPEUTIC VESSEL REMOVAL,226,ANAL PROCEDURES,06,DISEASES AND DISORDERS OF THE DIGESTIVE SYSTEM,1,Minor,Minor,Surgical,Medicaid,Medicaid,,,,true,7147.58,7003.68
New York City,Manhattan,7002054,001458,New York-Presbyterian Hospital - New York Weill Cornell Center,70 or Older,100,F,White,Not Span/Hispanic,5,Elective,Skilled Nursing Home,2018,DIG015,ANAL AND RECTAL CONDITIONS,GIS016,GI SYSTEM ENDOSCOPIC THERAPEUTIC PROCEDURES,226,ANAL PROCEDURES,06,DISEASES AND DISORDERS OF THE DIGESTIVE SYSTEM,2,Moderate,Minor,Surgical,Medicare,Self-Pay,,,,false,76383.18,19549.97
Hudson Valley,Westchester,5957001,001139,Westchester Medical Center,70 or Older,108,M,White,Not Span/Hispanic,47,Emergency,Skilled Nursing Home,2018,DIG021,GASTROINTESTINAL HEMORRHAGE,GIS004,GI SYSTEM ENDOSCOPY WITHOUT BIOPSY (DIAGNOSTIC),226,ANAL PROCEDURES,06,DISEASES AND DISORDERS OF THE DIGESTIVE SYSTEM,4,Extreme,Extreme,Surgical,Medicare,Medicare,Medicaid,,,true,1082603.92,222425.83
Capital/Adirond,Columbia,1001000,000146,Columbia Memorial Hospital,70 or Older,121,F,White,Not Span/Hispanic,5,Elective,Home or Self Care,2018,DIG014,HEMORRHOIDS,CAR010,LIGATION AND EMBOLIZATION OF VESSELS,226,ANAL PROCEDURES,06,DISEASES AND DISORDERS OF THE DIGESTIVE SYSTEM,2,Moderate,Moderate,Surgical,Medicare,Medicaid,,,,true,25595.58,8264.03
New York City,Manhattan,7002053,001463,NYU Langone Hospitals,50 to 69,OOS,F,White,Not Span/Hispanic,1,Emergency,Home or Self Care,2018,DIG014,HEMORRHOIDS,CAR010,LIGATION AND EMBOLIZATION OF VESSELS,226,ANAL PROCEDURES,06,DISEASES AND DISORDERS OF THE DIGESTIVE SYSTEM,1,Minor,Moderate,Surgical,Medicare,,,,,true,54332.65,12024.7
New York City,Manhattan,7002054,001437,New York-Presbyterian/Lower Manhattan Hospital,70 or Older,100,M,Other Race,Not Span/Hispanic,8,Emergency,Home w/ Home Health Services,2018,DIG014,HEMORRHOIDS,CAR020,SAPHENOUS VEIN HARVEST AND OTHER THERAPEUTIC VESSEL REMOVAL,226,ANAL PROCEDURES,06,DISEASES AND DISORDERS OF THE DIGESTIVE SYSTEM,2,Moderate,Major,Surgical,Medicare,Medicare,Medicaid,,,true,105465.17,27117.65
New York City,Kings,7002002,001324,Mount Sinai Brooklyn,50 to 69,112,M,Black/African American,Unknown,2,Emergency,Home or Self Care,2018,DIG016,PERITONITIS AND INTRA-ABDOMINAL ABSCESS,GIS007,GI SYSTEM DRAINAGE (EXCLUDING PARACENTESIS),226,ANAL PROCEDURES,06,DISEASES AND DISORDERS OF THE DIGESTIVE SYSTEM,1,Minor,Minor,Surgical,Blue Cross/Blue Shield,Self-Pay,,,,false,32631.04,5748.53
Long Island,Suffolk,5149000,000895,John T Mather Memorial Hospital of Port Jefferson New York Inc,30 to 49,119,M,White,Not Span/Hispanic,4,Emergency,Home w/ Home Health Services,2018,DIG016,PERITONITIS AND INTRA-ABDOMINAL ABSCESS,GIS007,GI SYSTEM DRAINAGE (EXCLUDING PARACENTESIS),226,ANAL PROCEDURES,06,DISEASES AND DISORDERS OF THE DIGESTIVE SYSTEM,2,Moderate,Minor,Surgical,Blue Cross/Blue Shield,Blue Cross/Blue Shield,,,,true,49995.87,11115.21
New York City,Kings,7001021,001306,New York - Presbyterian Brooklyn Methodist Hospital,50 to 69,112,M,Black/African American,Not Span/Hispanic,8,Emergency,Home or Self Care,2018,DIG014,HEMORRHOIDS,CAR020,SAPHENOUS VEIN HARVEST AND OTHER THERAPEUTIC VESSEL REMOVAL,226,ANAL PROCEDURES,06,DISEASES AND DISORDERS OF THE DIGESTIVE SYSTEM,2,Moderate,Moderate,Surgical,Blue Cross/Blue Shield,Self-Pay,,,,true,58337.29,18496.58
Long Island,Nassau,2951001,000541,North Shore University Hospital,30 to 49,115,M,White,Not Span/Hispanic,2,Emergency,Home or Self Care,2018,DIG014,HEMORRHOIDS,CAR020,SAPHENOUS VEIN HARVEST AND OTHER THERAPEUTIC VESSEL REMOVAL,226,ANAL PROCEDURES,06,DISEASES AND DISORDERS OF THE DIGESTIVE SYSTEM,1,Minor,Minor,Surgical,Blue Cross/Blue Shield,,,,,true,33884.2,7460.68
New York City,Kings,7002002,001324,Mount Sinai Brooklyn,50 to 69,112,M,White,Not Span/Hispanic,5,Emergency,Skilled Nursing Home,2018,DIG016,PERITONITIS AND INTRA-ABDOMINAL ABSCESS,GIS007,GI SYSTEM DRAINAGE (EXCLUDING PARACENTESIS),226,ANAL PROCEDURES,06,DISEASES AND DISORDERS OF THE DIGESTIVE SYSTEM,3,Major,Major,Surgical,Medicare,Miscellaneous/Other,Medicaid,,,true,65428.58,11454.65
Hudson Valley,Westchester,5922000,001122,New York - Presbyterian Hospital,70 or Older,107,F,White,Not Span/Hispanic,1,Emergency,Home or Self Care,2018,DIG014,HEMORRHOIDS,CAR020,SAPHENOUS VEIN HARVEST AND OTHER THERAPEUTIC VESSEL REMOVAL,226,ANAL PROCEDURES,06,DISEASES AND DISORDERS OF THE DIGESTIVE SYSTEM,1,Minor,Moderate,Surgical,Medicare,Medicare,Self-Pay,,,true,23273.29,8141.93
New York City,Queens,7003004,001638,Long Island Jewish Forest Hills,30 to 49,113,M,Other Race,Not Span/Hispanic,2,Emergency,Home w/ Home Health Services,2018,DIG016,PERITONITIS AND INTRA-ABDOMINAL ABSCESS,GIS007,GI SYSTEM DRAINAGE (EXCLUDING PARACENTESIS),226,ANAL PROCEDURES,06,DISEASES AND DISORDERS OF THE DIGESTIVE SYSTEM,1,Minor,Minor,Surgical,Blue Cross/Blue Shield,,,,,true,36455.81,6558.74
Long Island,Nassau,2908000,000511,NYU Langone Hospital-Long Island,18 to 29,110,F,Other Race,Not Span/Hispanic,3,Emergency,Home or Self Care,2018,DIG011,REGIONAL ENTERITIS AND ULCERATIVE COLITIS,GIS007,GI SYSTEM DRAINAGE (EXCLUDING PARACENTESIS),226,ANAL PROCEDURES,06,DISEASES AND DISORDERS OF THE DIGESTIVE SYSTEM,1,Minor,Minor,Surgical,Private Health Insurance,,,,,true,98721.37,13775.69
New York City,Queens,7003010,001637,New York - Presbyterian/Queens,50 to 69,114,M,Black/African American,Not Span/Hispanic,19,Emergency,Home or Self Care,2018,DIG015,ANAL AND RECTAL CONDITIONS,GIS020,ANORECTAL REPAIR (3RD AND 4TH DEGREE OBSTETRICAL REPAIRS AND OTHER),226,ANAL PROCEDURES,06,DISEASES AND DISORDERS OF THE DIGESTIVE SYSTEM,2,Moderate,Minor,Surgical,Medicare,Medicaid,Self-Pay,,,true,133518.95,44488.24
Western NY,Erie,1401010,000216,Roswell Park Cancer Institute,50 to 69,136,M,White,Not Span/Hispanic,4,Elective,Home w/ Home Health Services,2018,NEO015,GASTROINTESTINAL CANCERS - COLORECTAL,GIS013,PROCTECTOMY OR ANAL RESECTION,226,ANAL PROCEDURES,06,DISEASES AND DISORDERS OF THE DIGESTIVE SYSTEM,1,Minor,Minor,Surgical,"Managed Care, Unspecified",Medicaid,,,,false,82875.57,28947.12
Central NY,Onondaga,3301003,000630,St. Joseph's Hospital Health Center,30 to 49,130,F,White,Not Span/Hispanic,2,Elective,Home or Self Care,2018,DIG015,ANAL AND RECTAL CONDITIONS,MST028,"SUBCUTANEOUS TISSUE AND FASCIA PROCEDURES, NEC",226,ANAL PROCEDURES,06,DISEASES AND DISORDERS OF THE DIGESTIVE SYSTEM,1,Minor,Minor,Surgical,Blue Cross/Blue Shield,,,,,false,20554.01,9709.15
New York City,Manhattan,7002053,001463,NYU Langone Hospitals,30 to 49,112,F,White,Not Span/Hispanic,2,Emergency,Home or Self Care,2018,DIG015,ANAL AND RECTAL CONDITIONS,GIS020,ANORECTAL REPAIR (3RD AND 4TH DEGREE OBSTETRICAL REPAIRS AND OTHER),226,ANAL PROCEDURES,06,DISEASES AND DISORDERS OF THE DIGESTIVE SYSTEM,1,Minor,Minor,Surgical,Private Health Insurance,,,,,true,42121.63,10479.1
New York City,Queens,7003001,001628,Flushing Hospital Medical Center,30 to 49,113,M,White,Spanish/Hispanic,4,Emergency,Home or Self Care,2018,DIG014,HEMORRHOIDS,CAR020,SAPHENOUS VEIN HARVEST AND OTHER THERAPEUTIC VESSEL REMOVAL,226,ANAL PROCEDURES,06,DISEASES AND DISORDERS OF THE DIGESTIVE SYSTEM,1,Minor,Minor,Surgical,Medicaid,,,,,true,22462.62,13837.47
Capital/Adirond,Albany,0101004,000005,St. Peter's Hospital,50 to 69,121,F,White,Not Span/Hispanic,2,Elective,Home or Self Care,2018,DIG015,ANAL AND RECTAL CONDITIONS,GIS020,ANORECTAL REPAIR (3RD AND 4TH DEGREE OBSTETRICAL REPAIRS AND OTHER),226,ANAL PROCEDURES,06,DISEASES AND DISORDERS OF THE DIGESTIVE SYSTEM,1,Minor,Minor,Surgical,Blue Cross/Blue Shield,,,,,false,47712.45,17844.19
Finger Lakes,Ontario,3402000,000671,Geneva General Hospital,30 to 49,131,M,White,Not Span/Hispanic,3,Emergency,Home or Self Care,2018,DIG016,PERITONITIS AND INTRA-ABDOMINAL ABSCESS,GIS007,GI SYSTEM DRAINAGE (EXCLUDING PARACENTESIS),226,ANAL PROCEDURES,06,DISEASES AND DISORDERS OF THE DIGESTIVE SYSTEM,2,Moderate,Minor,Surgical,Blue Cross/Blue Shield,,,,,true,7490.92,2509.9
Capital/Adirond,Albany,0101000,000001,Albany Medical Center Hospital,70 or Older,121,M,White,Not Span/Hispanic,3,Emergency,Home or Self Care,2018,DIG016,PERITONITIS AND INTRA-ABDOMINAL ABSCESS,GIS007,GI SYSTEM DRAINAGE (EXCLUDING PARACENTESIS),226,ANAL PROCEDURES,06,DISEASES AND DISORDERS OF THE DIGESTIVE SYSTEM,1,Minor,Minor,Surgical,Medicaid,,,,,true,28690.96,7649.84
Long Island,Suffolk,5154001,000925,Good Samaritan Hospital Medical Center,70 or Older,117,F,White,Not Span/Hispanic,2,Elective,Home or Self Care,2018,DIG015,ANAL AND RECTAL CONDITIONS,GIS016,GI SYSTEM ENDOSCOPIC THERAPEUTIC PROCEDURES,226,ANAL PROCEDURES,06,DISEASES AND DISORDERS OF THE DIGESTIVE SYSTEM,2,Moderate,Moderate,Surgical,Medicare,Blue Cross/Blue Shield,,,,false,54256.01,10996.08
New York City,Kings,7001021,001306,New York - Presbyterian Brooklyn Methodist Hospital,18 to 29,112,M,Black/African American,Not Span/Hispanic,3,Emergency,Home or Self Care,2018,DIG011,REGIONAL ENTERITIS AND ULCERATIVE COLITIS,GIS007,GI SYSTEM DRAINAGE (EXCLUDING PARACENTESIS),226,ANAL PROCEDURES,06,DISEASES AND DISORDERS OF THE DIGESTIVE SYSTEM,2,Moderate,Minor,Surgical,Medicaid,Self-Pay,,,,true,32559.08,11072.27
New York City,Manhattan,7002002,001439,Mount Sinai Beth Israel,50 to 69,112,F,White,Not Span/Hispanic,2,Elective,Home or Self Care,2018,DIG015,ANAL AND RECTAL CONDITIONS,GIS020,ANORECTAL REPAIR (3RD AND 4TH DEGREE OBSTETRICAL REPAIRS AND OTHER),226,ANAL PROCEDURES,06,DISEASES AND DISORDERS OF THE DIGESTIVE SYSTEM,2,Moderate,Moderate,Surgical,Private Health Insurance,Self-Pay,,,,false,40516.68,8164.82
Central NY,Madison,2601001,000397,Oneida Health Hospital,30 to 49,134,F,White,Not Span/Hispanic,6,Emergency,Home or Self Care,2018,DIG022,NONINFECTIOUS GASTROENTERITIS,GIS028,"LOWER GI THERAPEUTIC PROCEDURES, NEC (OPEN AND LAPAROSCOPIC)",226,ANAL PROCEDURES,06,DISEASES AND DISORDERS OF THE DIGESTIVE SYSTEM,2,Moderate,Moderate,Surgical,Medicaid,Self-Pay,Self-Pay,,,true,18539.74,6466.45
New York City,Queens,7002024,001639,Mount Sinai Hospital - Mount Sinai Hospital of Queens,50 to 69,112,M,Black/African American,Not Span/Hispanic,15,Emergency,Skilled Nursing Home,2018,DIG014,HEMORRHOIDS,CAR020,SAPHENOUS VEIN HARVEST AND OTHER THERAPEUTIC VESSEL REMOVAL,226,ANAL PROCEDURES,06,DISEASES AND DISORDERS OF THE DIGESTIVE SYSTEM,1,Minor,Minor,Surgical,Medicaid,Medicaid,,,,true,48838.55,14025.11
Western NY,Erie,1401014,000208,John R. Oishei Children's Hospital,18 to 29,141,M,White,Not Span/Hispanic,2,Emergency,Home or Self Care,2018,DIG016,PERITONITIS AND INTRA-ABDOMINAL ABSCESS,GIS007,GI SYSTEM DRAINAGE (EXCLUDING PARACENTESIS),226,ANAL PROCEDURES,06,DISEASES AND DISORDERS OF THE DIGESTIVE SYSTEM,2,Moderate,Minor,Surgical,Blue Cross/Blue Shield,Self-Pay,,,,true,30301.43,10055.54
Finger Lakes,Ontario,3402000,000671,Geneva General Hospital,70 or Older,148,F,White,Not Span/Hispanic,1,Elective,Home or Self Care,2018,DIG015,ANAL AND RECTAL CONDITIONS,GIS016,GI SYSTEM ENDOSCOPIC THERAPEUTIC PROCEDURES,226,ANAL PROCEDURES,06,DISEASES AND DISORDERS OF THE DIGESTIVE SYSTEM,1,Minor,Moderate,Surgical,Medicare,Blue Cross/Blue Shield,Private Health Insurance,,,false,11700.37,5542.16
New York City,Manhattan,7002054,001464,New York-Presbyterian Hospital - Columbia Presbyterian Center,30 to 49,125,M,White,Not Span/Hispanic,4,Urgent,Home or Self Care,2018,DIG014,HEMORRHOIDS,CAR010,LIGATION AND EMBOLIZATION OF VESSELS,226,ANAL PROCEDURES,06,DISEASES AND DISORDERS OF THE DIGESTIVE SYSTEM,2,Moderate,Major,Surgical,Medicare,Private Health Insurance,Self-Pay,,,false,62166.91,15058.22
Capital/Adirond,Rensselaer,4102002,000756,Samaritan Hospital,30 to 49,121,M,White,Not Span/Hispanic,3,Emergency,Home or Self Care,2018,DIG016,PERITONITIS AND INTRA-ABDOMINAL ABSCESS,GIS028,"LOWER GI THERAPEUTIC PROCEDURES, NEC (OPEN AND LAPAROSCOPIC)",226,ANAL PROCEDURES,06,DISEASES AND DISORDERS OF THE DIGESTIVE SYSTEM,1,Minor,Minor,Surgical,Medicaid,,,,,true,15684.6,4198.32
New York City,Bronx,7000001,001178,BronxCare Hospital Center,30 to 49,104,M,Other Race,Spanish/Hispanic,4,Emergency,Home or Self Care,2018,DIG014,HEMORRHOIDS,CAR020,SAPHENOUS VEIN HARVEST AND OTHER THERAPEUTIC VESSEL REMOVAL,226,ANAL PROCEDURES,06,DISEASES AND DISORDERS OF THE DIGESTIVE SYSTEM,1,Minor,Minor,Surgical,Private Health Insurance,,,,,true,19225.51,22494.84
Long Island,Suffolk,5151001,000245,Stony Brook University Hospital,30 to 49,117,M,White,Not Span/Hispanic,1,Urgent,Home or Self Care,2018,DIG016,PERITONITIS AND INTRA-ABDOMINAL ABSCESS,GIS007,GI SYSTEM DRAINAGE (EXCLUDING PARACENTESIS),226,ANAL PROCEDURES,06,DISEASES AND DISORDERS OF THE DIGESTIVE SYSTEM,1,Minor,Minor,Surgical,Private Health Insurance,,,,,true,17186.63,5742.65
Hudson Valley,Orange,3522000,000694,St Luke's Cornwall Hospital/Newburgh,50 to 69,125,F,Black/African American,Not Span/Hispanic,7,Urgent,Home or Self Care,2018,DIG014,HEMORRHOIDS,CAR010,LIGATION AND EMBOLIZATION OF VESSELS,226,ANAL PROCEDURES,06,DISEASES AND DISORDERS OF THE DIGESTIVE SYSTEM,2,Moderate,Major,Surgical,Medicare,Private Health Insurance,,,,false,55694.7,14470.26
Western NY,Erie,1401014,003067,Millard Fillmore Suburban Hospital,70 or Older,140,M,White,Not Span/Hispanic,14,Emergency,Skilled Nursing Home,2018,DIG014,HEMORRHOIDS,CAR020,SAPHENOUS VEIN HARVEST AND OTHER THERAPEUTIC VESSEL REMOVAL,226,ANAL PROCEDURES,06,DISEASES AND DISORDERS OF THE DIGESTIVE SYSTEM,2,Moderate,Major,Surgical,Medicare,Private Health Insurance,Medicaid,,,true,52122.25,24402.36
Long Island,Suffolk,5154001,000925,Good Samaritan Hospital Medical Center,50 to 69,117,M,White,Not Span/Hispanic,2,Emergency,Home or Self Care,2018,DIG014,HEMORRHOIDS,CAR020,SAPHENOUS VEIN HARVEST AND OTHER THERAPEUTIC VESSEL REMOVAL,226,ANAL PROCEDURES,06,DISEASES AND DISORDERS OF THE DIGESTIVE SYSTEM,1,Minor,Minor,Surgical,Medicare,,,,,true,31314.47,6982.76
New York City,Manhattan,7002053,001463,NYU Langone Hospitals,30 to 49,100,M,White,Not Span/Hispanic,1,Emergency,Home or Self Care,2018,DIG011,REGIONAL ENTERITIS AND ULCERATIVE COLITIS,GIS020,ANORECTAL REPAIR (3RD AND 4TH DEGREE OBSTETRICAL REPAIRS AND OTHER),226,ANAL PROCEDURES,06,DISEASES AND DISORDERS OF THE DIGESTIVE SYSTEM,2,Moderate,Minor,Surgical,Medicare,,,,,true,49485.75,11414.34
Central NY,Onondaga,3301003,000630,St. Joseph's Hospital Health Center,50 to 69,131,F,White,Not Span/Hispanic,9,Elective,Home or Self Care,2018,DIG015,ANAL AND RECTAL CONDITIONS,GIS020,ANORECTAL REPAIR (3RD AND 4TH DEGREE OBSTETRICAL REPAIRS AND OTHER),226,ANAL PROCEDURES,06,DISEASES AND DISORDERS OF THE DIGESTIVE SYSTEM,2,Moderate,Moderate,Surgical,Blue Cross/Blue Shield,Medicare,,,,false,42053.87,19161.41
New York City,Manhattan,7002054,001458,New York-Presbyterian Hospital - New York Weill Cornell Center,18 to 29,OOS,M,White,Not Span/Hispanic,1,Elective,Home or Self Care,2018,DIG015,ANAL AND RECTAL CONDITIONS,GIS020,ANORECTAL REPAIR (3RD AND 4TH DEGREE OBSTETRICAL REPAIRS AND OTHER),226,ANAL PROCEDURES,06,DISEASES AND DISORDERS OF THE DIGESTIVE SYSTEM,1,Minor,Minor,Surgical,Private Health Insurance,,,,,false,46823.29,14729.58
Long Island,Nassau,2908000,000511,NYU Langone Hospital-Long Island,30 to 49,115,F,White,Not Span/Hispanic,4,Emergency,Home or Self Care,2018,DIG015,ANAL AND RECTAL CONDITIONS,GIS020,ANORECTAL REPAIR (3RD AND 4TH DEGREE OBSTETRICAL REPAIRS AND OTHER),226,ANAL PROCEDURES,06,DISEASES AND DISORDERS OF THE DIGESTIVE SYSTEM,2,Moderate,Moderate,Surgical,Private Health Insurance,,,,,true,69189.32,12215.39
New York City,Kings,7001033,001315,Kingsbrook Jewish Medical Center,30 to 49,112,F,Black/African American,Not Span/Hispanic,1,Emergency,Home or Self Care,2018,DIG014,HEMORRHOIDS,CAR020,SAPHENOUS VEIN HARVEST AND OTHER THERAPEUTIC VESSEL REMOVAL,226,ANAL PROCEDURES,06,DISEASES AND DISORDERS OF THE DIGESTIVE SYSTEM,1,Minor,Minor,Surgical,Medicaid,Self-Pay,,,,true,26390,8757.41
Central NY,Madison,2601001,000397,Oneida Health Hospital,70 or Older,133,F,White,Not Span/Hispanic,3,Elective,Skilled Nursing Home,2018,DIG015,ANAL AND RECTAL CONDITIONS,GIS016,GI SYSTEM ENDOSCOPIC THERAPEUTIC PROCEDURES,226,ANAL PROCEDURES,06,DISEASES AND DISORDERS OF THE DIGESTIVE SYSTEM,2,Moderate,Moderate,Surgical,Medicare,Medicare,Private Health Insurance,,,false,15243.04,6589.09
Long Island,Nassau,2908000,000511,NYU Langone Hospital-Long Island,50 to 69,115,M,Black/African American,Not Span/Hispanic,6,Emergency,Home or Self Care,2018,DIG014,HEMORRHOIDS,GIS020,ANORECTAL REPAIR (3RD AND 4TH DEGREE OBSTETRICAL REPAIRS AND OTHER),226,ANAL PROCEDURES,06,DISEASES AND DISORDERS OF THE DIGESTIVE SYSTEM,1,Minor,Minor,Surgical,Private Health Insurance,Medicare,Medicare,,,true,153783.87,24862.6
Southern Tier,Broome,0301001,000043,Our Lady of Lourdes Memorial Hospital,50 to 69,137,F,White,Not Span/Hispanic,6,Emergency,Home or Self Care,2018,NEO070,SECONDARY MALIGNANCIES,GIS015,OMENTECTOMY OR PERITONEUM RESECTION,226,ANAL PROCEDURES,06,DISEASES AND DISORDERS OF THE DIGESTIVE SYSTEM,2,Moderate,Moderate,Surgical,Medicaid,Self-Pay,Self-Pay,,,true,47216.13,15396.97
Long Island,Suffolk,5154000,000924,South Shore University Hospital,30 to 49,117,M,Other Race,Spanish/Hispanic,1,Emergency,Home or Self Care,2018,DIG016,PERITONITIS AND INTRA-ABDOMINAL ABSCESS,GIS007,GI SYSTEM DRAINAGE (EXCLUDING PARACENTESIS),226,ANAL PROCEDURES,06,DISEASES AND DISORDERS OF THE DIGESTIVE SYSTEM,1,Minor,Minor,Surgical,Private Health Insurance,,,,,true,26247.99,5864.14
Western NY,Erie,1401005,000210,Erie County Medical Center,50 to 69,142,M,Black/African American,Not Span/Hispanic,13,Emergency,Home or Self Care,2018,DIG014,HEMORRHOIDS,CAR020,SAPHENOUS VEIN HARVEST AND OTHER THERAPEUTIC VESSEL REMOVAL,226,ANAL PROCEDURES,06,DISEASES AND DISORDERS OF THE DIGESTIVE SYSTEM,2,Moderate,Major,Surgical,Medicaid,Medicaid,,,,true,80558.66,56702.82
New York City,Richmond,7004003,001740,Staten Island University Hosp-North,30 to 49,112,F,White,Not Span/Hispanic,1,Emergency,Home or Self Care,2018,DIG016,PERITONITIS AND INTRA-ABDOMINAL ABSCESS,GIS007,GI SYSTEM DRAINAGE (EXCLUDING PARACENTESIS),226,ANAL PROCEDURES,06,DISEASES AND DISORDERS OF THE DIGESTIVE SYSTEM,1,Minor,Minor,Surgical,Medicaid,,,,,true,22392.64,5586.73
New York City,Queens,7003010,001637,New York - Presbyterian/Queens,30 to 49,115,M,White,Not Span/Hispanic,2,Emergency,Home or Self Care,2018,DIG014,HEMORRHOIDS,CAR020,SAPHENOUS VEIN HARVEST AND OTHER THERAPEUTIC VESSEL REMOVAL,226,ANAL PROCEDURES,06,DISEASES AND DISORDERS OF THE DIGESTIVE SYSTEM,1,Minor,Moderate,Surgical,Blue Cross/Blue Shield,Self-Pay,,,,true,21571.28,7481.59
New York City,Bronx,7000024,001186,North Central Bronx Hospital,70 or Older,104,M,White,Unknown,10,Emergency,Short-term Hospital,2018,DIG016,PERITONITIS AND INTRA-ABDOMINAL ABSCESS,CAR020,SAPHENOUS VEIN HARVEST AND OTHER THERAPEUTIC VESSEL REMOVAL,226,ANAL PROCEDURES,06,DISEASES AND DISORDERS OF THE DIGESTIVE SYSTEM,1,Minor,Moderate,Surgical,Medicare,Medicare,,,,true,56830.65,34115.95
Southern Tier,Broome,0301001,000043,Our Lady of Lourdes Memorial Hospital,50 to 69,139,M,White,Not Span/Hispanic,10,Emergency,Home or Self Care,2018,DIG014,HEMORRHOIDS,CAR020,SAPHENOUS VEIN HARVEST AND OTHER THERAPEUTIC VESSEL REMOVAL,226,ANAL PROCEDURES,06,DISEASES AND DISORDERS OF THE DIGESTIVE SYSTEM,1,Minor,Minor,Surgical,Medicare,Medicare,Medicaid,,,true,37725.65,13085.38
Capital/Adirond,Clinton,0901001,000135,The University of Vermont Health Network - Champlain Valley Physicians Hospital,70 or Older,136,F,White,Not Span/Hispanic,15,Emergency,Home w/ Home Health Services,2018,DIG014,HEMORRHOIDS,GIS016,GI SYSTEM ENDOSCOPIC THERAPEUTIC PROCEDURES,226,ANAL PROCEDURES,06,DISEASES AND DISORDERS OF THE DIGESTIVE SYSTEM,2,Moderate,Moderate,Surgical,Medicare,Medicare,Private Health Insurance,,,true,85173.35,43072.33
New York City,Queens,7002024,001639,Mount Sinai Hospital - Mount Sinai Hospital of Queens,30 to 49,113,F,Other Race,Not Span/Hispanic,3,Elective,Home or Self Care,2018,DIG014,HEMORRHOIDS,CAR020,SAPHENOUS VEIN HARVEST AND OTHER THERAPEUTIC VESSEL REMOVAL,226,ANAL PROCEDURES,06,DISEASES AND DISORDERS OF THE DIGESTIVE SYSTEM,1,Minor,Minor,Surgical,Private Health Insurance,,,,,false,15211.46,5054.25
New York City,Manhattan,7002053,001463,NYU Langone Hospitals,70 or Older,100,F,White,Not Span/Hispanic,4,Emergency,Home w/ Home Health Services,2018,DIG014,HEMORRHOIDS,CAR010,LIGATION AND EMBOLIZATION OF VESSELS,226,ANAL PROCEDURES,06,DISEASES AND DISORDERS OF THE DIGESTIVE SYSTEM,1,Minor,Moderate,Surgical,Medicare,,,,,true,74828.13,20023.7
New York City,Manhattan,7002024,001456,Mount Sinai Hospital,50 to 69,115,F,Other Race,Not Span/Hispanic,1,Elective,Home or Self Care,2018,DIG015,ANAL AND RECTAL CONDITIONS,GIS016,GI SYSTEM ENDOSCOPIC THERAPEUTIC PROCEDURES,226,ANAL PROCEDURES,06,DISEASES AND DISORDERS OF THE DIGESTIVE SYSTEM,2,Moderate,Minor,Surgical,Medicare,Private Health Insurance,Self-Pay,,,false,23255.24,7997.97