Hospital Service Area,Hospital County,Operating Certificate Number,Permanent Facility Id,Facility Name,Age Group,Zip Code - 3 digits,Gender,Race,Ethnicity,Length of Stay,Type of Admission,Patient Disposition,Discharge Year,CCS Diagnosis Code,CCS Diagnosis Description,CCS Procedure Code,CCS Procedure Description,APR DRG Code,APR DRG Description,APR MDC Code,APR MDC Description,APR Severity of Illness Code,APR Severity of Illness Description,APR Risk of Mortality,APR Medical Surgical Description,Payment Typology 1,Payment Typology 2,Payment Typology 3,Birth Weight,Abortion Edit Indicator,Emergency Department Indicator,Total Charges,Total Costs
New York City,Manhattan,7002053,001463,NYU Langone Hospitals,30 to 49,112,F,White,Not Span/Hispanic,3,Emergency,Home or Self Care,2019,DIG014,HEMORRHOIDS,CAR020,SAPHENOUS VEIN HARVEST AND OTHER THERAPEUTIC VESSEL REMOVAL,226,ANAL PROCEDURES,06,DISEASES AND DISORDERS OF THE DIGESTIVE SYSTEM,1,Minor,Minor,Surgical,Medicaid,,,,,true,117369.11,32003.1
New York City,Manhattan,7002053,001463,NYU Langone Hospitals,70 or Older,112,M,White,Not Span/Hispanic,1,Elective,Home or Self Care,2019,DIG015,ANAL AND RECTAL CONDITIONS,GIS016,GI SYSTEM ENDOSCOPIC THERAPEUTIC PROCEDURES,226,ANAL PROCEDURES,06,DISEASES AND DISORDERS OF THE DIGESTIVE SYSTEM,2,Moderate,Minor,Surgical,Medicare,Medicare,,,,false,78349.65,12310.63
New York City,Manhattan,7002053,001463,NYU Langone Hospitals,70 or Older,100,F,White,Not Span/Hispanic,3,Elective,Home or Self Care,2019,DIG015,ANAL AND RECTAL CONDITIONS,GIS020,ANORECTAL REPAIR (3RD AND 4TH DEGREE OBSTETRICAL REPAIRS AND OTHER),226,ANAL PROCEDURES,06,DISEASES AND DISORDERS OF THE DIGESTIVE SYSTEM,1,Minor,Minor,Surgical,Medicare,Medicare,,,,false,137011.95,26366.82
New York City,Manhattan,7002053,001463,NYU Langone Hospitals,70 or Older,100,F,White,Not Span/Hispanic,1,Elective,Home or Self Care,2019,DIG015,ANAL AND RECTAL CONDITIONS,GIS020,ANORECTAL REPAIR (3RD AND 4TH DEGREE OBSTETRICAL REPAIRS AND OTHER),226,ANAL PROCEDURES,06,DISEASES AND DISORDERS OF THE DIGESTIVE SYSTEM,2,Moderate,Minor,Surgical,Medicare,Blue Cross/Blue Shield,,,,false,119893.64,19197.33
New York City,Manhattan,7002053,001463,NYU Langone Hospitals,70 or Older,100,F,White,Not Span/Hispanic,2,Elective,Home w/ Home Health Services,2019,DIG015,ANAL AND RECTAL CONDITIONS,GIS016,GI SYSTEM ENDOSCOPIC THERAPEUTIC PROCEDURES,226,ANAL PROCEDURES,06,DISEASES AND DISORDERS OF THE DIGESTIVE SYSTEM,1,Minor,Minor,Surgical,Medicare,Medicare,,,,false,54330.79,12654.56
New York City,Manhattan,7002053,001463,NYU Langone Hospitals,70 or Older,100,F,White,Not Span/Hispanic,1,Elective,Home w/ Home Health Services,2019,DIG015,ANAL AND RECTAL CONDITIONS,GIS016,GI SYSTEM ENDOSCOPIC THERAPEUTIC PROCEDURES,226,ANAL PROCEDURES,06,DISEASES AND DISORDERS OF THE DIGESTIVE SYSTEM,1,Minor,Minor,Surgical,Medicare,Medicare,,,,false,79231.86,16831.64
New York City,Manhattan,7002053,001463,NYU Langone Hospitals,50 to 69,112,M,Other Race,Spanish/Hispanic,2,Emergency,Home or Self Care,2019,DIG016,PERITONITIS AND INTRA-ABDOMINAL ABSCESS,GIS007,GI SYSTEM DRAINAGE (EXCLUDING PARACENTESIS),226,ANAL PROCEDURES,06,DISEASES AND DISORDERS OF THE DIGESTIVE SYSTEM,3,Major,Moderate,Surgical,Private Health Insurance,,,,,true,28444.75,8529.39
New York City,Manhattan,7002053,001463,NYU Langone Hospitals,70 or Older,OOS,F,Other Race,Not Span/Hispanic,1,Elective,Home or Self Care,2019,DIG015,ANAL AND RECTAL CONDITIONS,GIS016,GI SYSTEM ENDOSCOPIC THERAPEUTIC PROCEDURES,226,ANAL PROCEDURES,06,DISEASES AND DISORDERS OF THE DIGESTIVE SYSTEM,1,Minor,Minor,Surgical,Medicare,Medicare,,,,false,57868.89,10756.85
New York City,Manhattan,7002053,001463,NYU Langone Hospitals,50 to 69,112,F,White,Not Span/Hispanic,1,Elective,Home or Self Care,2019,DIG015,ANAL AND RECTAL CONDITIONS,GIS020,ANORECTAL REPAIR (3RD AND 4TH DEGREE OBSTETRICAL REPAIRS AND OTHER),226,ANAL PROCEDURES,06,DISEASES AND DISORDERS OF THE DIGESTIVE SYSTEM,1,Minor,Minor,Surgical,Blue Cross/Blue Shield,,,,,false,103998.43,17217.81
New York City,Manhattan,7002053,001463,NYU Langone Hospitals,18 to 29,OOS,F,White,Not Span/Hispanic,7,Urgent,Home or Self Care,2019,DIG024,POSTPROCEDURAL OR POSTOPERATIVE DIGESTIVE SYSTEM COMPLICATION,GIS007,GI SYSTEM DRAINAGE (EXCLUDING PARACENTESIS),226,ANAL PROCEDURES,06,DISEASES AND DISORDERS OF THE DIGESTIVE SYSTEM,3,Major,Moderate,Surgical,Private Health Insurance,,,,,false,105941.94,29190.19
New York City,Manhattan,7002053,001463,NYU Langone Hospitals,70 or Older,112,M,White,Not Span/Hispanic,1,Elective,Home or Self Care,2019,DIG015,ANAL AND RECTAL CONDITIONS,GIS016,GI SYSTEM ENDOSCOPIC THERAPEUTIC PROCEDURES,226,ANAL PROCEDURES,06,DISEASES AND DISORDERS OF THE DIGESTIVE SYSTEM,2,Moderate,Minor,Surgical,Medicare,Medicare,,,,false,47192.02,11410.82
New York City,Manhattan,7002053,001463,NYU Langone Hospitals,70 or Older,OOS,F,Other Race,Not Span/Hispanic,1,Elective,Home or Self Care,2019,DIG015,ANAL AND RECTAL CONDITIONS,GIS016,GI SYSTEM ENDOSCOPIC THERAPEUTIC PROCEDURES,226,ANAL PROCEDURES,06,DISEASES AND DISORDERS OF THE DIGESTIVE SYSTEM,1,Minor,Minor,Surgical,Medicare,Medicare,,,,false,46369.73,11310.84
New York City,Manhattan,7002053,001463,NYU Langone Hospitals,18 to 29,112,F,White,Not Span/Hispanic,2,Emergency,Home or Self Care,2019,DIG016,PERITONITIS AND INTRA-ABDOMINAL ABSCESS,GIS007,GI SYSTEM DRAINAGE (EXCLUDING PARACENTESIS),226,ANAL PROCEDURES,06,DISEASES AND DISORDERS OF THE DIGESTIVE SYSTEM,2,Moderate,Minor,Surgical,Medicaid,,,,,true,62661.01,13140.64
New York City,Manhattan,7002053,001463,NYU Langone Hospitals,30 to 49,OOS,F,White,Not Span/Hispanic,1,Elective,Home or Self Care,2019,DIG024,POSTPROCEDURAL OR POSTOPERATIVE DIGESTIVE SYSTEM COMPLICATION,FRS011,FEMALE LOWER GENITAL TRACT EXCISION,226,ANAL PROCEDURES,06,DISEASES AND DISORDERS OF THE DIGESTIVE SYSTEM,1,Minor,Minor,Surgical,Blue Cross/Blue Shield,,,,,false,35373.31,6880.21
New York City,Manhattan,7002053,001463,NYU Langone Hospitals,50 to 69,103,F,White,Not Span/Hispanic,2,Emergency,Home or Self Care,2019,DIG015,ANAL AND RECTAL CONDITIONS,GIS020,ANORECTAL REPAIR (3RD AND 4TH DEGREE OBSTETRICAL REPAIRS AND OTHER),226,ANAL PROCEDURES,06,DISEASES AND DISORDERS OF THE DIGESTIVE SYSTEM,2,Moderate,Minor,Surgical,Private Health Insurance,Private Health Insurance,,,,true,44094.68,11354.22
New York City,Manhattan,7002053,001463,NYU Langone Hospitals,70 or Older,100,F,White,Not Span/Hispanic,2,Elective,Home or Self Care,2019,DIG015,ANAL AND RECTAL CONDITIONS,GIS016,GI SYSTEM ENDOSCOPIC THERAPEUTIC PROCEDURES,226,ANAL PROCEDURES,06,DISEASES AND DISORDERS OF THE DIGESTIVE SYSTEM,2,Moderate,Minor,Surgical,Medicare,Private Health Insurance,,,,false,60967.82,13392.01
New York City,Manhattan,7002053,001463,NYU Langone Hospitals,30 to 49,109,M,White,Not Span/Hispanic,2,Emergency,Home or Self Care,2019,DIG011,REGIONAL ENTERITIS AND ULCERATIVE COLITIS,GIS020,ANORECTAL REPAIR (3RD AND 4TH DEGREE OBSTETRICAL REPAIRS AND OTHER),226,ANAL PROCEDURES,06,DISEASES AND DISORDERS OF THE DIGESTIVE SYSTEM,1,Minor,Minor,Surgical,Private Health Insurance,,,,,false,42579.2,9997.04
New York City,Manhattan,7002053,001463,NYU Langone Hospitals,30 to 49,109,M,White,Not Span/Hispanic,5,Emergency,Home or Self Care,2019,DIG016,PERITONITIS AND INTRA-ABDOMINAL ABSCESS,MST005,INCISION AND DRAINAGE OF SUBCUTANEOUS TISSUE AND FASCIA,226,ANAL PROCEDURES,06,DISEASES AND DISORDERS OF THE DIGESTIVE SYSTEM,2,Moderate,Minor,Surgical,Private Health Insurance,,,,,false,73677.95,19818.25
New York City,Manhattan,7002053,001463,NYU Langone Hospitals,70 or Older,113,F,White,Not Span/Hispanic,1,Elective,Home or Self Care,2019,DIG015,ANAL AND RECTAL CONDITIONS,GIS020,ANORECTAL REPAIR (3RD AND 4TH DEGREE OBSTETRICAL REPAIRS AND OTHER),226,ANAL PROCEDURES,06,DISEASES AND DISORDERS OF THE DIGESTIVE SYSTEM,2,Moderate,Minor,Surgical,Medicare,,,,,false,84387.25,14161.47
New York City,Manhattan,7002053,001463,NYU Langone Hospitals,30 to 49,112,M,White,Not Span/Hispanic,1,Emergency,Home or Self Care,2019,DIG016,PERITONITIS AND INTRA-ABDOMINAL ABSCESS,GIS007,GI SYSTEM DRAINAGE (EXCLUDING PARACENTESIS),226,ANAL PROCEDURES,06,DISEASES AND DISORDERS OF THE DIGESTIVE SYSTEM,1,Minor,Minor,Surgical,Private Health Insurance,,,,,true,40237.55,7909.65
New York City,Manhattan,7002053,001463,NYU Langone Hospitals,70 or Older,112,F,White,Not Span/Hispanic,1,Elective,Home or Self Care,2019,DIG015,ANAL AND RECTAL CONDITIONS,GIS020,ANORECTAL REPAIR (3RD AND 4TH DEGREE OBSTETRICAL REPAIRS AND OTHER),226,ANAL PROCEDURES,06,DISEASES AND DISORDERS OF THE DIGESTIVE SYSTEM,2,Moderate,Minor,Surgical,Medicare,Medicare,,,,false,120558.62,18947.4
New York City,Manhattan,7002053,001463,NYU Langone Hospitals,30 to 49,104,M,Other Race,Spanish/Hispanic,1,Emergency,Home or Self Care,2019,DIG015,ANAL AND RECTAL CONDITIONS,GIS016,GI SYSTEM ENDOSCOPIC THERAPEUTIC PROCEDURES,226,ANAL PROCEDURES,06,DISEASES AND DISORDERS OF THE DIGESTIVE SYSTEM,2,Moderate,Minor,Surgical,Medicaid,,,,,true,44102.56,7980.25
New York City,Manhattan,7002053,001463,NYU Langone Hospitals,18 to 29,100,F,White,Not Span/Hispanic,1,Emergency,Home or Self Care,2019,DIG011,REGIONAL ENTERITIS AND ULCERATIVE COLITIS,GIS007,GI SYSTEM DRAINAGE (EXCLUDING PARACENTESIS),226,ANAL PROCEDURES,06,DISEASES AND DISORDERS OF THE DIGESTIVE SYSTEM,1,Minor,Minor,Surgical,Private Health Insurance,,,,,true,37614.9,7416.89
New York City,Manhattan,7002053,001463,NYU Langone Hospitals,70 or Older,100,F,White,Not Span/Hispanic,6,Elective,Home w/ Home Health Services,2019,DIG015,ANAL AND RECTAL CONDITIONS,GIS016,GI SYSTEM ENDOSCOPIC THERAPEUTIC PROCEDURES,226,ANAL PROCEDURES,06,DISEASES AND DISORDERS OF THE DIGESTIVE SYSTEM,2,Moderate,Major,Surgical,Medicare,Private Health Insurance,,,,true,130296.48,32542.06
New York City,Manhattan,7002053,001463,NYU Langone Hospitals,70 or Older,OOS,F,Other Race,Not Span/Hispanic,1,Elective,Home or Self Care,2019,DIG015,ANAL AND RECTAL CONDITIONS,GIS016,GI SYSTEM ENDOSCOPIC THERAPEUTIC PROCEDURES,226,ANAL PROCEDURES,06,DISEASES AND DISORDERS OF THE DIGESTIVE SYSTEM,1,Minor,Minor,Surgical,Medicare,Medicare,,,,false,34118.72,9502.6
New York City,Manhattan,7002053,001463,NYU Langone Hospitals,18 to 29,100,M,Other Race,Unknown,1,Emergency,Home or Self Care,2019,DIG014,HEMORRHOIDS,CAR010,LIGATION AND EMBOLIZATION OF VESSELS,226,ANAL PROCEDURES,06,DISEASES AND DISORDERS OF THE DIGESTIVE SYSTEM,1,Minor,Minor,Surgical,Blue Cross/Blue Shield,,,,,true,52929.46,10117.51
New York City,Manhattan,7002053,001463,NYU Langone Hospitals,70 or Older,117,F,Other Race,Unknown,1,Elective,Home or Self Care,2019,NEO015,GASTROINTESTINAL CANCERS - COLORECTAL,GIS016,GI SYSTEM ENDOSCOPIC THERAPEUTIC PROCEDURES,226,ANAL PROCEDURES,06,DISEASES AND DISORDERS OF THE DIGESTIVE SYSTEM,2,Moderate,Minor,Surgical,Medicare,,,,,false,152985.08,24626.81
New York City,Manhattan,7002053,001463,NYU Langone Hospitals,30 to 49,OOS,M,White,Not Span/Hispanic,1,Elective,Home or Self Care,2019,DIG024,POSTPROCEDURAL OR POSTOPERATIVE DIGESTIVE SYSTEM COMPLICATION,GIS022,GI SYSTEM LYSIS OF ADHESIONS,226,ANAL PROCEDURES,06,DISEASES AND DISORDERS OF THE DIGESTIVE SYSTEM,1,Minor,Minor,Surgical,Blue Cross/Blue Shield,,,,,false,23486.1,5827.92
New York City,Manhattan,7002053,001463,NYU Langone Hospitals,18 to 29,125,M,White,Not Span/Hispanic,1,Emergency,Home or Self Care,2019,DIG016,PERITONITIS AND INTRA-ABDOMINAL ABSCESS,GIS007,GI SYSTEM DRAINAGE (EXCLUDING PARACENTESIS),226,ANAL PROCEDURES,06,DISEASES AND DISORDERS OF THE DIGESTIVE SYSTEM,2,Moderate,Minor,Surgical,Private Health Insurance,,,,,true,52403.63,9775.66
