Hospital Service Area,Hospital County,Operating Certificate Number,Permanent Facility Id,Facility Name,Age Group,Zip Code - 3 digits,Gender,Race,Ethnicity,Length of Stay,Type of Admission,Patient Disposition,Discharge Year,CCS Diagnosis Code,CCS Diagnosis Description,CCS Procedure Code,CCS Procedure Description,APR DRG Code,APR DRG Description,APR MDC Code,APR MDC Description,APR Severity of Illness Code,APR Severity of Illness Description,APR Risk of Mortality,APR Medical Surgical Description,Payment Typology 1,Payment Typology 2,Payment Typology 3,Birth Weight,Abortion Edit Indicator,Emergency Department Indicator,Total Charges,Total Costs
New York City,Manhattan,7002020,001453,Memorial Hospital for Cancer and Allied Diseases,50 to 69,112,M,White,Not Span/Hispanic,3,Elective,Home or Self Care,2018,DIG010,ABDOMINAL HERNIA,GNR002,ABDOMINAL WALL REPAIR (INCLUDING HERNIA),227,"HERNIA PROCEDURES EXCEPT INGUINAL, FEMORAL & UMBILICAL",06,DISEASES AND DISORDERS OF THE DIGESTIVE SYSTEM,2,Moderate,Minor,Surgical,Private Health Insurance,,,,,false,42117.65,17962.08
Finger Lakes,Livingston,2527000,000393,Nicholas H. Noyes Memorial Hospital,70 or Older,144,M,White,Not Span/Hispanic,3,Emergency,Home or Self Care,2018,DIG010,ABDOMINAL HERNIA,GNR002,ABDOMINAL WALL REPAIR (INCLUDING HERNIA),227,"HERNIA PROCEDURES EXCEPT INGUINAL, FEMORAL & UMBILICAL",06,DISEASES AND DISORDERS OF THE DIGESTIVE SYSTEM,1,Minor,Minor,Surgical,Medicare,,,,,true,11174.73,3012.54
New York City,Manhattan,7002054,001458,New York-Presbyterian Hospital - New York Weill Cornell Center,30 to 49,116,M,White,Not Span/Hispanic,9,Emergency,Home or Self Care,2018,DIG010,ABDOMINAL HERNIA,GNR002,ABDOMINAL WALL REPAIR (INCLUDING HERNIA),227,"HERNIA PROCEDURES EXCEPT INGUINAL, FEMORAL & UMBILICAL",06,DISEASES AND DISORDERS OF THE DIGESTIVE SYSTEM,2,Moderate,Minor,Surgical,Private Health Insurance,Self-Pay,,,,true,136393.15,37227.24
New York City,Manhattan,7002054,001458,New York-Presbyterian Hospital - New York Weill Cornell Center,70 or Older,112,F,Black/African American,Not Span/Hispanic,6,Emergency,Home or Self Care,2018,DIG010,ABDOMINAL HERNIA,GNR002,ABDOMINAL WALL REPAIR (INCLUDING HERNIA),227,"HERNIA PROCEDURES EXCEPT INGUINAL, FEMORAL & UMBILICAL",06,DISEASES AND DISORDERS OF THE DIGESTIVE SYSTEM,2,Moderate,Minor,Surgical,Medicare,Medicare,Self-Pay,,,false,108287.15,33534.71
Finger Lakes,Monroe,2701003,000411,Rochester General Hospital,30 to 49,144,F,White,Not Span/Hispanic,5,Elective,Home w/ Home Health Services,2018,DIG010,ABDOMINAL HERNIA,GIS022,GI SYSTEM LYSIS OF ADHESIONS,227,"HERNIA PROCEDURES EXCEPT INGUINAL, FEMORAL & UMBILICAL",06,DISEASES AND DISORDERS OF THE DIGESTIVE SYSTEM,3,Major,Moderate,Surgical,Medicare,Medicaid,,,,false,19961.25,9225.55
Hudson Valley,Orange,3529000,000704,St Anthony Community Hospital,70 or Older,109,M,White,Not Span/Hispanic,8,Elective,Home or Self Care,2018,DIG010,ABDOMINAL HERNIA,GNR002,ABDOMINAL WALL REPAIR (INCLUDING HERNIA),227,"HERNIA PROCEDURES EXCEPT INGUINAL, FEMORAL & UMBILICAL",06,DISEASES AND DISORDERS OF THE DIGESTIVE SYSTEM,3,Major,Moderate,Surgical,Medicare,Blue Cross/Blue Shield,,,,false,153322.73,29678
Hudson Valley,Westchester,5907001,001097,SJRH - St Johns Division,70 or Older,104,F,White,Not Span/Hispanic,2,Emergency,Home or Self Care,2018,DIG010,ABDOMINAL HERNIA,GNR002,ABDOMINAL WALL REPAIR (INCLUDING HERNIA),227,"HERNIA PROCEDURES EXCEPT INGUINAL, FEMORAL & UMBILICAL",06,DISEASES AND DISORDERS OF THE DIGESTIVE SYSTEM,1,Minor,Minor,Surgical,Medicare,Medicare,,,,false,42180.54,30986.35
Western NY,Erie,1401014,000207,Buffalo General Medical Center,70 or Older,140,M,White,Not Span/Hispanic,3,Elective,Home or Self Care,2018,DIG010,ABDOMINAL HERNIA,GNR002,ABDOMINAL WALL REPAIR (INCLUDING HERNIA),227,"HERNIA PROCEDURES EXCEPT INGUINAL, FEMORAL & UMBILICAL",06,DISEASES AND DISORDERS OF THE DIGESTIVE SYSTEM,3,Major,Major,Surgical,Medicare,Self-Pay,,,,false,59971.79,17918.99
New York City,Bronx,7000008,001172,Lincoln Medical & Mental Health Center,50 to 69,104,M,Other Race,Spanish/Hispanic,1,Elective,Home or Self Care,2018,DIG010,ABDOMINAL HERNIA,GNR002,ABDOMINAL WALL REPAIR (INCLUDING HERNIA),227,"HERNIA PROCEDURES EXCEPT INGUINAL, FEMORAL & UMBILICAL",06,DISEASES AND DISORDERS OF THE DIGESTIVE SYSTEM,1,Minor,Minor,Surgical,Medicaid,,,,,false,14875.81,8785.01
New York City,Bronx,7000006,003058,Montefiore Med Center - Jack D Weiler Hosp of A Einstein College Div,30 to 49,104,M,Other Race,Spanish/Hispanic,2,Emergency,Home or Self Care,2018,DIG010,ABDOMINAL HERNIA,GNR002,ABDOMINAL WALL REPAIR (INCLUDING HERNIA),227,"HERNIA PROCEDURES EXCEPT INGUINAL, FEMORAL & UMBILICAL",06,DISEASES AND DISORDERS OF THE DIGESTIVE SYSTEM,1,Minor,Minor,Surgical,Private Health Insurance,,,,,false,40691.23,8783.73
Hudson Valley,Dutchess,1302001,000181,Vassar Brothers Medical Center,70 or Older,125,M,White,Not Span/Hispanic,4,Emergency,Skilled Nursing Home,2018,DIG009,APPENDICITIS AND OTHER APPENDICEAL CONDITIONS,GIS008,APPENDECTOMY,227,"HERNIA PROCEDURES EXCEPT INGUINAL, FEMORAL & UMBILICAL",06,DISEASES AND DISORDERS OF THE DIGESTIVE SYSTEM,2,Moderate,Minor,Surgical,Medicare,,,,,true,39311.75,11356.54
Central NY,Onondaga,3301003,000630,St. Joseph's Hospital Health Center,50 to 69,130,F,White,Not Span/Hispanic,4,Elective,Home w/ Home Health Services,2018,DIG010,ABDOMINAL HERNIA,GNR002,ABDOMINAL WALL REPAIR (INCLUDING HERNIA),227,"HERNIA PROCEDURES EXCEPT INGUINAL, FEMORAL & UMBILICAL",06,DISEASES AND DISORDERS OF THE DIGESTIVE SYSTEM,2,Moderate,Minor,Surgical,Medicare,Blue Cross/Blue Shield,,,,false,34721.57,15108.6
New York City,Kings,7001021,001306,New York - Presbyterian Brooklyn Methodist Hospital,50 to 69,112,M,Black/African American,Not Span/Hispanic,2,Emergency,Home or Self Care,2018,DIG010,ABDOMINAL HERNIA,GIS022,GI SYSTEM LYSIS OF ADHESIONS,227,"HERNIA PROCEDURES EXCEPT INGUINAL, FEMORAL & UMBILICAL",06,DISEASES AND DISORDERS OF THE DIGESTIVE SYSTEM,1,Minor,Minor,Surgical,Private Health Insurance,,,,,true,27522.43,10290.36
Long Island,Suffolk,5155000,000938,Peconic Bay Medical Center,30 to 49,119,F,White,Spanish/Hispanic,3,Elective,Home or Self Care,2018,DIG010,ABDOMINAL HERNIA,GNR002,ABDOMINAL WALL REPAIR (INCLUDING HERNIA),227,"HERNIA PROCEDURES EXCEPT INGUINAL, FEMORAL & UMBILICAL",06,DISEASES AND DISORDERS OF THE DIGESTIVE SYSTEM,2,Moderate,Minor,Surgical,Medicare,Medicaid,Medicaid,,,false,38003.75,7574.24
Central NY,Oswego,3702000,000727,Oswego Hospital,30 to 49,130,M,White,Not Span/Hispanic,6,Elective,Home or Self Care,2018,DIG010,ABDOMINAL HERNIA,GNR002,ABDOMINAL WALL REPAIR (INCLUDING HERNIA),227,"HERNIA PROCEDURES EXCEPT INGUINAL, FEMORAL & UMBILICAL",06,DISEASES AND DISORDERS OF THE DIGESTIVE SYSTEM,2,Moderate,Minor,Surgical,Blue Cross/Blue Shield,,,,,false,72511.21,41577.3
Long Island,Nassau,2951001,000541,North Shore University Hospital,50 to 69,115,M,White,Not Span/Hispanic,4,Urgent,Home or Self Care,2018,DIG010,ABDOMINAL HERNIA,GNR002,ABDOMINAL WALL REPAIR (INCLUDING HERNIA),227,"HERNIA PROCEDURES EXCEPT INGUINAL, FEMORAL & UMBILICAL",06,DISEASES AND DISORDERS OF THE DIGESTIVE SYSTEM,2,Moderate,Minor,Surgical,Medicaid,Medicaid,,,,false,59754.19,14004.02
Finger Lakes,Monroe,2701003,000411,Rochester General Hospital,50 to 69,146,M,White,Not Span/Hispanic,7,Elective,Home or Self Care,2018,DIG010,ABDOMINAL HERNIA,GNR002,ABDOMINAL WALL REPAIR (INCLUDING HERNIA),227,"HERNIA PROCEDURES EXCEPT INGUINAL, FEMORAL & UMBILICAL",06,DISEASES AND DISORDERS OF THE DIGESTIVE SYSTEM,2,Moderate,Minor,Surgical,Medicare,Medicaid,,,,false,57838.95,20236.93
Finger Lakes,Monroe,2701003,000411,Rochester General Hospital,50 to 69,146,F,White,Not Span/Hispanic,2,Elective,Home or Self Care,2018,DIG010,ABDOMINAL HERNIA,GNR002,ABDOMINAL WALL REPAIR (INCLUDING HERNIA),227,"HERNIA PROCEDURES EXCEPT INGUINAL, FEMORAL & UMBILICAL",06,DISEASES AND DISORDERS OF THE DIGESTIVE SYSTEM,2,Moderate,Minor,Surgical,Medicare,Blue Cross/Blue Shield,,,,false,15665.95,6265.13
Long Island,Nassau,2952005,000552,Plainview Hospital,50 to 69,118,M,White,Not Span/Hispanic,2,Emergency,Home or Self Care,2018,DIG009,APPENDICITIS AND OTHER APPENDICEAL CONDITIONS,GIS008,APPENDECTOMY,227,"HERNIA PROCEDURES EXCEPT INGUINAL, FEMORAL & UMBILICAL",06,DISEASES AND DISORDERS OF THE DIGESTIVE SYSTEM,1,Minor,Minor,Surgical,Blue Cross/Blue Shield,,,,,true,27346.17,12091.73
Capital/Adirond,Warren,5601000,001005,Glens Falls Hospital,50 to 69,128,M,White,Not Span/Hispanic,23,Elective,Home w/ Home Health Services,2018,DIG010,ABDOMINAL HERNIA,GNR002,ABDOMINAL WALL REPAIR (INCLUDING HERNIA),227,"HERNIA PROCEDURES EXCEPT INGUINAL, FEMORAL & UMBILICAL",06,DISEASES AND DISORDERS OF THE DIGESTIVE SYSTEM,2,Moderate,Minor,Surgical,Medicare,Blue Cross/Blue Shield,,,,false,153597.61,69512.13
New York City,Manhattan,7002017,001450,Lenox Hill Hospital,50 to 69,OOS,M,Black/African American,Not Span/Hispanic,5,Emergency,Home or Self Care,2018,DIG012,INTESTINAL OBSTRUCTION AND ILEUS,GIS022,GI SYSTEM LYSIS OF ADHESIONS,227,"HERNIA PROCEDURES EXCEPT INGUINAL, FEMORAL & UMBILICAL",06,DISEASES AND DISORDERS OF THE DIGESTIVE SYSTEM,4,Extreme,Major,Surgical,Blue Cross/Blue Shield,,,,,true,106912.22,21931.12
Hudson Valley,Westchester,5957001,001139,Westchester Medical Center,70 or Older,,M,Other Race,Unknown,5,Elective,Home or Self Care,2018,DIG010,ABDOMINAL HERNIA,GIS022,GI SYSTEM LYSIS OF ADHESIONS,227,"HERNIA PROCEDURES EXCEPT INGUINAL, FEMORAL & UMBILICAL",06,DISEASES AND DISORDERS OF THE DIGESTIVE SYSTEM,2,Moderate,Minor,Surgical,Medicare,Private Health Insurance,,,,false,190945.36,36283.4
Finger Lakes,Monroe,2701005,000413,Strong Memorial Hospital,70 or Older,145,M,White,Not Span/Hispanic,3,Elective,Home or Self Care,2018,DIG010,ABDOMINAL HERNIA,GNR002,ABDOMINAL WALL REPAIR (INCLUDING HERNIA),227,"HERNIA PROCEDURES EXCEPT INGUINAL, FEMORAL & UMBILICAL",06,DISEASES AND DISORDERS OF THE DIGESTIVE SYSTEM,1,Minor,Minor,Surgical,Medicare,Medicare,Self-Pay,,,false,18957.28,10230.6
Long Island,Nassau,2952005,000552,Plainview Hospital,50 to 69,118,F,White,Not Span/Hispanic,3,Urgent,Home or Self Care,2018,DIG010,ABDOMINAL HERNIA,GNR002,ABDOMINAL WALL REPAIR (INCLUDING HERNIA),227,"HERNIA PROCEDURES EXCEPT INGUINAL, FEMORAL & UMBILICAL",06,DISEASES AND DISORDERS OF THE DIGESTIVE SYSTEM,2,Moderate,Minor,Surgical,Blue Cross/Blue Shield,,,,,false,32045.51,15487.99
New York City,Manhattan,7002054,001464,New York-Presbyterian Hospital - Columbia Presbyterian Center,30 to 49,105,F,White,Not Span/Hispanic,4,Urgent,Home w/ Home Health Services,2018,DIG010,ABDOMINAL HERNIA,FRS001,HYSTERECTOMY,227,"HERNIA PROCEDURES EXCEPT INGUINAL, FEMORAL & UMBILICAL",06,DISEASES AND DISORDERS OF THE DIGESTIVE SYSTEM,2,Moderate,Minor,Surgical,Private Health Insurance,Medicaid,Self-Pay,,,false,87358.38,22946.86
New York City,Bronx,7000006,001169,Montefiore Medical Center - Henry & Lucy Moses Div,50 to 69,108,M,Other Race,Not Span/Hispanic,2,Elective,Home or Self Care,2018,DIG010,ABDOMINAL HERNIA,GNR002,ABDOMINAL WALL REPAIR (INCLUDING HERNIA),227,"HERNIA PROCEDURES EXCEPT INGUINAL, FEMORAL & UMBILICAL",06,DISEASES AND DISORDERS OF THE DIGESTIVE SYSTEM,3,Major,Minor,Surgical,Medicare,Medicaid,,,,false,67668.32,14100.77
Central NY,Onondaga,3301003,000630,St. Joseph's Hospital Health Center,30 to 49,130,F,White,Not Span/Hispanic,8,Elective,Home or Self Care,2018,DIG010,ABDOMINAL HERNIA,GNR002,ABDOMINAL WALL REPAIR (INCLUDING HERNIA),227,"HERNIA PROCEDURES EXCEPT INGUINAL, FEMORAL & UMBILICAL",06,DISEASES AND DISORDERS OF THE DIGESTIVE SYSTEM,2,Moderate,Minor,Surgical,Medicaid,,,,,false,52462.3,20019.67
Capital/Adirond,Albany,0101004,000005,St. Peter's Hospital,30 to 49,121,F,Black/African American,Not Span/Hispanic,3,Elective,Home or Self Care,2018,DIG010,ABDOMINAL HERNIA,GNR002,ABDOMINAL WALL REPAIR (INCLUDING HERNIA),227,"HERNIA PROCEDURES EXCEPT INGUINAL, FEMORAL & UMBILICAL",06,DISEASES AND DISORDERS OF THE DIGESTIVE SYSTEM,1,Minor,Minor,Surgical,Blue Cross/Blue Shield,,,,,false,42776.2,18339.71
New York City,Manhattan,7002054,001464,New York-Presbyterian Hospital - Columbia Presbyterian Center,30 to 49,114,F,Black/African American,Spanish/Hispanic,5,Emergency,Home or Self Care,2018,DIG010,ABDOMINAL HERNIA,GNR002,ABDOMINAL WALL REPAIR (INCLUDING HERNIA),227,"HERNIA PROCEDURES EXCEPT INGUINAL, FEMORAL & UMBILICAL",06,DISEASES AND DISORDERS OF THE DIGESTIVE SYSTEM,2,Moderate,Minor,Surgical,Medicare,Medicaid,Self-Pay,,,false,80068.81,19803.97
Long Island,Suffolk,5149000,000895,John T Mather Memorial Hospital of Port Jefferson New York Inc,70 or Older,117,M,White,Not Span/Hispanic,1,Elective,Home or Self Care,2018,DIG010,ABDOMINAL HERNIA,GNR002,ABDOMINAL WALL REPAIR (INCLUDING HERNIA),227,"HERNIA PROCEDURES EXCEPT INGUINAL, FEMORAL & UMBILICAL",06,DISEASES AND DISORDERS OF THE DIGESTIVE SYSTEM,2,Moderate,Minor,Surgical,Medicare,Medicare,Private Health Insurance,,,false,41352.06,8805.59
Capital/Adirond,Rensselaer,4102002,000756,Samaritan Hospital,50 to 69,121,F,White,Not Span/Hispanic,2,Emergency,Home or Self Care,2018,DIG009,APPENDICITIS AND OTHER APPENDICEAL CONDITIONS,GIS008,APPENDECTOMY,227,"HERNIA PROCEDURES EXCEPT INGUINAL, FEMORAL & UMBILICAL",06,DISEASES AND DISORDERS OF THE DIGESTIVE SYSTEM,2,Moderate,Minor,Surgical,Medicare,Medicaid,,,,true,22061.46,6446.24
New York City,Manhattan,7002017,001450,Lenox Hill Hospital,18 to 29,100,M,White,Unknown,1,Emergency,Home or Self Care,2018,DIG009,APPENDICITIS AND OTHER APPENDICEAL CONDITIONS,GIS008,APPENDECTOMY,227,"HERNIA PROCEDURES EXCEPT INGUINAL, FEMORAL & UMBILICAL",06,DISEASES AND DISORDERS OF THE DIGESTIVE SYSTEM,1,Minor,Minor,Surgical,Blue Cross/Blue Shield,,,,,true,36904.89,8518.6
New York City,Manhattan,7002053,001463,NYU Langone Hospitals,18 to 29,100,M,White,Not Span/Hispanic,7,Emergency,Home or Self Care,2018,DIG012,INTESTINAL OBSTRUCTION AND ILEUS,GNR002,ABDOMINAL WALL REPAIR (INCLUDING HERNIA),227,"HERNIA PROCEDURES EXCEPT INGUINAL, FEMORAL & UMBILICAL",06,DISEASES AND DISORDERS OF THE DIGESTIVE SYSTEM,2,Moderate,Minor,Surgical,Blue Cross/Blue Shield,,,,,true,137543.86,37075.68
Western NY,Erie,1401005,000210,Erie County Medical Center,50 to 69,143,M,White,Not Span/Hispanic,8,Elective,Home w/ Home Health Services,2018,DIG010,ABDOMINAL HERNIA,GNR002,ABDOMINAL WALL REPAIR (INCLUDING HERNIA),227,"HERNIA PROCEDURES EXCEPT INGUINAL, FEMORAL & UMBILICAL",06,DISEASES AND DISORDERS OF THE DIGESTIVE SYSTEM,2,Moderate,Minor,Surgical,Medicaid,Medicaid,,,,false,64373.75,38304.67
New York City,Manhattan,7002054,001464,New York-Presbyterian Hospital - Columbia Presbyterian Center,50 to 69,100,M,Multi-racial,Spanish/Hispanic,8,Elective,Home w/ Home Health Services,2018,DIG010,ABDOMINAL HERNIA,GNR002,ABDOMINAL WALL REPAIR (INCLUDING HERNIA),227,"HERNIA PROCEDURES EXCEPT INGUINAL, FEMORAL & UMBILICAL",06,DISEASES AND DISORDERS OF THE DIGESTIVE SYSTEM,3,Major,Major,Surgical,Medicaid,Medicaid,Self-Pay,,,false,216626.32,87222.12
New York City,Manhattan,7002054,001464,New York-Presbyterian Hospital - Columbia Presbyterian Center,50 to 69,104,M,White,Not Span/Hispanic,4,Urgent,Home w/ Home Health Services,2018,DIG010,ABDOMINAL HERNIA,GNR002,ABDOMINAL WALL REPAIR (INCLUDING HERNIA),227,"HERNIA PROCEDURES EXCEPT INGUINAL, FEMORAL & UMBILICAL",06,DISEASES AND DISORDERS OF THE DIGESTIVE SYSTEM,2,Moderate,Minor,Surgical,Medicare,Blue Cross/Blue Shield,Self-Pay,,,false,73995.27,21222.22
Western NY,Erie,1401008,000213,Mercy Hospital of Buffalo,50 to 69,142,M,White,Not Span/Hispanic,4,Emergency,Home or Self Care,2018,DIG010,ABDOMINAL HERNIA,GNR002,ABDOMINAL WALL REPAIR (INCLUDING HERNIA),227,"HERNIA PROCEDURES EXCEPT INGUINAL, FEMORAL & UMBILICAL",06,DISEASES AND DISORDERS OF THE DIGESTIVE SYSTEM,2,Moderate,Minor,Surgical,Blue Cross/Blue Shield,,,,,true,19916.91,9278.04
Western NY,Erie,1401008,000213,Mercy Hospital of Buffalo,70 or Older,142,F,White,Not Span/Hispanic,10,Emergency,Home or Self Care,2018,DIG024,POSTPROCEDURAL OR POSTOPERATIVE DIGESTIVE SYSTEM COMPLICATION,GIS022,GI SYSTEM LYSIS OF ADHESIONS,227,"HERNIA PROCEDURES EXCEPT INGUINAL, FEMORAL & UMBILICAL",06,DISEASES AND DISORDERS OF THE DIGESTIVE SYSTEM,3,Major,Moderate,Surgical,Medicare,Medicare,,,,true,33161.89,14323.81
Western NY,Erie,1401008,000213,Mercy Hospital of Buffalo,70 or Older,140,M,White,Not Span/Hispanic,17,Emergency,Home w/ Home Health Services,2018,DIG025,OTHER SPECIFIED AND UNSPECIFIED GASTROINTESTINAL DISORDERS,GIS021,GI SYSTEM REPAIR (EXCLUDING ANORECTAL),227,"HERNIA PROCEDURES EXCEPT INGUINAL, FEMORAL & UMBILICAL",06,DISEASES AND DISORDERS OF THE DIGESTIVE SYSTEM,3,Major,Moderate,Surgical,Medicare,Medicare,,,,true,61931.79,28718.28
New York City,Manhattan,7002054,001464,New York-Presbyterian Hospital - Columbia Presbyterian Center,70 or Older,104,F,White,Not Span/Hispanic,2,Elective,Home w/ Home Health Services,2018,DIG010,ABDOMINAL HERNIA,GNR002,ABDOMINAL WALL REPAIR (INCLUDING HERNIA),227,"HERNIA PROCEDURES EXCEPT INGUINAL, FEMORAL & UMBILICAL",06,DISEASES AND DISORDERS OF THE DIGESTIVE SYSTEM,2,Moderate,Minor,Surgical,Medicare,Medicare,Medicaid,,,false,51166.9,13897.11
Central NY,Madison,2601001,000397,Oneida Health Hospital,70 or Older,134,F,White,Not Span/Hispanic,4,Emergency,Home or Self Care,2018,DIG010,ABDOMINAL HERNIA,GNR002,ABDOMINAL WALL REPAIR (INCLUDING HERNIA),227,"HERNIA PROCEDURES EXCEPT INGUINAL, FEMORAL & UMBILICAL",06,DISEASES AND DISORDERS OF THE DIGESTIVE SYSTEM,1,Minor,Minor,Surgical,Medicare,Medicare,Federal/State/Local/VA,,,true,18881.53,7894.74
New York City,Kings,7001016,001301,Kings County Hospital Center,70 or Older,112,F,Black/African American,Not Span/Hispanic,5,Emergency,Home or Self Care,2018,DIG010,ABDOMINAL HERNIA,GNR002,ABDOMINAL WALL REPAIR (INCLUDING HERNIA),227,"HERNIA PROCEDURES EXCEPT INGUINAL, FEMORAL & UMBILICAL",06,DISEASES AND DISORDERS OF THE DIGESTIVE SYSTEM,1,Minor,Minor,Surgical,Medicaid,,,,,true,39637.68,28157.06
Long Island,Suffolk,5151001,000245,Stony Brook University Hospital,50 to 69,117,F,White,Not Span/Hispanic,7,Emergency,Home w/ Home Health Services,2018,DIG010,ABDOMINAL HERNIA,GNR002,ABDOMINAL WALL REPAIR (INCLUDING HERNIA),227,"HERNIA PROCEDURES EXCEPT INGUINAL, FEMORAL & UMBILICAL",06,DISEASES AND DISORDERS OF THE DIGESTIVE SYSTEM,2,Moderate,Moderate,Surgical,Private Health Insurance,,,,,true,87362.09,32102.11
New York City,Manhattan,7002017,001450,Lenox Hill Hospital,18 to 29,100,M,White,Not Span/Hispanic,1,Emergency,Home or Self Care,2018,DIG009,APPENDICITIS AND OTHER APPENDICEAL CONDITIONS,GIS008,APPENDECTOMY,227,"HERNIA PROCEDURES EXCEPT INGUINAL, FEMORAL & UMBILICAL",06,DISEASES AND DISORDERS OF THE DIGESTIVE SYSTEM,1,Minor,Minor,Surgical,Medicaid,Medicaid,,,,true,36580.57,8023.34
New York City,Queens,7003004,001630,Long Island Jewish Medical Center,70 or Older,114,M,Other Race,Not Span/Hispanic,3,Elective,Home or Self Care,2018,DIG010,ABDOMINAL HERNIA,GIS022,GI SYSTEM LYSIS OF ADHESIONS,227,"HERNIA PROCEDURES EXCEPT INGUINAL, FEMORAL & UMBILICAL",06,DISEASES AND DISORDERS OF THE DIGESTIVE SYSTEM,2,Moderate,Minor,Surgical,Medicare,Medicare,Self-Pay,,,false,47305.1,10084.32
New York City,Bronx,7000008,001172,Lincoln Medical & Mental Health Center,50 to 69,104,F,Other Race,Spanish/Hispanic,7,Emergency,Home or Self Care,2018,DIG010,ABDOMINAL HERNIA,GNR002,ABDOMINAL WALL REPAIR (INCLUDING HERNIA),227,"HERNIA PROCEDURES EXCEPT INGUINAL, FEMORAL & UMBILICAL",06,DISEASES AND DISORDERS OF THE DIGESTIVE SYSTEM,3,Major,Moderate,Surgical,Medicaid,Medicaid,,,,true,38273.19,22602.5
New York City,Bronx,7000008,001172,Lincoln Medical & Mental Health Center,50 to 69,104,M,Other Race,Spanish/Hispanic,2,Emergency,Home or Self Care,2018,DIG010,ABDOMINAL HERNIA,GNR002,ABDOMINAL WALL REPAIR (INCLUDING HERNIA),227,"HERNIA PROCEDURES EXCEPT INGUINAL, FEMORAL & UMBILICAL",06,DISEASES AND DISORDERS OF THE DIGESTIVE SYSTEM,1,Minor,Minor,Surgical,Blue Cross/Blue Shield,,,,,true,17806.87,10515.97
Long Island,Nassau,2951001,000541,North Shore University Hospital,50 to 69,116,F,Black/African American,Not Span/Hispanic,2,Elective,Home w/ Home Health Services,2018,DIG010,ABDOMINAL HERNIA,GNR002,ABDOMINAL WALL REPAIR (INCLUDING HERNIA),227,"HERNIA PROCEDURES EXCEPT INGUINAL, FEMORAL & UMBILICAL",06,DISEASES AND DISORDERS OF THE DIGESTIVE SYSTEM,1,Minor,Minor,Surgical,Medicare,Medicaid,,,,false,38162.27,9717.79
Long Island,Nassau,2951001,000541,North Shore University Hospital,18 to 29,113,M,White,Not Span/Hispanic,1,Emergency,Home or Self Care,2018,DIG010,ABDOMINAL HERNIA,GNR002,ABDOMINAL WALL REPAIR (INCLUDING HERNIA),227,"HERNIA PROCEDURES EXCEPT INGUINAL, FEMORAL & UMBILICAL",06,DISEASES AND DISORDERS OF THE DIGESTIVE SYSTEM,1,Minor,Minor,Surgical,Private Health Insurance,,,,,true,37122.71,8079.06
Hudson Valley,Westchester,5902001,001045,White Plains Hospital Center,50 to 69,107,F,Other Race,Not Span/Hispanic,3,Emergency,Home or Self Care,2018,DIG010,ABDOMINAL HERNIA,GNR002,ABDOMINAL WALL REPAIR (INCLUDING HERNIA),227,"HERNIA PROCEDURES EXCEPT INGUINAL, FEMORAL & UMBILICAL",06,DISEASES AND DISORDERS OF THE DIGESTIVE SYSTEM,1,Minor,Minor,Surgical,Blue Cross/Blue Shield,,,,,true,55409,12220.01
Long Island,Nassau,2909000,000513,Mercy Hospital,70 or Older,115,F,White,Not Span/Hispanic,4,Elective,Home w/ Home Health Services,2018,DIG010,ABDOMINAL HERNIA,GNR002,ABDOMINAL WALL REPAIR (INCLUDING HERNIA),227,"HERNIA PROCEDURES EXCEPT INGUINAL, FEMORAL & UMBILICAL",06,DISEASES AND DISORDERS OF THE DIGESTIVE SYSTEM,2,Moderate,Moderate,Surgical,Medicare,Blue Cross/Blue Shield,,,,false,45454.36,11308.08
Long Island,Nassau,2951001,000541,North Shore University Hospital,30 to 49,100,M,White,Not Span/Hispanic,2,Urgent,Home or Self Care,2018,DIG010,ABDOMINAL HERNIA,GNR002,ABDOMINAL WALL REPAIR (INCLUDING HERNIA),227,"HERNIA PROCEDURES EXCEPT INGUINAL, FEMORAL & UMBILICAL",06,DISEASES AND DISORDERS OF THE DIGESTIVE SYSTEM,1,Minor,Minor,Surgical,Private Health Insurance,,,,,false,47232.2,12974.45
Finger Lakes,Monroe,2701001,000409,Highland Hospital,50 to 69,146,M,White,Not Span/Hispanic,4,Elective,Home or Self Care,2018,DIG010,ABDOMINAL HERNIA,GNR002,ABDOMINAL WALL REPAIR (INCLUDING HERNIA),227,"HERNIA PROCEDURES EXCEPT INGUINAL, FEMORAL & UMBILICAL",06,DISEASES AND DISORDERS OF THE DIGESTIVE SYSTEM,1,Minor,Minor,Surgical,Medicaid,,,,,false,34567.72,14794.89
New York City,Manhattan,7002020,001453,Memorial Hospital for Cancer and Allied Diseases,50 to 69,117,M,White,Not Span/Hispanic,1,Elective,Home or Self Care,2018,DIG010,ABDOMINAL HERNIA,GNR002,ABDOMINAL WALL REPAIR (INCLUDING HERNIA),227,"HERNIA PROCEDURES EXCEPT INGUINAL, FEMORAL & UMBILICAL",06,DISEASES AND DISORDERS OF THE DIGESTIVE SYSTEM,3,Major,Moderate,Surgical,Medicare,Private Health Insurance,,,,false,23155.8,10337.09
New York City,Manhattan,7002017,001450,Lenox Hill Hospital,30 to 49,100,M,White,Not Span/Hispanic,2,Emergency,Home or Self Care,2018,DIG010,ABDOMINAL HERNIA,GNR003,INGUINAL AND FEMORAL HERNIA REPAIR,227,"HERNIA PROCEDURES EXCEPT INGUINAL, FEMORAL & UMBILICAL",06,DISEASES AND DISORDERS OF THE DIGESTIVE SYSTEM,2,Moderate,Minor,Surgical,Medicaid,,,,,true,52594.49,12168.93
New York City,Manhattan,7002053,001463,NYU Langone Hospitals,30 to 49,OOS,F,Other Race,Spanish/Hispanic,14,Urgent,Home w/ Home Health Services,2018,DIG010,ABDOMINAL HERNIA,GNR002,ABDOMINAL WALL REPAIR (INCLUDING HERNIA),227,"HERNIA PROCEDURES EXCEPT INGUINAL, FEMORAL & UMBILICAL",06,DISEASES AND DISORDERS OF THE DIGESTIVE SYSTEM,3,Major,Minor,Surgical,Medicare,,,,,false,462239.81,103286.64