Hospital Service Area,Hospital County,Operating Certificate Number,Permanent Facility Id,Facility Name,Age Group,Zip Code - 3 digits,Gender,Race,Ethnicity,Length of Stay,Type of Admission,Patient Disposition,Discharge Year,CCS Diagnosis Code,CCS Diagnosis Description,CCS Procedure Code,CCS Procedure Description,APR DRG Code,APR DRG Description,APR MDC Code,APR MDC Description,APR Severity of Illness Code,APR Severity of Illness Description,APR Risk of Mortality,APR Medical Surgical Description,Payment Typology 1,Payment Typology 2,Payment Typology 3,Birth Weight,Abortion Edit Indicator,Emergency Department Indicator,Total Charges,Total Costs
Long Island,Nassau,2908000,000511,NYU Langone Hospital-Long Island,30 to 49,118,F,White,Not Span/Hispanic,1,Elective,Home or Self Care,2020,DIG010,ABDOMINAL HERNIA,GNR002,ABDOMINAL WALL REPAIR (INCLUDING HERNIA),227,"HERNIA PROCEDURES EXCEPT INGUINAL, FEMORAL & UMBILICAL",06,DISEASES AND DISORDERS OF THE DIGESTIVE SYSTEM,1,Minor,Minor,Surgical,Private Health Insurance,,,,,N,66553.23,11078.25
Long Island,Nassau,2908000,000511,NYU Langone Hospital-Long Island,70 or Older,117,F,White,Not Span/Hispanic,9,Emergency,Skilled Nursing Home,2020,DIG010,ABDOMINAL HERNIA,GNR002,ABDOMINAL WALL REPAIR (INCLUDING HERNIA),227,"HERNIA PROCEDURES EXCEPT INGUINAL, FEMORAL & UMBILICAL",06,DISEASES AND DISORDERS OF THE DIGESTIVE SYSTEM,3,Major,Major,Surgical,Medicare,Blue Cross/Blue Shield,,,,Y,217051,45519.33
Long Island,Nassau,2908000,000511,NYU Langone Hospital-Long Island,50 to 69,115,M,White,Not Span/Hispanic,5,Emergency,Home or Self Care,2020,DIG010,ABDOMINAL HERNIA,GNR002,ABDOMINAL WALL REPAIR (INCLUDING HERNIA),227,"HERNIA PROCEDURES EXCEPT INGUINAL, FEMORAL & UMBILICAL",06,DISEASES AND DISORDERS OF THE DIGESTIVE SYSTEM,2,Moderate,Moderate,Surgical,Medicaid,,,,,Y,294112.68,50598.6
Long Island,Nassau,2908000,000511,NYU Langone Hospital-Long Island,30 to 49,117,M,Other Race,Spanish/Hispanic,4,Emergency,Home or Self Care,2020,DIG010,ABDOMINAL HERNIA,GIS022,GI SYSTEM LYSIS OF ADHESIONS,227,"HERNIA PROCEDURES EXCEPT INGUINAL, FEMORAL & UMBILICAL",06,DISEASES AND DISORDERS OF THE DIGESTIVE SYSTEM,2,Moderate,Minor,Surgical,Blue Cross/Blue Shield,,,,,Y,187600.19,32373.01
Long Island,Nassau,2908000,000511,NYU Langone Hospital-Long Island,30 to 49,115,M,Other Race,Not Span/Hispanic,2,Emergency,Home or Self Care,2020,DIG010,ABDOMINAL HERNIA,GNR002,ABDOMINAL WALL REPAIR (INCLUDING HERNIA),227,"HERNIA PROCEDURES EXCEPT INGUINAL, FEMORAL & UMBILICAL",06,DISEASES AND DISORDERS OF THE DIGESTIVE SYSTEM,1,Minor,Minor,Surgical,Self-Pay,,,,,Y,70040.47,14099.15
Long Island,Nassau,2908000,000511,NYU Langone Hospital-Long Island,50 to 69,117,F,Other Race,Spanish/Hispanic,3,Elective,Home w/ Home Health Services,2020,DIG010,ABDOMINAL HERNIA,GNR002,ABDOMINAL WALL REPAIR (INCLUDING HERNIA),227,"HERNIA PROCEDURES EXCEPT INGUINAL, FEMORAL & UMBILICAL",06,DISEASES AND DISORDERS OF THE DIGESTIVE SYSTEM,2,Moderate,Minor,Surgical,Blue Cross/Blue Shield,,,,,N,95008.68,19028.58
Long Island,Nassau,2908000,000511,NYU Langone Hospital-Long Island,50 to 69,117,F,White,Not Span/Hispanic,2,Emergency,Home or Self Care,2020,DIG010,ABDOMINAL HERNIA,GNR002,ABDOMINAL WALL REPAIR (INCLUDING HERNIA),227,"HERNIA PROCEDURES EXCEPT INGUINAL, FEMORAL & UMBILICAL",06,DISEASES AND DISORDERS OF THE DIGESTIVE SYSTEM,2,Moderate,Minor,Surgical,Medicaid,,,,,Y,94434.95,15688.87
Long Island,Nassau,2908000,000511,NYU Langone Hospital-Long Island,50 to 69,115,M,White,Not Span/Hispanic,2,Emergency,Home or Self Care,2020,DIG012,INTESTINAL OBSTRUCTION AND ILEUS,GIS022,GI SYSTEM LYSIS OF ADHESIONS,227,"HERNIA PROCEDURES EXCEPT INGUINAL, FEMORAL & UMBILICAL",06,DISEASES AND DISORDERS OF THE DIGESTIVE SYSTEM,2,Moderate,Minor,Surgical,Medicare,Medicare,,,,Y,86444.37,15910.63
Long Island,Nassau,2908000,000511,NYU Langone Hospital-Long Island,50 to 69,117,M,White,Not Span/Hispanic,16,Emergency,Home or Self Care,2020,DIG010,ABDOMINAL HERNIA,GNR002,ABDOMINAL WALL REPAIR (INCLUDING HERNIA),227,"HERNIA PROCEDURES EXCEPT INGUINAL, FEMORAL & UMBILICAL",06,DISEASES AND DISORDERS OF THE DIGESTIVE SYSTEM,3,Major,Moderate,Surgical,Medicare,Medicare,,,,Y,347389.93,71211.94
Long Island,Nassau,2908000,000511,NYU Langone Hospital-Long Island,50 to 69,115,M,White,Not Span/Hispanic,2,Emergency,Home or Self Care,2020,DIG012,INTESTINAL OBSTRUCTION AND ILEUS,GNR002,ABDOMINAL WALL REPAIR (INCLUDING HERNIA),227,"HERNIA PROCEDURES EXCEPT INGUINAL, FEMORAL & UMBILICAL",06,DISEASES AND DISORDERS OF THE DIGESTIVE SYSTEM,2,Moderate,Minor,Surgical,Blue Cross/Blue Shield,Medicare,,,,Y,195485.49,30707.24
Long Island,Nassau,2908000,000511,NYU Langone Hospital-Long Island,30 to 49,OOS,F,White,Not Span/Hispanic,4,Emergency,Home or Self Care,2020,DIG010,ABDOMINAL HERNIA,GNR002,ABDOMINAL WALL REPAIR (INCLUDING HERNIA),227,"HERNIA PROCEDURES EXCEPT INGUINAL, FEMORAL & UMBILICAL",06,DISEASES AND DISORDERS OF THE DIGESTIVE SYSTEM,2,Moderate,Minor,Surgical,Blue Cross/Blue Shield,,,,,Y,89151.3,20093.97
Long Island,Nassau,2908000,000511,NYU Langone Hospital-Long Island,50 to 69,110,F,Other Race,Not Span/Hispanic,6,Emergency,Home or Self Care,2020,DIG010,ABDOMINAL HERNIA,GNR002,ABDOMINAL WALL REPAIR (INCLUDING HERNIA),227,"HERNIA PROCEDURES EXCEPT INGUINAL, FEMORAL & UMBILICAL",06,DISEASES AND DISORDERS OF THE DIGESTIVE SYSTEM,3,Major,Moderate,Surgical,Private Health Insurance,,,,,Y,224040.08,41326.14
Long Island,Nassau,2908000,000511,NYU Langone Hospital-Long Island,30 to 49,117,M,White,Not Span/Hispanic,1,Emergency,Home or Self Care,2020,DIG009,APPENDICITIS AND OTHER APPENDICEAL CONDITIONS,GIS008,APPENDECTOMY,227,"HERNIA PROCEDURES EXCEPT INGUINAL, FEMORAL & UMBILICAL",06,DISEASES AND DISORDERS OF THE DIGESTIVE SYSTEM,1,Minor,Minor,Surgical,Blue Cross/Blue Shield,,,,,Y,78243.48,14860.03
Long Island,Nassau,2908000,000511,NYU Langone Hospital-Long Island,30 to 49,117,F,White,Not Span/Hispanic,1,Elective,Home w/ Home Health Services,2020,DIG010,ABDOMINAL HERNIA,GNR002,ABDOMINAL WALL REPAIR (INCLUDING HERNIA),227,"HERNIA PROCEDURES EXCEPT INGUINAL, FEMORAL & UMBILICAL",06,DISEASES AND DISORDERS OF THE DIGESTIVE SYSTEM,1,Minor,Minor,Surgical,Blue Cross/Blue Shield,,,,,N,43837.78,8126.4
Long Island,Nassau,2908000,000511,NYU Langone Hospital-Long Island,30 to 49,117,M,White,Not Span/Hispanic,1,Elective,Home or Self Care,2020,DIG010,ABDOMINAL HERNIA,GNR002,ABDOMINAL WALL REPAIR (INCLUDING HERNIA),227,"HERNIA PROCEDURES EXCEPT INGUINAL, FEMORAL & UMBILICAL",06,DISEASES AND DISORDERS OF THE DIGESTIVE SYSTEM,2,Moderate,Minor,Surgical,Blue Cross/Blue Shield,,,,,N,120753.03,18168.34
Long Island,Nassau,2908000,000511,NYU Langone Hospital-Long Island,50 to 69,115,M,Black/African American,Not Span/Hispanic,2,Emergency,Home or Self Care,2020,DIG010,ABDOMINAL HERNIA,GNR002,ABDOMINAL WALL REPAIR (INCLUDING HERNIA),227,"HERNIA PROCEDURES EXCEPT INGUINAL, FEMORAL & UMBILICAL",06,DISEASES AND DISORDERS OF THE DIGESTIVE SYSTEM,2,Moderate,Minor,Surgical,Blue Cross/Blue Shield,Private Health Insurance,,,,Y,73759.43,13998.16
Long Island,Nassau,2908000,000511,NYU Langone Hospital-Long Island,50 to 69,117,F,White,Not Span/Hispanic,2,Elective,Home w/ Home Health Services,2020,DIG010,ABDOMINAL HERNIA,GNR002,ABDOMINAL WALL REPAIR (INCLUDING HERNIA),227,"HERNIA PROCEDURES EXCEPT INGUINAL, FEMORAL & UMBILICAL",06,DISEASES AND DISORDERS OF THE DIGESTIVE SYSTEM,2,Moderate,Moderate,Surgical,Blue Cross/Blue Shield,,,,,N,58953.24,12056.71
Long Island,Nassau,2908000,000511,NYU Langone Hospital-Long Island,50 to 69,117,F,White,Not Span/Hispanic,3,Emergency,Home or Self Care,2020,DIG024,POSTPROCEDURAL OR POSTOPERATIVE DIGESTIVE SYSTEM COMPLICATION,GNR002,ABDOMINAL WALL REPAIR (INCLUDING HERNIA),227,"HERNIA PROCEDURES EXCEPT INGUINAL, FEMORAL & UMBILICAL",06,DISEASES AND DISORDERS OF THE DIGESTIVE SYSTEM,2,Moderate,Minor,Surgical,Blue Cross/Blue Shield,,,,,Y,85016.78,17708.65
Long Island,Nassau,2908000,000511,NYU Langone Hospital-Long Island,50 to 69,117,F,White,Not Span/Hispanic,3,Elective,Home w/ Home Health Services,2020,DIG010,ABDOMINAL HERNIA,GNR002,ABDOMINAL WALL REPAIR (INCLUDING HERNIA),227,"HERNIA PROCEDURES EXCEPT INGUINAL, FEMORAL & UMBILICAL",06,DISEASES AND DISORDERS OF THE DIGESTIVE SYSTEM,1,Minor,Minor,Surgical,Blue Cross/Blue Shield,,,,,N,82476.81,17319.55
Long Island,Nassau,2908000,000511,NYU Langone Hospital-Long Island,70 or Older,115,F,Black/African American,Not Span/Hispanic,7,Emergency,Home or Self Care,2020,DIG012,INTESTINAL OBSTRUCTION AND ILEUS,GNR002,ABDOMINAL WALL REPAIR (INCLUDING HERNIA),227,"HERNIA PROCEDURES EXCEPT INGUINAL, FEMORAL & UMBILICAL",06,DISEASES AND DISORDERS OF THE DIGESTIVE SYSTEM,3,Major,Moderate,Surgical,Medicare,Private Health Insurance,,,,Y,192523.32,39050.45
Long Island,Nassau,2908000,000511,NYU Langone Hospital-Long Island,70 or Older,117,F,White,Not Span/Hispanic,4,Emergency,Skilled Nursing Home,2020,DIG012,INTESTINAL OBSTRUCTION AND ILEUS,GNR002,ABDOMINAL WALL REPAIR (INCLUDING HERNIA),227,"HERNIA PROCEDURES EXCEPT INGUINAL, FEMORAL & UMBILICAL",06,DISEASES AND DISORDERS OF THE DIGESTIVE SYSTEM,3,Major,Minor,Surgical,Medicare,Blue Cross/Blue Shield,,,,Y,235222.43,40064.61
Long Island,Nassau,2908000,000511,NYU Langone Hospital-Long Island,70 or Older,115,F,White,Not Span/Hispanic,23,Emergency,Skilled Nursing Home,2020,DIG010,ABDOMINAL HERNIA,GIS022,GI SYSTEM LYSIS OF ADHESIONS,227,"HERNIA PROCEDURES EXCEPT INGUINAL, FEMORAL & UMBILICAL",06,DISEASES AND DISORDERS OF THE DIGESTIVE SYSTEM,3,Major,Major,Surgical,Medicare,Medicare,,,,Y,480846.11,108007.46
Long Island,Nassau,2908000,000511,NYU Langone Hospital-Long Island,30 to 49,115,M,Black/African American,Not Span/Hispanic,1,Emergency,Home or Self Care,2020,DIG010,ABDOMINAL HERNIA,GNR002,ABDOMINAL WALL REPAIR (INCLUDING HERNIA),227,"HERNIA PROCEDURES EXCEPT INGUINAL, FEMORAL & UMBILICAL",06,DISEASES AND DISORDERS OF THE DIGESTIVE SYSTEM,1,Minor,Minor,Surgical,Medicare,Medicaid,,,,Y,61820.67,9806.29
Long Island,Nassau,2908000,000511,NYU Langone Hospital-Long Island,50 to 69,117,F,Black/African American,Not Span/Hispanic,1,Emergency,Home or Self Care,2020,DIG010,ABDOMINAL HERNIA,GNR002,ABDOMINAL WALL REPAIR (INCLUDING HERNIA),227,"HERNIA PROCEDURES EXCEPT INGUINAL, FEMORAL & UMBILICAL",06,DISEASES AND DISORDERS OF THE DIGESTIVE SYSTEM,1,Minor,Minor,Surgical,Medicaid,,,,,Y,95454.5,14534.6
Long Island,Nassau,2908000,000511,NYU Langone Hospital-Long Island,50 to 69,115,M,White,Not Span/Hispanic,8,Emergency,Home w/ Home Health Services,2020,DIG012,INTESTINAL OBSTRUCTION AND ILEUS,GNR002,ABDOMINAL WALL REPAIR (INCLUDING HERNIA),227,"HERNIA PROCEDURES EXCEPT INGUINAL, FEMORAL & UMBILICAL",06,DISEASES AND DISORDERS OF THE DIGESTIVE SYSTEM,2,Moderate,Minor,Surgical,Medicare,Blue Cross/Blue Shield,,,,Y,168138.16,38673.44
Long Island,Nassau,2908000,000511,NYU Langone Hospital-Long Island,50 to 69,112,M,Black/African American,Not Span/Hispanic,3,Emergency,Home or Self Care,2020,DIG010,ABDOMINAL HERNIA,GNR002,ABDOMINAL WALL REPAIR (INCLUDING HERNIA),227,"HERNIA PROCEDURES EXCEPT INGUINAL, FEMORAL & UMBILICAL",06,DISEASES AND DISORDERS OF THE DIGESTIVE SYSTEM,1,Minor,Minor,Surgical,Medicaid,,,,,Y,145995.32,24613.29
Long Island,Nassau,2908000,000511,NYU Langone Hospital-Long Island,70 or Older,115,M,White,Not Span/Hispanic,6,Emergency,Home w/ Home Health Services,2020,DIG010,ABDOMINAL HERNIA,GNR002,ABDOMINAL WALL REPAIR (INCLUDING HERNIA),227,"HERNIA PROCEDURES EXCEPT INGUINAL, FEMORAL & UMBILICAL",06,DISEASES AND DISORDERS OF THE DIGESTIVE SYSTEM,3,Major,Major,Surgical,Medicare,Blue Cross/Blue Shield,,,,Y,112443.95,26529.34
Long Island,Nassau,2908000,000511,NYU Langone Hospital-Long Island,30 to 49,115,M,Black/African American,Not Span/Hispanic,1,Emergency,Home or Self Care,2020,DIG010,ABDOMINAL HERNIA,GNR002,ABDOMINAL WALL REPAIR (INCLUDING HERNIA),227,"HERNIA PROCEDURES EXCEPT INGUINAL, FEMORAL & UMBILICAL",06,DISEASES AND DISORDERS OF THE DIGESTIVE SYSTEM,1,Minor,Minor,Surgical,Blue Cross/Blue Shield,,,,,Y,50669.96,8888.41
Long Island,Nassau,2908000,000511,NYU Langone Hospital-Long Island,70 or Older,105,M,White,Not Span/Hispanic,1,Elective,Home or Self Care,2020,DIG010,ABDOMINAL HERNIA,GIS022,GI SYSTEM LYSIS OF ADHESIONS,227,"HERNIA PROCEDURES EXCEPT INGUINAL, FEMORAL & UMBILICAL",06,DISEASES AND DISORDERS OF THE DIGESTIVE SYSTEM,1,Minor,Minor,Surgical,Blue Cross/Blue Shield,Medicare,,,,N,182169.51,27209.88
Long Island,Nassau,2908000,000511,NYU Langone Hospital-Long Island,50 to 69,115,M,White,Not Span/Hispanic,1,Emergency,Home w/ Home Health Services,2020,DIG009,APPENDICITIS AND OTHER APPENDICEAL CONDITIONS,GIS008,APPENDECTOMY,227,"HERNIA PROCEDURES EXCEPT INGUINAL, FEMORAL & UMBILICAL",06,DISEASES AND DISORDERS OF THE DIGESTIVE SYSTEM,2,Moderate,Minor,Surgical,Private Health Insurance,,,,,Y,87622.03,14357.92
Long Island,Nassau,2908000,000511,NYU Langone Hospital-Long Island,70 or Older,115,M,White,Not Span/Hispanic,5,Emergency,Home or Self Care,2020,DIG010,ABDOMINAL HERNIA,GNR002,ABDOMINAL WALL REPAIR (INCLUDING HERNIA),227,"HERNIA PROCEDURES EXCEPT INGUINAL, FEMORAL & UMBILICAL",06,DISEASES AND DISORDERS OF THE DIGESTIVE SYSTEM,4,Extreme,Extreme,Surgical,Medicare,Medicaid,,,,Y,216961.02,41857.36
Long Island,Nassau,2908000,000511,NYU Langone Hospital-Long Island,70 or Older,110,M,White,Not Span/Hispanic,1,Elective,Home w/ Home Health Services,2020,DIG010,ABDOMINAL HERNIA,GNR002,ABDOMINAL WALL REPAIR (INCLUDING HERNIA),227,"HERNIA PROCEDURES EXCEPT INGUINAL, FEMORAL & UMBILICAL",06,DISEASES AND DISORDERS OF THE DIGESTIVE SYSTEM,1,Minor,Minor,Surgical,Medicare,Medicare,,,,N,44365.71,9117.25
Long Island,Nassau,2908000,000511,NYU Langone Hospital-Long Island,30 to 49,115,M,White,Unknown,2,Emergency,Home or Self Care,2020,DIG010,ABDOMINAL HERNIA,GNR002,ABDOMINAL WALL REPAIR (INCLUDING HERNIA),227,"HERNIA PROCEDURES EXCEPT INGUINAL, FEMORAL & UMBILICAL",06,DISEASES AND DISORDERS OF THE DIGESTIVE SYSTEM,1,Minor,Minor,Surgical,Medicare,Private Health Insurance,,,,Y,62348.3,14570.09
Long Island,Nassau,2908000,000511,NYU Langone Hospital-Long Island,50 to 69,112,F,Black/African American,Not Span/Hispanic,3,Elective,Home or Self Care,2020,DIG010,ABDOMINAL HERNIA,GNR002,ABDOMINAL WALL REPAIR (INCLUDING HERNIA),227,"HERNIA PROCEDURES EXCEPT INGUINAL, FEMORAL & UMBILICAL",06,DISEASES AND DISORDERS OF THE DIGESTIVE SYSTEM,2,Moderate,Minor,Surgical,Private Health Insurance,,,,,N,80623.98,19562.78
Long Island,Nassau,2908000,000511,NYU Langone Hospital-Long Island,50 to 69,117,M,White,Not Span/Hispanic,2,Emergency,Home or Self Care,2020,DIG010,ABDOMINAL HERNIA,GNR002,ABDOMINAL WALL REPAIR (INCLUDING HERNIA),227,"HERNIA PROCEDURES EXCEPT INGUINAL, FEMORAL & UMBILICAL",06,DISEASES AND DISORDERS OF THE DIGESTIVE SYSTEM,2,Moderate,Minor,Surgical,Blue Cross/Blue Shield,Medicare,,,,Y,77610.59,16508.53
Long Island,Nassau,2908000,000511,NYU Langone Hospital-Long Island,70 or Older,110,F,White,Not Span/Hispanic,1,Elective,Home or Self Care,2020,DIG010,ABDOMINAL HERNIA,GNR002,ABDOMINAL WALL REPAIR (INCLUDING HERNIA),227,"HERNIA PROCEDURES EXCEPT INGUINAL, FEMORAL & UMBILICAL",06,DISEASES AND DISORDERS OF THE DIGESTIVE SYSTEM,2,Moderate,Minor,Surgical,Medicare,,,,,N,150969.19,23731.86
Long Island,Nassau,2908000,000511,NYU Langone Hospital-Long Island,50 to 69,113,F,White,Not Span/Hispanic,17,Urgent,Skilled Nursing Home,2020,DIG010,ABDOMINAL HERNIA,GNR002,ABDOMINAL WALL REPAIR (INCLUDING HERNIA),227,"HERNIA PROCEDURES EXCEPT INGUINAL, FEMORAL & UMBILICAL",06,DISEASES AND DISORDERS OF THE DIGESTIVE SYSTEM,4,Extreme,Extreme,Surgical,Blue Cross/Blue Shield,,,,,N,326647.24,103604.24
Long Island,Nassau,2908000,000511,NYU Langone Hospital-Long Island,30 to 49,119,F,White,Not Span/Hispanic,1,Emergency,Home or Self Care,2020,DIG010,ABDOMINAL HERNIA,GIS021,GI SYSTEM REPAIR (EXCLUDING ANORECTAL),227,"HERNIA PROCEDURES EXCEPT INGUINAL, FEMORAL & UMBILICAL",06,DISEASES AND DISORDERS OF THE DIGESTIVE SYSTEM,2,Moderate,Minor,Surgical,Blue Cross/Blue Shield,,,,,Y,61177.18,11096.49
Long Island,Nassau,2908000,000511,NYU Langone Hospital-Long Island,70 or Older,115,F,White,Not Span/Hispanic,9,Emergency,Skilled Nursing Home,2020,DIG010,ABDOMINAL HERNIA,GNR002,ABDOMINAL WALL REPAIR (INCLUDING HERNIA),227,"HERNIA PROCEDURES EXCEPT INGUINAL, FEMORAL & UMBILICAL",06,DISEASES AND DISORDERS OF THE DIGESTIVE SYSTEM,2,Moderate,Moderate,Surgical,Medicare,Medicare,,,,Y,287563.36,64678.94
Long Island,Nassau,2908000,000511,NYU Langone Hospital-Long Island,50 to 69,115,M,White,Not Span/Hispanic,2,Emergency,Home or Self Care,2020,DIG009,APPENDICITIS AND OTHER APPENDICEAL CONDITIONS,GIS008,APPENDECTOMY,227,"HERNIA PROCEDURES EXCEPT INGUINAL, FEMORAL & UMBILICAL",06,DISEASES AND DISORDERS OF THE DIGESTIVE SYSTEM,1,Minor,Minor,Surgical,Blue Cross/Blue Shield,,,,,Y,92136.23,18566.24
Long Island,Nassau,2908000,000511,NYU Langone Hospital-Long Island,30 to 49,115,M,White,Spanish/Hispanic,2,Emergency,Home or Self Care,2020,DIG009,APPENDICITIS AND OTHER APPENDICEAL CONDITIONS,GIS008,APPENDECTOMY,227,"HERNIA PROCEDURES EXCEPT INGUINAL, FEMORAL & UMBILICAL",06,DISEASES AND DISORDERS OF THE DIGESTIVE SYSTEM,1,Minor,Minor,Surgical,Medicaid,,,,,Y,78770.78,16548.14
Long Island,Nassau,2908000,000511,NYU Langone Hospital-Long Island,70 or Older,115,F,White,Not Span/Hispanic,9,Emergency,Skilled Nursing Home,2020,DIG010,ABDOMINAL HERNIA,GNR002,ABDOMINAL WALL REPAIR (INCLUDING HERNIA),227,"HERNIA PROCEDURES EXCEPT INGUINAL, FEMORAL & UMBILICAL",06,DISEASES AND DISORDERS OF THE DIGESTIVE SYSTEM,4,Extreme,Extreme,Surgical,Medicare,Medicaid,,,,Y,327390.39,81561.25
Long Island,Nassau,2908000,000511,NYU Langone Hospital-Long Island,50 to 69,117,F,White,Not Span/Hispanic,15,Emergency,Home or Self Care,2020,DIG012,INTESTINAL OBSTRUCTION AND ILEUS,GIS022,GI SYSTEM LYSIS OF ADHESIONS,227,"HERNIA PROCEDURES EXCEPT INGUINAL, FEMORAL & UMBILICAL",06,DISEASES AND DISORDERS OF THE DIGESTIVE SYSTEM,2,Moderate,Minor,Surgical,Medicare,,,,,Y,397157.64,95801.5
Long Island,Nassau,2908000,000511,NYU Langone Hospital-Long Island,30 to 49,115,F,Black/African American,Not Span/Hispanic,2,Emergency,Home or Self Care,2020,DIG010,ABDOMINAL HERNIA,GNR002,ABDOMINAL WALL REPAIR (INCLUDING HERNIA),227,"HERNIA PROCEDURES EXCEPT INGUINAL, FEMORAL & UMBILICAL",06,DISEASES AND DISORDERS OF THE DIGESTIVE SYSTEM,2,Moderate,Minor,Surgical,Medicaid,,,,,Y,139730.65,25171.2
Long Island,Nassau,2908000,000511,NYU Langone Hospital-Long Island,70 or Older,117,F,White,Not Span/Hispanic,1,Elective,Home w/ Home Health Services,2020,DIG010,ABDOMINAL HERNIA,GNR002,ABDOMINAL WALL REPAIR (INCLUDING HERNIA),227,"HERNIA PROCEDURES EXCEPT INGUINAL, FEMORAL & UMBILICAL",06,DISEASES AND DISORDERS OF THE DIGESTIVE SYSTEM,1,Minor,Minor,Surgical,Medicare,Blue Cross/Blue Shield,,,,N,35486.94,7971.7
Long Island,Nassau,2908000,000511,NYU Langone Hospital-Long Island,50 to 69,117,F,White,Not Span/Hispanic,2,Elective,Home or Self Care,2020,DIG010,ABDOMINAL HERNIA,GNR002,ABDOMINAL WALL REPAIR (INCLUDING HERNIA),227,"HERNIA PROCEDURES EXCEPT INGUINAL, FEMORAL & UMBILICAL",06,DISEASES AND DISORDERS OF THE DIGESTIVE SYSTEM,1,Minor,Minor,Surgical,Medicare,Private Health Insurance,,,,N,138178.74,25415.57
Long Island,Nassau,2908000,000511,NYU Langone Hospital-Long Island,30 to 49,115,M,Other Race,Spanish/Hispanic,3,Emergency,Home or Self Care,2020,DIG010,ABDOMINAL HERNIA,GNR002,ABDOMINAL WALL REPAIR (INCLUDING HERNIA),227,"HERNIA PROCEDURES EXCEPT INGUINAL, FEMORAL & UMBILICAL",06,DISEASES AND DISORDERS OF THE DIGESTIVE SYSTEM,1,Minor,Minor,Surgical,Medicaid,,,,,Y,96068.04,20587.53
Long Island,Nassau,2908000,000511,NYU Langone Hospital-Long Island,18 to 29,114,F,White,Not Span/Hispanic,1,Emergency,Home or Self Care,2020,DIG005,GASTRODUODENAL ULCER,HEP006,CHOLECYSTECTOMY,227,"HERNIA PROCEDURES EXCEPT INGUINAL, FEMORAL & UMBILICAL",06,DISEASES AND DISORDERS OF THE DIGESTIVE SYSTEM,2,Moderate,Minor,Surgical,Medicaid,,,,,Y,158439.64,24104.23
Long Island,Nassau,2908000,000511,NYU Langone Hospital-Long Island,70 or Older,117,F,White,Not Span/Hispanic,9,Emergency,Home or Self Care,2020,DIG010,ABDOMINAL HERNIA,GNR002,ABDOMINAL WALL REPAIR (INCLUDING HERNIA),227,"HERNIA PROCEDURES EXCEPT INGUINAL, FEMORAL & UMBILICAL",06,DISEASES AND DISORDERS OF THE DIGESTIVE SYSTEM,2,Moderate,Moderate,Surgical,Medicare,Medicare,,,,Y,261223.42,62880.15
Long Island,Nassau,2908000,000511,NYU Langone Hospital-Long Island,70 or Older,117,F,White,Not Span/Hispanic,9,Elective,Skilled Nursing Home,2020,DIG010,ABDOMINAL HERNIA,GIS022,GI SYSTEM LYSIS OF ADHESIONS,227,"HERNIA PROCEDURES EXCEPT INGUINAL, FEMORAL & UMBILICAL",06,DISEASES AND DISORDERS OF THE DIGESTIVE SYSTEM,2,Moderate,Moderate,Surgical,Medicare,Medicare,,,,N,487995.44,93039.64
Long Island,Nassau,2908000,000511,NYU Langone Hospital-Long Island,30 to 49,117,F,Other Race,Spanish/Hispanic,9,Emergency,Home w/ Home Health Services,2020,DIG010,ABDOMINAL HERNIA,GNR002,ABDOMINAL WALL REPAIR (INCLUDING HERNIA),227,"HERNIA PROCEDURES EXCEPT INGUINAL, FEMORAL & UMBILICAL",06,DISEASES AND DISORDERS OF THE DIGESTIVE SYSTEM,3,Major,Moderate,Surgical,Blue Cross/Blue Shield,,,,,Y,258891.09,62414.94
Long Island,Nassau,2908000,000511,NYU Langone Hospital-Long Island,50 to 69,117,F,White,Spanish/Hispanic,1,Elective,Home or Self Care,2020,DIG010,ABDOMINAL HERNIA,GNR002,ABDOMINAL WALL REPAIR (INCLUDING HERNIA),227,"HERNIA PROCEDURES EXCEPT INGUINAL, FEMORAL & UMBILICAL",06,DISEASES AND DISORDERS OF THE DIGESTIVE SYSTEM,1,Minor,Minor,Surgical,Blue Cross/Blue Shield,,,,,N,149875.09,23514.44
Long Island,Nassau,2908000,000511,NYU Langone Hospital-Long Island,70 or Older,115,M,White,Not Span/Hispanic,2,Emergency,Home or Self Care,2020,DIG010,ABDOMINAL HERNIA,GNR002,ABDOMINAL WALL REPAIR (INCLUDING HERNIA),227,"HERNIA PROCEDURES EXCEPT INGUINAL, FEMORAL & UMBILICAL",06,DISEASES AND DISORDERS OF THE DIGESTIVE SYSTEM,1,Minor,Minor,Surgical,Medicare,Blue Cross/Blue Shield,,,,Y,70006.93,15253.66
Long Island,Nassau,2908000,000511,NYU Langone Hospital-Long Island,70 or Older,115,F,Other Race,Not Span/Hispanic,10,Emergency,Home w/ Home Health Services,2020,DIG010,ABDOMINAL HERNIA,GNR002,ABDOMINAL WALL REPAIR (INCLUDING HERNIA),227,"HERNIA PROCEDURES EXCEPT INGUINAL, FEMORAL & UMBILICAL",06,DISEASES AND DISORDERS OF THE DIGESTIVE SYSTEM,2,Moderate,Moderate,Surgical,Medicare,Medicaid,,,,Y,309049.74,74957.95
Long Island,Nassau,2908000,000511,NYU Langone Hospital-Long Island,70 or Older,117,F,White,Not Span/Hispanic,2,Emergency,Home w/ Home Health Services,2020,DIG024,POSTPROCEDURAL OR POSTOPERATIVE DIGESTIVE SYSTEM COMPLICATION,GIS022,GI SYSTEM LYSIS OF ADHESIONS,227,"HERNIA PROCEDURES EXCEPT INGUINAL, FEMORAL & UMBILICAL",06,DISEASES AND DISORDERS OF THE DIGESTIVE SYSTEM,2,Moderate,Minor,Surgical,Medicare,Blue Cross/Blue Shield,,,,Y,139111.09,27439.97
Long Island,Nassau,2908000,000511,NYU Langone Hospital-Long Island,0 to 17,117,M,White,Not Span/Hispanic,1,Emergency,Home or Self Care,2020,DIG009,APPENDICITIS AND OTHER APPENDICEAL CONDITIONS,GIS008,APPENDECTOMY,227,"HERNIA PROCEDURES EXCEPT INGUINAL, FEMORAL & UMBILICAL",06,DISEASES AND DISORDERS OF THE DIGESTIVE SYSTEM,1,Minor,Minor,Surgical,Blue Cross/Blue Shield,,,,,Y,72404.55,13071.59
Long Island,Nassau,2908000,000511,NYU Langone Hospital-Long Island,50 to 69,113,F,White,Not Span/Hispanic,4,Emergency,Home or Self Care,2020,DIG012,INTESTINAL OBSTRUCTION AND ILEUS,GNR002,ABDOMINAL WALL REPAIR (INCLUDING HERNIA),227,"HERNIA PROCEDURES EXCEPT INGUINAL, FEMORAL & UMBILICAL",06,DISEASES AND DISORDERS OF THE DIGESTIVE SYSTEM,2,Moderate,Moderate,Surgical,Blue Cross/Blue Shield,,,,,Y,93477.42,24781.03