Hospital Service Area,Hospital County,Operating Certificate Number,Permanent Facility Id,Facility Name,Age Group,Zip Code - 3 digits,Gender,Race,Ethnicity,Length of Stay,Type of Admission,Patient Disposition,Discharge Year,CCS Diagnosis Code,CCS Diagnosis Description,CCS Procedure Code,CCS Procedure Description,APR DRG Code,APR DRG Description,APR MDC Code,APR MDC Description,APR Severity of Illness Code,APR Severity of Illness Description,APR Risk of Mortality,APR Medical Surgical Description,Payment Typology 1,Payment Typology 2,Payment Typology 3,Birth Weight,Abortion Edit Indicator,Emergency Department Indicator,Total Charges,Total Costs
New York City,Manhattan,7002001,001438,Bellevue Hospital Center,30 to 49,112,F,Black/African American,Not Span/Hispanic,2,Emergency,Home or Self Care,2017,143,Abdominal hernia,085,INGUINAL/FEMORAL HERNIA,228,"Inguinal, femoral & umbilical hernia procedures",06,Diseases and Disorders of the Digestive System,1,Minor,Minor,Surgical,Private Health Insurance,,,,N,Y,13571.61,8750.27
New York City,Manhattan,7002001,001438,Bellevue Hospital Center,50 to 69,100,M,Black/African American,Not Span/Hispanic,4,Emergency,Home or Self Care,2017,143,Abdominal hernia,085,INGUINAL/FEMORAL HERNIA,228,"Inguinal, femoral & umbilical hernia procedures",06,Diseases and Disorders of the Digestive System,1,Minor,Minor,Surgical,Medicaid,,,,N,Y,23396.28,15084.70
New York City,Manhattan,7002001,001438,Bellevue Hospital Center,50 to 69,104,M,Other Race,Spanish/Hispanic,2,Emergency,Home or Self Care,2017,143,Abdominal hernia,086,OTHER HERNIA REPAIR,228,"Inguinal, femoral & umbilical hernia procedures",06,Diseases and Disorders of the Digestive System,1,Minor,Minor,Surgical,Department of Corrections,,,,N,N,12725.64,8204.83
New York City,Manhattan,7002001,001438,Bellevue Hospital Center,0 to 17,113,M,Other Race,Not Span/Hispanic,1,Emergency,Home or Self Care,2017,143,Abdominal hernia,085,INGUINAL/FEMORAL HERNIA,228,"Inguinal, femoral & umbilical hernia procedures",06,Diseases and Disorders of the Digestive System,1,Minor,Minor,Surgical,Medicaid,Medicaid,,02400,N,N,6451.64,4159.68
New York City,Manhattan,7002001,001438,Bellevue Hospital Center,30 to 49,100,M,Other Race,Not Span/Hispanic,1,Emergency,Home or Self Care,2017,143,Abdominal hernia,086,OTHER HERNIA REPAIR,228,"Inguinal, femoral & umbilical hernia procedures",06,Diseases and Disorders of the Digestive System,1,Minor,Minor,Surgical,Medicaid,,,,N,N,6110.00,3939.41
New York City,Manhattan,7002001,001438,Bellevue Hospital Center,30 to 49,113,M,Other Race,Not Span/Hispanic,4,Emergency,Home or Self Care,2017,143,Abdominal hernia,085,INGUINAL/FEMORAL HERNIA,228,"Inguinal, femoral & umbilical hernia procedures",06,Diseases and Disorders of the Digestive System,1,Minor,Minor,Surgical,Medicaid,,,,N,N,23645.20,15245.20
New York City,Manhattan,7002001,001438,Bellevue Hospital Center,30 to 49,104,M,Black/African American,Not Span/Hispanic,2,Emergency,Home or Self Care,2017,143,Abdominal hernia,086,OTHER HERNIA REPAIR,228,"Inguinal, femoral & umbilical hernia procedures",06,Diseases and Disorders of the Digestive System,2,Moderate,Minor,Surgical,Medicaid,Medicaid,,,N,Y,14847.30,9572.77
New York City,Manhattan,7002001,001438,Bellevue Hospital Center,30 to 49,100,M,White,Not Span/Hispanic,6,Emergency,Home or Self Care,2017,143,Abdominal hernia,085,INGUINAL/FEMORAL HERNIA,228,"Inguinal, femoral & umbilical hernia procedures",06,Diseases and Disorders of the Digestive System,2,Moderate,Minor,Surgical,Medicaid,,,,N,N,31587.85,20366.20
New York City,Manhattan,7002001,001438,Bellevue Hospital Center,50 to 69,113,M,Other Race,Not Span/Hispanic,2,Emergency,Home or Self Care,2017,143,Abdominal hernia,085,INGUINAL/FEMORAL HERNIA,228,"Inguinal, femoral & umbilical hernia procedures",06,Diseases and Disorders of the Digestive System,1,Minor,Minor,Surgical,Medicaid,,,,N,N,13369.88,8620.20
New York City,Manhattan,7002001,001438,Bellevue Hospital Center,50 to 69,113,M,Other Race,Not Span/Hispanic,2,Emergency,Home or Self Care,2017,143,Abdominal hernia,086,OTHER HERNIA REPAIR,228,"Inguinal, femoral & umbilical hernia procedures",06,Diseases and Disorders of the Digestive System,2,Moderate,Minor,Surgical,Department of Corrections,,,,N,N,12376.97,7980.03
New York City,Manhattan,7002001,001438,Bellevue Hospital Center,50 to 69,OOS,M,White,Not Span/Hispanic,2,Emergency,Home or Self Care,2017,143,Abdominal hernia,085,INGUINAL/FEMORAL HERNIA,228,"Inguinal, femoral & umbilical hernia procedures",06,Diseases and Disorders of the Digestive System,1,Minor,Minor,Surgical,Self-Pay,,,,N,Y,13359.24,8613.34
New York City,Manhattan,7002001,001438,Bellevue Hospital Center,30 to 49,112,M,Other Race,Spanish/Hispanic,2,Emergency,Home or Self Care,2017,143,Abdominal hernia,085,INGUINAL/FEMORAL HERNIA,228,"Inguinal, femoral & umbilical hernia procedures",06,Diseases and Disorders of the Digestive System,1,Minor,Minor,Surgical,Self-Pay,,,,N,Y,14262.95,9196.01
New York City,Manhattan,7002001,001438,Bellevue Hospital Center,30 to 49,100,M,Black/African American,Not Span/Hispanic,2,Emergency,Home or Self Care,2017,143,Abdominal hernia,085,INGUINAL/FEMORAL HERNIA,228,"Inguinal, femoral & umbilical hernia procedures",06,Diseases and Disorders of the Digestive System,2,Moderate,Minor,Surgical,"Managed Care, Unspecified",Medicaid,,,N,Y,13782.60,8886.30
New York City,Manhattan,7002001,001438,Bellevue Hospital Center,50 to 69,100,M,White,Not Span/Hispanic,2,Emergency,Home or Self Care,2017,143,Abdominal hernia,085,INGUINAL/FEMORAL HERNIA,228,"Inguinal, femoral & umbilical hernia procedures",06,Diseases and Disorders of the Digestive System,2,Moderate,Minor,Surgical,Medicare,Medicaid,,,N,N,12814.46,8262.10
New York City,Manhattan,7002001,001438,Bellevue Hospital Center,70 or Older,100,M,Other Race,Spanish/Hispanic,2,Emergency,Home or Self Care,2017,143,Abdominal hernia,085,INGUINAL/FEMORAL HERNIA,228,"Inguinal, femoral & umbilical hernia procedures",06,Diseases and Disorders of the Digestive System,1,Minor,Minor,Surgical,Medicare,Medicare,Medicaid,,N,Y,13603.32,8770.71
New York City,Manhattan,7002001,001438,Bellevue Hospital Center,50 to 69,114,M,Other Race,Not Span/Hispanic,2,Emergency,Home or Self Care,2017,143,Abdominal hernia,085,INGUINAL/FEMORAL HERNIA,228,"Inguinal, femoral & umbilical hernia procedures",06,Diseases and Disorders of the Digestive System,1,Minor,Minor,Surgical,Medicare,Medicare,Medicaid,,N,Y,13239.65,8536.24
New York City,Manhattan,7002001,001438,Bellevue Hospital Center,30 to 49,100,M,Other Race,Not Span/Hispanic,1,Emergency,Home or Self Care,2017,143,Abdominal hernia,085,INGUINAL/FEMORAL HERNIA,228,"Inguinal, femoral & umbilical hernia procedures",06,Diseases and Disorders of the Digestive System,1,Minor,Minor,Surgical,Miscellaneous/Other,,,,N,Y,5387.50,3473.58
New York City,Manhattan,7002001,001438,Bellevue Hospital Center,0 to 17,112,M,Other Race,Spanish/Hispanic,1,Emergency,Home or Self Care,2017,143,Abdominal hernia,085,INGUINAL/FEMORAL HERNIA,228,"Inguinal, femoral & umbilical hernia procedures",06,Diseases and Disorders of the Digestive System,1,Minor,Minor,Surgical,Medicaid,Medicaid,,,N,N,6285.49,4052.56
New York City,Manhattan,7002001,001438,Bellevue Hospital Center,30 to 49,113,M,Black/African American,Not Span/Hispanic,2,Emergency,Home or Self Care,2017,143,Abdominal hernia,085,INGUINAL/FEMORAL HERNIA,228,"Inguinal, femoral & umbilical hernia procedures",06,Diseases and Disorders of the Digestive System,1,Minor,Minor,Surgical,Medicaid,,,,N,Y,13600.70,8769.02
New York City,Manhattan,7002001,001438,Bellevue Hospital Center,18 to 29,113,M,Black/African American,Not Span/Hispanic,6,Emergency,Home or Self Care,2017,143,Abdominal hernia,085,INGUINAL/FEMORAL HERNIA,228,"Inguinal, femoral & umbilical hernia procedures",06,Diseases and Disorders of the Digestive System,3,Major,Moderate,Surgical,Department of Corrections,,,,N,Y,33067.87,21320.44
New York City,Manhattan,7002001,001438,Bellevue Hospital Center,30 to 49,104,F,Other Race,Not Span/Hispanic,2,Emergency,Home or Self Care,2017,143,Abdominal hernia,086,OTHER HERNIA REPAIR,228,"Inguinal, femoral & umbilical hernia procedures",06,Diseases and Disorders of the Digestive System,1,Minor,Minor,Surgical,Self-Pay,,,,N,Y,14765.83,9520.24
New York City,Manhattan,7002001,001438,Bellevue Hospital Center,70 or Older,100,F,White,Not Span/Hispanic,13,Emergency,Home or Self Care,2017,143,Abdominal hernia,085,INGUINAL/FEMORAL HERNIA,228,"Inguinal, femoral & umbilical hernia procedures",06,Diseases and Disorders of the Digestive System,2,Moderate,Minor,Surgical,Medicare,Medicaid,,,N,Y,75245.15,48514.16
New York City,Manhattan,7002001,001438,Bellevue Hospital Center,0 to 17,112,M,Other Race,Spanish/Hispanic,1,Emergency,Home or Self Care,2017,143,Abdominal hernia,085,INGUINAL/FEMORAL HERNIA,228,"Inguinal, femoral & umbilical hernia procedures",06,Diseases and Disorders of the Digestive System,1,Minor,Minor,Surgical,Medicaid,Medicaid,,,N,N,6285.49,4052.56
New York City,Manhattan,7002001,001438,Bellevue Hospital Center,50 to 69,100,M,Other Race,Not Span/Hispanic,5,Emergency,Home or Self Care,2017,143,Abdominal hernia,086,OTHER HERNIA REPAIR,228,"Inguinal, femoral & umbilical hernia procedures",06,Diseases and Disorders of the Digestive System,3,Major,Moderate,Surgical,Medicaid,Medicaid,,,N,Y,26065.46,16805.65
New York City,Manhattan,7002001,001438,Bellevue Hospital Center,70 or Older,112,M,Other Race,Not Span/Hispanic,1,Emergency,Home or Self Care,2017,143,Abdominal hernia,085,INGUINAL/FEMORAL HERNIA,228,"Inguinal, femoral & umbilical hernia procedures",06,Diseases and Disorders of the Digestive System,1,Minor,Minor,Surgical,Medicare,,,,N,N,6266.97,4040.62
New York City,Manhattan,7002001,001438,Bellevue Hospital Center,50 to 69,113,M,Black/African American,Not Span/Hispanic,2,Elective,Home or Self Care,2017,143,Abdominal hernia,085,INGUINAL/FEMORAL HERNIA,228,"Inguinal, femoral & umbilical hernia procedures",06,Diseases and Disorders of the Digestive System,1,Minor,Minor,Surgical,Medicaid,,,,N,N,12639.19,8149.09
New York City,Manhattan,7002001,001438,Bellevue Hospital Center,50 to 69,OOS,M,Black/African American,Not Span/Hispanic,2,Emergency,Home or Self Care,2017,143,Abdominal hernia,099,OT OR GI THER PRCS,228,"Inguinal, femoral & umbilical hernia procedures",06,Diseases and Disorders of the Digestive System,1,Minor,Minor,Surgical,Private Health Insurance,,,,N,Y,15837.80,10211.39
New York City,Manhattan,7002001,001438,Bellevue Hospital Center,30 to 49,113,M,Black/African American,Not Span/Hispanic,2,Elective,Home or Self Care,2017,143,Abdominal hernia,085,INGUINAL/FEMORAL HERNIA,228,"Inguinal, femoral & umbilical hernia procedures",06,Diseases and Disorders of the Digestive System,1,Minor,Minor,Surgical,Department of Corrections,,,,N,N,13190.21,8504.36
New York City,Manhattan,7002001,001438,Bellevue Hospital Center,70 or Older,OOS,M,Other Race,Not Span/Hispanic,5,Emergency,Home or Self Care,2017,143,Abdominal hernia,085,INGUINAL/FEMORAL HERNIA,228,"Inguinal, femoral & umbilical hernia procedures",06,Diseases and Disorders of the Digestive System,1,Minor,Minor,Surgical,Blue Cross/Blue Shield,Medicare,,,N,Y,33950.00,21889.19
New York City,Manhattan,7002001,001438,Bellevue Hospital Center,50 to 69,,M,Other Race,Not Span/Hispanic,1,Emergency,Home or Self Care,2017,143,Abdominal hernia,085,INGUINAL/FEMORAL HERNIA,228,"Inguinal, femoral & umbilical hernia procedures",06,Diseases and Disorders of the Digestive System,1,Minor,Minor,Surgical,Medicaid,,,,N,Y,7400.63,4771.54
New York City,Manhattan,7002001,001438,Bellevue Hospital Center,50 to 69,113,M,White,Not Span/Hispanic,14,Emergency,Home or Self Care,2017,143,Abdominal hernia,085,INGUINAL/FEMORAL HERNIA,228,"Inguinal, femoral & umbilical hernia procedures",06,Diseases and Disorders of the Digestive System,1,Minor,Minor,Surgical,Medicaid,Medicaid,,,N,Y,75399.51,48613.68
New York City,Manhattan,7002001,001438,Bellevue Hospital Center,50 to 69,104,M,Black/African American,Not Span/Hispanic,2,Elective,Home or Self Care,2017,143,Abdominal hernia,085,INGUINAL/FEMORAL HERNIA,228,"Inguinal, femoral & umbilical hernia procedures",06,Diseases and Disorders of the Digestive System,1,Minor,Minor,Surgical,Medicaid,,,,N,N,12750.34,8220.76
New York City,Manhattan,7002001,001438,Bellevue Hospital Center,50 to 69,113,M,Black/African American,Not Span/Hispanic,3,Emergency,Home or Self Care,2017,143,Abdominal hernia,085,INGUINAL/FEMORAL HERNIA,228,"Inguinal, femoral & umbilical hernia procedures",06,Diseases and Disorders of the Digestive System,2,Moderate,Minor,Surgical,Department of Corrections,,,,N,Y,19163.45,12355.60
New York City,Manhattan,7002001,001438,Bellevue Hospital Center,30 to 49,113,M,Other Race,Not Span/Hispanic,2,Elective,Home or Self Care,2017,143,Abdominal hernia,085,INGUINAL/FEMORAL HERNIA,228,"Inguinal, femoral & umbilical hernia procedures",06,Diseases and Disorders of the Digestive System,1,Minor,Minor,Surgical,Department of Corrections,,,,N,N,12380.88,7982.55
New York City,Manhattan,7002001,001438,Bellevue Hospital Center,50 to 69,104,M,Other Race,Not Span/Hispanic,1,Emergency,Home or Self Care,2017,143,Abdominal hernia,086,OTHER HERNIA REPAIR,228,"Inguinal, femoral & umbilical hernia procedures",06,Diseases and Disorders of the Digestive System,1,Minor,Minor,Surgical,Medicaid,,,,N,N,6110.00,3939.41
New York City,Manhattan,7002001,001438,Bellevue Hospital Center,50 to 69,113,M,Other Race,Spanish/Hispanic,2,Emergency,Home or Self Care,2017,143,Abdominal hernia,086,OTHER HERNIA REPAIR,228,"Inguinal, femoral & umbilical hernia procedures",06,Diseases and Disorders of the Digestive System,1,Minor,Minor,Surgical,Self-Pay,,,,N,N,12697.58,8186.74
New York City,Manhattan,7002001,001438,Bellevue Hospital Center,30 to 49,113,M,Other Race,Spanish/Hispanic,3,Emergency,Home or Self Care,2017,143,Abdominal hernia,086,OTHER HERNIA REPAIR,228,"Inguinal, femoral & umbilical hernia procedures",06,Diseases and Disorders of the Digestive System,2,Moderate,Minor,Surgical,Medicaid,,,,N,Y,20040.88,12921.32
New York City,Manhattan,7002001,001438,Bellevue Hospital Center,0 to 17,112,M,Other Race,Spanish/Hispanic,1,Emergency,Home or Self Care,2017,143,Abdominal hernia,085,INGUINAL/FEMORAL HERNIA,228,"Inguinal, femoral & umbilical hernia procedures",06,Diseases and Disorders of the Digestive System,1,Minor,Minor,Surgical,Medicaid,Medicaid,,,N,N,5760.00,3713.75
New York City,Manhattan,7002001,001438,Bellevue Hospital Center,30 to 49,112,M,Other Race,Spanish/Hispanic,1,Emergency,Home or Self Care,2017,143,Abdominal hernia,086,OTHER HERNIA REPAIR,228,"Inguinal, femoral & umbilical hernia procedures",06,Diseases and Disorders of the Digestive System,1,Minor,Minor,Surgical,Medicaid,,,,N,Y,7271.73,4688.43
