Hospital Service Area,Hospital County,Operating Certificate Number,Permanent Facility Id,Facility Name,Age Group,Zip Code - 3 digits,Gender,Race,Ethnicity,Length of Stay,Type of Admission,Patient Disposition,Discharge Year,CCS Diagnosis Code,CCS Diagnosis Description,CCS Procedure Code,CCS Procedure Description,APR DRG Code,APR DRG Description,APR MDC Code,APR MDC Description,APR Severity of Illness Code,APR Severity of Illness Description,APR Risk of Mortality,APR Medical Surgical Description,Payment Typology 1,Payment Typology 2,Payment Typology 3,Birth Weight,Abortion Edit Indicator,Emergency Department Indicator,Total Charges,Total Costs
New York City,Manhattan,7002001,001438,Bellevue Hospital Center,30 to 49,113,M,Other Race,Not Span/Hispanic,6,Emergency,Home or Self Care,2019,DIG010,ABDOMINAL HERNIA,GNR003,INGUINAL AND FEMORAL HERNIA REPAIR,228,"INGUINAL, FEMORAL & UMBILICAL HERNIA PROCEDURES",06,DISEASES AND DISORDERS OF THE DIGESTIVE SYSTEM,3,Major,Minor,Surgical,Medicaid,,,,,true,33670.59,22377.47
New York City,Manhattan,7002001,001438,Bellevue Hospital Center,70 or Older,114,M,Black/African American,Not Span/Hispanic,4,Emergency,Home or Self Care,2019,DIG010,ABDOMINAL HERNIA,GNR002,ABDOMINAL WALL REPAIR (INCLUDING HERNIA),228,"INGUINAL, FEMORAL & UMBILICAL HERNIA PROCEDURES",06,DISEASES AND DISORDERS OF THE DIGESTIVE SYSTEM,3,Major,Moderate,Surgical,Medicaid,,,,,false,22235.59,14777.77
New York City,Manhattan,7002001,001438,Bellevue Hospital Center,30 to 49,100,M,Black/African American,Not Span/Hispanic,3,Emergency,Home or Self Care,2019,DIG010,ABDOMINAL HERNIA,GNR003,INGUINAL AND FEMORAL HERNIA REPAIR,228,"INGUINAL, FEMORAL & UMBILICAL HERNIA PROCEDURES",06,DISEASES AND DISORDERS OF THE DIGESTIVE SYSTEM,2,Moderate,Minor,Surgical,Medicaid,,,,,false,17258.35,11469.9
New York City,Manhattan,7002001,001438,Bellevue Hospital Center,30 to 49,113,M,Other Race,Not Span/Hispanic,3,Elective,Home or Self Care,2019,DIG010,ABDOMINAL HERNIA,GNR003,INGUINAL AND FEMORAL HERNIA REPAIR,228,"INGUINAL, FEMORAL & UMBILICAL HERNIA PROCEDURES",06,DISEASES AND DISORDERS OF THE DIGESTIVE SYSTEM,1,Minor,Minor,Surgical,Department of Corrections,,,,,false,17166.42,11408.8
New York City,Manhattan,7002001,001438,Bellevue Hospital Center,50 to 69,104,M,Black/African American,Not Span/Hispanic,3,Emergency,Home or Self Care,2019,DIG010,ABDOMINAL HERNIA,GNR003,INGUINAL AND FEMORAL HERNIA REPAIR,228,"INGUINAL, FEMORAL & UMBILICAL HERNIA PROCEDURES",06,DISEASES AND DISORDERS OF THE DIGESTIVE SYSTEM,1,Minor,Minor,Surgical,Department of Corrections,,,,,false,17161.11,11405.27
New York City,Manhattan,7002001,001438,Bellevue Hospital Center,30 to 49,113,M,Other Race,Spanish/Hispanic,2,Emergency,Home or Self Care,2019,DIG010,ABDOMINAL HERNIA,GNR002,ABDOMINAL WALL REPAIR (INCLUDING HERNIA),228,"INGUINAL, FEMORAL & UMBILICAL HERNIA PROCEDURES",06,DISEASES AND DISORDERS OF THE DIGESTIVE SYSTEM,2,Moderate,Minor,Surgical,Medicaid,,,,,true,13156.43,8743.76
New York City,Manhattan,7002001,001438,Bellevue Hospital Center,0 to 17,112,M,Other Race,Not Span/Hispanic,1,Elective,Home or Self Care,2019,DIG010,ABDOMINAL HERNIA,GNR003,INGUINAL AND FEMORAL HERNIA REPAIR,228,"INGUINAL, FEMORAL & UMBILICAL HERNIA PROCEDURES",06,DISEASES AND DISORDERS OF THE DIGESTIVE SYSTEM,1,Minor,Minor,Surgical,Medicaid,Medicaid,,,,false,6200,4120.52
New York City,Manhattan,7002001,001438,Bellevue Hospital Center,70 or Older,100,M,Black/African American,Not Span/Hispanic,9,Emergency,Skilled Nursing Home,2019,DIG010,ABDOMINAL HERNIA,GNR003,INGUINAL AND FEMORAL HERNIA REPAIR,228,"INGUINAL, FEMORAL & UMBILICAL HERNIA PROCEDURES",06,DISEASES AND DISORDERS OF THE DIGESTIVE SYSTEM,3,Major,Major,Surgical,Medicare,Medicare,Medicaid,,,true,57551.2,38248.53
New York City,Manhattan,7002001,001438,Bellevue Hospital Center,30 to 49,112,M,Other Race,Spanish/Hispanic,2,Emergency,Home or Self Care,2019,DIG010,ABDOMINAL HERNIA,GNR003,INGUINAL AND FEMORAL HERNIA REPAIR,228,"INGUINAL, FEMORAL & UMBILICAL HERNIA PROCEDURES",06,DISEASES AND DISORDERS OF THE DIGESTIVE SYSTEM,1,Minor,Minor,Surgical,Medicaid,Medicaid,,,,true,14843.32,9864.87
New York City,Manhattan,7002001,001438,Bellevue Hospital Center,0 to 17,,M,Other Race,Not Span/Hispanic,1,Emergency,Home or Self Care,2019,DIG010,ABDOMINAL HERNIA,GNR003,INGUINAL AND FEMORAL HERNIA REPAIR,228,"INGUINAL, FEMORAL & UMBILICAL HERNIA PROCEDURES",06,DISEASES AND DISORDERS OF THE DIGESTIVE SYSTEM,2,Moderate,Minor,Surgical,Private Health Insurance,,,,,true,8409.8,5589.15
New York City,Manhattan,7002001,001438,Bellevue Hospital Center,50 to 69,100,M,Other Race,Not Span/Hispanic,4,Emergency,Home or Self Care,2019,DIG010,ABDOMINAL HERNIA,GNR003,INGUINAL AND FEMORAL HERNIA REPAIR,228,"INGUINAL, FEMORAL & UMBILICAL HERNIA PROCEDURES",06,DISEASES AND DISORDERS OF THE DIGESTIVE SYSTEM,1,Minor,Minor,Surgical,Medicaid,Medicaid,,,,false,22418.07,14899.05
New York City,Manhattan,7002001,001438,Bellevue Hospital Center,50 to 69,114,M,Other Race,Not Span/Hispanic,24,Urgent,Home w/ Home Health Services,2019,DIG010,ABDOMINAL HERNIA,GNR003,INGUINAL AND FEMORAL HERNIA REPAIR,228,"INGUINAL, FEMORAL & UMBILICAL HERNIA PROCEDURES",06,DISEASES AND DISORDERS OF THE DIGESTIVE SYSTEM,3,Major,Major,Surgical,Medicaid,,,,,false,271235.43,180263.07
New York City,Manhattan,7002001,001438,Bellevue Hospital Center,70 or Older,112,M,Other Race,Unknown,1,Urgent,Home or Self Care,2019,DIG010,ABDOMINAL HERNIA,GNR003,INGUINAL AND FEMORAL HERNIA REPAIR,228,"INGUINAL, FEMORAL & UMBILICAL HERNIA PROCEDURES",06,DISEASES AND DISORDERS OF THE DIGESTIVE SYSTEM,3,Major,Moderate,Surgical,Medicaid,,,,,true,29353.48,19508.32
New York City,Manhattan,7002001,001438,Bellevue Hospital Center,50 to 69,104,M,Black/African American,Not Span/Hispanic,1,Elective,Home or Self Care,2019,DIG010,ABDOMINAL HERNIA,GNR003,INGUINAL AND FEMORAL HERNIA REPAIR,228,"INGUINAL, FEMORAL & UMBILICAL HERNIA PROCEDURES",06,DISEASES AND DISORDERS OF THE DIGESTIVE SYSTEM,1,Minor,Minor,Surgical,Private Health Insurance,,,,,false,20959.01,13929.36
New York City,Manhattan,7002001,001438,Bellevue Hospital Center,70 or Older,112,M,White,Not Span/Hispanic,1,Elective,Home or Self Care,2019,DIG010,ABDOMINAL HERNIA,GNR003,INGUINAL AND FEMORAL HERNIA REPAIR,228,"INGUINAL, FEMORAL & UMBILICAL HERNIA PROCEDURES",06,DISEASES AND DISORDERS OF THE DIGESTIVE SYSTEM,1,Minor,Minor,Surgical,Self-Pay,,,,,false,21920.01,14568.04
New York City,Manhattan,7002001,001438,Bellevue Hospital Center,0 to 17,112,M,Other Race,Spanish/Hispanic,1,Elective,Home or Self Care,2019,DIG010,ABDOMINAL HERNIA,GIS008,APPENDECTOMY,228,"INGUINAL, FEMORAL & UMBILICAL HERNIA PROCEDURES",06,DISEASES AND DISORDERS OF THE DIGESTIVE SYSTEM,2,Moderate,Minor,Surgical,Medicaid,,,,,false,23336.99,15509.76
New York City,Manhattan,7002001,001438,Bellevue Hospital Center,30 to 49,113,M,Other Race,Unknown,2,Elective,Home or Self Care,2019,DIG010,ABDOMINAL HERNIA,GNR002,ABDOMINAL WALL REPAIR (INCLUDING HERNIA),228,"INGUINAL, FEMORAL & UMBILICAL HERNIA PROCEDURES",06,DISEASES AND DISORDERS OF THE DIGESTIVE SYSTEM,3,Major,Moderate,Surgical,Private Health Insurance,,,,,false,32967.96,21910.51
New York City,Manhattan,7002001,001438,Bellevue Hospital Center,30 to 49,112,M,Black/African American,Spanish/Hispanic,3,Emergency,Home or Self Care,2019,DIG010,ABDOMINAL HERNIA,GNR003,INGUINAL AND FEMORAL HERNIA REPAIR,228,"INGUINAL, FEMORAL & UMBILICAL HERNIA PROCEDURES",06,DISEASES AND DISORDERS OF THE DIGESTIVE SYSTEM,1,Minor,Minor,Surgical,Medicaid,,,,,true,39951.12,26551.51
New York City,Manhattan,7002001,001438,Bellevue Hospital Center,0 to 17,104,M,Other Race,Spanish/Hispanic,1,Elective,Home or Self Care,2019,DIG010,ABDOMINAL HERNIA,GNR003,INGUINAL AND FEMORAL HERNIA REPAIR,228,"INGUINAL, FEMORAL & UMBILICAL HERNIA PROCEDURES",06,DISEASES AND DISORDERS OF THE DIGESTIVE SYSTEM,1,Minor,Minor,Surgical,Medicaid,,,,,false,12545.01,8337.41
New York City,Manhattan,7002001,001438,Bellevue Hospital Center,18 to 29,100,M,White,Not Span/Hispanic,1,Elective,Home or Self Care,2019,DIG010,ABDOMINAL HERNIA,GNR003,INGUINAL AND FEMORAL HERNIA REPAIR,228,"INGUINAL, FEMORAL & UMBILICAL HERNIA PROCEDURES",06,DISEASES AND DISORDERS OF THE DIGESTIVE SYSTEM,1,Minor,Minor,Surgical,Medicaid,,,,,false,15876.39,10551.45
New York City,Manhattan,7002001,001438,Bellevue Hospital Center,70 or Older,104,M,Other Race,Spanish/Hispanic,3,Emergency,Home w/ Home Health Services,2019,DIG010,ABDOMINAL HERNIA,GNR003,INGUINAL AND FEMORAL HERNIA REPAIR,228,"INGUINAL, FEMORAL & UMBILICAL HERNIA PROCEDURES",06,DISEASES AND DISORDERS OF THE DIGESTIVE SYSTEM,1,Minor,Minor,Surgical,Medicaid,,,,,true,88839.41,59042.67
New York City,Manhattan,7002001,001438,Bellevue Hospital Center,30 to 49,112,M,Other Race,Spanish/Hispanic,13,Emergency,Home or Self Care,2019,DIG010,ABDOMINAL HERNIA,GNR002,ABDOMINAL WALL REPAIR (INCLUDING HERNIA),228,"INGUINAL, FEMORAL & UMBILICAL HERNIA PROCEDURES",06,DISEASES AND DISORDERS OF THE DIGESTIVE SYSTEM,3,Major,Moderate,Surgical,Medicaid,,,,,true,164261.49,109168.19
New York City,Manhattan,7002001,001438,Bellevue Hospital Center,30 to 49,112,M,Black/African American,Not Span/Hispanic,1,Emergency,Home or Self Care,2019,DIG010,ABDOMINAL HERNIA,GNR003,INGUINAL AND FEMORAL HERNIA REPAIR,228,"INGUINAL, FEMORAL & UMBILICAL HERNIA PROCEDURES",06,DISEASES AND DISORDERS OF THE DIGESTIVE SYSTEM,1,Minor,Minor,Surgical,Medicaid,,,,,true,27388.27,18202.24
New York City,Manhattan,7002001,001438,Bellevue Hospital Center,70 or Older,100,M,Other Race,Spanish/Hispanic,4,Emergency,Home or Self Care,2019,DIG010,ABDOMINAL HERNIA,GNR003,INGUINAL AND FEMORAL HERNIA REPAIR,228,"INGUINAL, FEMORAL & UMBILICAL HERNIA PROCEDURES",06,DISEASES AND DISORDERS OF THE DIGESTIVE SYSTEM,2,Moderate,Minor,Surgical,Self-Pay,,,,,true,55561.79,36926.37
New York City,Manhattan,7002001,001438,Bellevue Hospital Center,50 to 69,100,M,Black/African American,Unknown,3,Elective,Home or Self Care,2019,DIG010,ABDOMINAL HERNIA,GNR003,INGUINAL AND FEMORAL HERNIA REPAIR,228,"INGUINAL, FEMORAL & UMBILICAL HERNIA PROCEDURES",06,DISEASES AND DISORDERS OF THE DIGESTIVE SYSTEM,1,Minor,Minor,Surgical,Medicare,,,,,false,28022.95,18624.05
New York City,Manhattan,7002001,001438,Bellevue Hospital Center,50 to 69,100,F,Other Race,Spanish/Hispanic,1,Emergency,Home or Self Care,2019,DIG010,ABDOMINAL HERNIA,GNR003,INGUINAL AND FEMORAL HERNIA REPAIR,228,"INGUINAL, FEMORAL & UMBILICAL HERNIA PROCEDURES",06,DISEASES AND DISORDERS OF THE DIGESTIVE SYSTEM,1,Minor,Minor,Surgical,Medicare,Medicaid,,,,true,22271.68,14801.76
New York City,Manhattan,7002001,001438,Bellevue Hospital Center,70 or Older,104,M,Other Race,Spanish/Hispanic,56,Elective,Home or Self Care,2019,DIG010,ABDOMINAL HERNIA,GNR003,INGUINAL AND FEMORAL HERNIA REPAIR,228,"INGUINAL, FEMORAL & UMBILICAL HERNIA PROCEDURES",06,DISEASES AND DISORDERS OF THE DIGESTIVE SYSTEM,4,Extreme,Extreme,Surgical,Medicare,,,,,false,454434.88,302017.42
New York City,Manhattan,7002001,001438,Bellevue Hospital Center,50 to 69,113,M,Other Race,Unknown,5,Emergency,Home or Self Care,2019,DIG010,ABDOMINAL HERNIA,GNR003,INGUINAL AND FEMORAL HERNIA REPAIR,228,"INGUINAL, FEMORAL & UMBILICAL HERNIA PROCEDURES",06,DISEASES AND DISORDERS OF THE DIGESTIVE SYSTEM,2,Moderate,Minor,Surgical,Medicaid,,,,,true,57249.33,38047.9
New York City,Manhattan,7002001,001438,Bellevue Hospital Center,50 to 69,113,M,Other Race,Not Span/Hispanic,2,Elective,Court/Law Enforcement,2019,DIG010,ABDOMINAL HERNIA,GNR003,INGUINAL AND FEMORAL HERNIA REPAIR,228,"INGUINAL, FEMORAL & UMBILICAL HERNIA PROCEDURES",06,DISEASES AND DISORDERS OF THE DIGESTIVE SYSTEM,2,Moderate,Minor,Surgical,Medicaid,,,,,false,23924.46,15900.2
New York City,Manhattan,7002001,001438,Bellevue Hospital Center,50 to 69,100,M,Black/African American,Not Span/Hispanic,3,Urgent,Court/Law Enforcement,2019,DIG010,ABDOMINAL HERNIA,GNR003,INGUINAL AND FEMORAL HERNIA REPAIR,228,"INGUINAL, FEMORAL & UMBILICAL HERNIA PROCEDURES",06,DISEASES AND DISORDERS OF THE DIGESTIVE SYSTEM,2,Moderate,Minor,Surgical,Medicaid,,,,,false,30764.87,20446.33
New York City,Manhattan,7002001,001438,Bellevue Hospital Center,30 to 49,104,M,Other Race,Unknown,2,Urgent,Court/Law Enforcement,2019,DIG010,ABDOMINAL HERNIA,GNR003,INGUINAL AND FEMORAL HERNIA REPAIR,228,"INGUINAL, FEMORAL & UMBILICAL HERNIA PROCEDURES",06,DISEASES AND DISORDERS OF THE DIGESTIVE SYSTEM,1,Minor,Minor,Surgical,Medicaid,,,,,false,25303.83,16816.93
New York City,Manhattan,7002001,001438,Bellevue Hospital Center,30 to 49,113,M,White,Not Span/Hispanic,3,Elective,Court/Law Enforcement,2019,DIG010,ABDOMINAL HERNIA,GNR003,INGUINAL AND FEMORAL HERNIA REPAIR,228,"INGUINAL, FEMORAL & UMBILICAL HERNIA PROCEDURES",06,DISEASES AND DISORDERS OF THE DIGESTIVE SYSTEM,2,Moderate,Minor,Surgical,Medicaid,,,,,false,29176.5,19390.7
New York City,Manhattan,7002001,001438,Bellevue Hospital Center,50 to 69,113,M,Other Race,Unknown,2,Urgent,Court/Law Enforcement,2019,DIG010,ABDOMINAL HERNIA,GNR003,INGUINAL AND FEMORAL HERNIA REPAIR,228,"INGUINAL, FEMORAL & UMBILICAL HERNIA PROCEDURES",06,DISEASES AND DISORDERS OF THE DIGESTIVE SYSTEM,1,Minor,Minor,Surgical,Medicaid,,,,,false,20702.97,13759.19
New York City,Manhattan,7002001,001438,Bellevue Hospital Center,30 to 49,112,M,White,Not Span/Hispanic,1,Emergency,Home or Self Care,2019,DIG010,ABDOMINAL HERNIA,GNR003,INGUINAL AND FEMORAL HERNIA REPAIR,228,"INGUINAL, FEMORAL & UMBILICAL HERNIA PROCEDURES",06,DISEASES AND DISORDERS OF THE DIGESTIVE SYSTEM,1,Minor,Minor,Surgical,Medicaid,,,,,true,21291.46,14150.3
New York City,Manhattan,7002001,001438,Bellevue Hospital Center,18 to 29,113,M,Other Race,Not Span/Hispanic,2,Elective,Home or Self Care,2019,DIG010,ABDOMINAL HERNIA,GNR003,INGUINAL AND FEMORAL HERNIA REPAIR,228,"INGUINAL, FEMORAL & UMBILICAL HERNIA PROCEDURES",06,DISEASES AND DISORDERS OF THE DIGESTIVE SYSTEM,1,Minor,Minor,Surgical,Medicaid,,,,,false,28640.39,19034.4
New York City,Manhattan,7002001,001438,Bellevue Hospital Center,30 to 49,113,M,Other Race,Unknown,1,Elective,Court/Law Enforcement,2019,DIG010,ABDOMINAL HERNIA,GNR002,ABDOMINAL WALL REPAIR (INCLUDING HERNIA),228,"INGUINAL, FEMORAL & UMBILICAL HERNIA PROCEDURES",06,DISEASES AND DISORDERS OF THE DIGESTIVE SYSTEM,1,Minor,Minor,Surgical,Medicaid,,,,,false,21657.79,14393.77
