Hospital Service Area,Hospital County,Operating Certificate Number,Permanent Facility Id,Facility Name,Age Group,Zip Code - 3 digits,Gender,Race,Ethnicity,Length of Stay,Type of Admission,Patient Disposition,Discharge Year,CCS Diagnosis Code,CCS Diagnosis Description,CCS Procedure Code,CCS Procedure Description,APR DRG Code,APR DRG Description,APR MDC Code,APR MDC Description,APR Severity of Illness Code,APR Severity of Illness Description,APR Risk of Mortality,APR Medical Surgical Description,Payment Typology 1,Payment Typology 2,Payment Typology 3,Birth Weight,Abortion Edit Indicator,Emergency Department Indicator,Total Charges,Total Costs
Finger Lakes,Monroe,2701003,000411,Rochester General Hospital,30 to 49,144,F,White,Not Span/Hispanic,3,Elective,Home or Self Care,2018,DIG024,POSTPROCEDURAL OR POSTOPERATIVE DIGESTIVE SYSTEM COMPLICATION,GNR008,"ABDOMINAL WALL PROCEDURES, NEC",229,OTHER DIGESTIVE SYSTEM & ABDOMINAL PROCEDURES,06,DISEASES AND DISORDERS OF THE DIGESTIVE SYSTEM,2,Moderate,Minor,Surgical,Blue Cross/Blue Shield,,,,,false,13365.01,5857.42
New York City,Manhattan,7002020,001453,Memorial Hospital for Cancer and Allied Diseases,70 or Older,112,F,White,Not Span/Hispanic,2,Elective,Home w/ Home Health Services,2018,NEO070,SECONDARY MALIGNANCIES,MST019,"MUSCLE, TENDON, BURSA, AND LIGAMENT EXCISION",229,OTHER DIGESTIVE SYSTEM & ABDOMINAL PROCEDURES,06,DISEASES AND DISORDERS OF THE DIGESTIVE SYSTEM,2,Moderate,Moderate,Surgical,Medicare,,,,,false,40068.93,16967.16
New York City,Manhattan,7002002,001439,Mount Sinai Beth Israel,70 or Older,100,F,Other Race,Unknown,8,Emergency,Home w/ Home Health Services,2018,DIG013,DIVERTICULOSIS AND DIVERTICULITIS,CAR010,LIGATION AND EMBOLIZATION OF VESSELS,229,OTHER DIGESTIVE SYSTEM & ABDOMINAL PROCEDURES,06,DISEASES AND DISORDERS OF THE DIGESTIVE SYSTEM,3,Major,Major,Surgical,Medicare,Miscellaneous/Other,Medicaid,,,true,119384.36,30434.55
Central NY,Onondaga,3301003,000630,St. Joseph's Hospital Health Center,30 to 49,132,F,Black/African American,Not Span/Hispanic,13,Urgent,Home w/ Home Health Services,2018,DIG016,PERITONITIS AND INTRA-ABDOMINAL ABSCESS,MST004,INCISION AND DRAINAGE OF MUSCULOSKELETAL TISSUE AND JOINTS,229,OTHER DIGESTIVE SYSTEM & ABDOMINAL PROCEDURES,06,DISEASES AND DISORDERS OF THE DIGESTIVE SYSTEM,3,Major,Moderate,Surgical,Medicaid,,,,,false,44444.61,19357.89
New York City,Queens,7003007,001633,Queens Hospital Center,70 or Older,114,F,Other Race,Unknown,2,Elective,Home w/ Home Health Services,2018,SYM006,ABDOMINAL PAIN AND OTHER DIGESTIVE/ABDOMEN SIGNS AND SYMPTOMS,GNR008,"ABDOMINAL WALL PROCEDURES, NEC",229,OTHER DIGESTIVE SYSTEM & ABDOMINAL PROCEDURES,06,DISEASES AND DISORDERS OF THE DIGESTIVE SYSTEM,2,Moderate,Moderate,Surgical,Medicare,Medicare,,,,false,24232.99,12939.67
New York City,Bronx,7000006,001169,Montefiore Medical Center - Henry & Lucy Moses Div,50 to 69,104,F,Multi-racial,Unknown,7,Emergency,Home or Self Care,2018,NEO073,BENIGN NEOPLASMS,CAR011,ANEURYSM REPAIR PROCEDURES,229,OTHER DIGESTIVE SYSTEM & ABDOMINAL PROCEDURES,06,DISEASES AND DISORDERS OF THE DIGESTIVE SYSTEM,3,Major,Moderate,Surgical,Medicaid,,,,,true,121967.78,19800.68
Long Island,Nassau,2950001,000527,Mount Sinai South Nassau,50 to 69,115,M,White,Not Span/Hispanic,5,Emergency,Home or Self Care,2018,DIG025,OTHER SPECIFIED AND UNSPECIFIED GASTROINTESTINAL DISORDERS,GIS006,PARACENTESIS,229,OTHER DIGESTIVE SYSTEM & ABDOMINAL PROCEDURES,06,DISEASES AND DISORDERS OF THE DIGESTIVE SYSTEM,3,Major,Major,Surgical,Medicare,Medicare,,,,true,102096.36,9961.05
New York City,Manhattan,7002020,001453,Memorial Hospital for Cancer and Allied Diseases,50 to 69,OOS,F,White,Not Span/Hispanic,5,Emergency,Home or Self Care,2018,NEO070,SECONDARY MALIGNANCIES,GIS003,GI SYSTEM BIOPSY (NON-ENDOSCOPIC),229,OTHER DIGESTIVE SYSTEM & ABDOMINAL PROCEDURES,06,DISEASES AND DISORDERS OF THE DIGESTIVE SYSTEM,2,Moderate,Moderate,Surgical,Blue Cross/Blue Shield,,,,,true,59758.78,25057.56
Long Island,Suffolk,5149000,000895,John T Mather Memorial Hospital of Port Jefferson New York Inc,50 to 69,119,M,White,Not Span/Hispanic,19,Emergency,Home w/ Home Health Services,2018,DIG016,PERITONITIS AND INTRA-ABDOMINAL ABSCESS,GNR009,"RETROPERITONEAL PROCEDURES, NEC",229,OTHER DIGESTIVE SYSTEM & ABDOMINAL PROCEDURES,06,DISEASES AND DISORDERS OF THE DIGESTIVE SYSTEM,3,Major,Major,Surgical,Medicare,Medicare,Blue Cross/Blue Shield,,,true,250696.39,59200.28
Long Island,Nassau,2908000,000511,NYU Langone Hospital-Long Island,50 to 69,115,M,Black/African American,Not Span/Hispanic,4,Emergency,Home or Self Care,2018,NEO073,BENIGN NEOPLASMS,GIS015,OMENTECTOMY OR PERITONEUM RESECTION,229,OTHER DIGESTIVE SYSTEM & ABDOMINAL PROCEDURES,06,DISEASES AND DISORDERS OF THE DIGESTIVE SYSTEM,2,Moderate,Minor,Surgical,Blue Cross/Blue Shield,,,,,true,161793.54,24097.02
Western NY,Erie,1401010,000216,Roswell Park Cancer Institute,50 to 69,143,M,White,Not Span/Hispanic,3,Elective,Home or Self Care,2018,NEO070,SECONDARY MALIGNANCIES,HEP005,PANCREATECTOMY,229,OTHER DIGESTIVE SYSTEM & ABDOMINAL PROCEDURES,06,DISEASES AND DISORDERS OF THE DIGESTIVE SYSTEM,1,Minor,Moderate,Surgical,Private Health Insurance,,,,,false,52593.57,19620.86
New York City,Kings,7001021,001306,New York - Presbyterian Brooklyn Methodist Hospital,30 to 49,112,M,Black/African American,Not Span/Hispanic,6,Emergency,Home or Self Care,2018,DIG009,APPENDICITIS AND OTHER APPENDICEAL CONDITIONS,GIS005,EXPLORATION OF PERITONEAL CAVITY,229,OTHER DIGESTIVE SYSTEM & ABDOMINAL PROCEDURES,06,DISEASES AND DISORDERS OF THE DIGESTIVE SYSTEM,1,Minor,Minor,Surgical,Blue Cross/Blue Shield,Self-Pay,,,,true,48300,14387.94
New York City,Kings,7001021,001306,New York - Presbyterian Brooklyn Methodist Hospital,50 to 69,112,M,Other Race,Not Span/Hispanic,6,Elective,Home or Self Care,2018,NEO015,GASTROINTESTINAL CANCERS - COLORECTAL,GIS016,GI SYSTEM ENDOSCOPIC THERAPEUTIC PROCEDURES,229,OTHER DIGESTIVE SYSTEM & ABDOMINAL PROCEDURES,06,DISEASES AND DISORDERS OF THE DIGESTIVE SYSTEM,2,Moderate,Moderate,Surgical,Private Health Insurance,Self-Pay,,,,false,60470.23,22981.65
New York City,Queens,7003007,001633,Queens Hospital Center,70 or Older,114,M,Black/African American,Not Span/Hispanic,14,Emergency,Home or Self Care,2018,DIG012,INTESTINAL OBSTRUCTION AND ILEUS,GIS007,GI SYSTEM DRAINAGE (EXCLUDING PARACENTESIS),229,OTHER DIGESTIVE SYSTEM & ABDOMINAL PROCEDURES,06,DISEASES AND DISORDERS OF THE DIGESTIVE SYSTEM,3,Major,Major,Surgical,Medicare,,,,,true,116180.36,62036.71
Finger Lakes,Monroe,2701005,000413,Strong Memorial Hospital,70 or Older,146,M,White,Not Span/Hispanic,4,Emergency,Home w/ Home Health Services,2018,DIG016,PERITONITIS AND INTRA-ABDOMINAL ABSCESS,GNR008,"ABDOMINAL WALL PROCEDURES, NEC",229,OTHER DIGESTIVE SYSTEM & ABDOMINAL PROCEDURES,06,DISEASES AND DISORDERS OF THE DIGESTIVE SYSTEM,2,Moderate,Moderate,Surgical,Medicare,Medicare,Self-Pay,,,true,17821.68,7132.56
New York City,Manhattan,7002001,001438,Bellevue Hospital Center,70 or Older,104,F,Other Race,Not Span/Hispanic,34,Emergency,Skilled Nursing Home,2018,DIG021,GASTROINTESTINAL HEMORRHAGE,CAR010,LIGATION AND EMBOLIZATION OF VESSELS,229,OTHER DIGESTIVE SYSTEM & ABDOMINAL PROCEDURES,06,DISEASES AND DISORDERS OF THE DIGESTIVE SYSTEM,4,Extreme,Extreme,Surgical,Medicare,Medicare,Medicaid,,,false,201598.9,133982.63
New York City,Manhattan,7002054,001464,New York-Presbyterian Hospital - Columbia Presbyterian Center,70 or Older,100,M,Black/African American,Spanish/Hispanic,14,Emergency,Home w/ Home Health Services,2018,DIG013,DIVERTICULOSIS AND DIVERTICULITIS,GIS004,GI SYSTEM ENDOSCOPY WITHOUT BIOPSY (DIAGNOSTIC),229,OTHER DIGESTIVE SYSTEM & ABDOMINAL PROCEDURES,06,DISEASES AND DISORDERS OF THE DIGESTIVE SYSTEM,4,Extreme,Extreme,Surgical,Medicare,Medicare,Medicaid,,,true,303190.93,96572.19
New York City,Bronx,7000006,003058,Montefiore Med Center - Jack D Weiler Hosp of A Einstein College Div,70 or Older,104,M,Multi-racial,Spanish/Hispanic,15,Emergency,Home w/ Home Health Services,2018,DIG025,OTHER SPECIFIED AND UNSPECIFIED GASTROINTESTINAL DISORDERS,CAR008,ANGIOPLASTY AND RELATED VESSEL PROCEDURES (ENDOVASCULAR; EXCLUDING CAROTID),229,OTHER DIGESTIVE SYSTEM & ABDOMINAL PROCEDURES,06,DISEASES AND DISORDERS OF THE DIGESTIVE SYSTEM,3,Major,Major,Surgical,Medicare,,,,,true,262560.55,49099.02
New York City,Manhattan,7002054,001464,New York-Presbyterian Hospital - Columbia Presbyterian Center,70 or Older,121,M,White,Not Span/Hispanic,3,Urgent,Home w/ Home Health Services,2018,DIG016,PERITONITIS AND INTRA-ABDOMINAL ABSCESS,GIS024,OTHER PERITONEAL CAVITY PROCEDURES,229,OTHER DIGESTIVE SYSTEM & ABDOMINAL PROCEDURES,06,DISEASES AND DISORDERS OF THE DIGESTIVE SYSTEM,3,Major,Major,Surgical,Medicare,Private Health Insurance,Self-Pay,,,false,54244.56,13840.39
Capital/Adirond,Albany,0101004,000005,St. Peter's Hospital,70 or Older,120,F,White,Not Span/Hispanic,8,Emergency,Home w/ Home Health Services,2018,DIG013,DIVERTICULOSIS AND DIVERTICULITIS,GIS004,GI SYSTEM ENDOSCOPY WITHOUT BIOPSY (DIAGNOSTIC),229,OTHER DIGESTIVE SYSTEM & ABDOMINAL PROCEDURES,06,DISEASES AND DISORDERS OF THE DIGESTIVE SYSTEM,2,Moderate,Minor,Surgical,Medicare,Medicare,,,,true,111156.97,35622.14
Capital/Adirond,Albany,0101004,000005,St. Peter's Hospital,50 to 69,122,F,Black/African American,Not Span/Hispanic,8,Emergency,Home or Self Care,2018,DIG013,DIVERTICULOSIS AND DIVERTICULITIS,GIS005,EXPLORATION OF PERITONEAL CAVITY,229,OTHER DIGESTIVE SYSTEM & ABDOMINAL PROCEDURES,06,DISEASES AND DISORDERS OF THE DIGESTIVE SYSTEM,4,Extreme,Extreme,Surgical,Medicare,Medicaid,,,,true,69617.25,22456.84
New York City,Kings,7001020,001305,Maimonides Medical Center,30 to 49,112,F,Other Race,Not Span/Hispanic,1,Elective,Home or Self Care,2018,DIG025,OTHER SPECIFIED AND UNSPECIFIED GASTROINTESTINAL DISORDERS,GIS005,EXPLORATION OF PERITONEAL CAVITY,229,OTHER DIGESTIVE SYSTEM & ABDOMINAL PROCEDURES,06,DISEASES AND DISORDERS OF THE DIGESTIVE SYSTEM,1,Minor,Minor,Surgical,Blue Cross/Blue Shield,Self-Pay,,,,false,36954.01,13573.98
New York City,Kings,7001020,001305,Maimonides Medical Center,50 to 69,112,M,Other Race,Not Span/Hispanic,5,Elective,Home or Self Care,2018,NEO070,SECONDARY MALIGNANCIES,GIS003,GI SYSTEM BIOPSY (NON-ENDOSCOPIC),229,OTHER DIGESTIVE SYSTEM & ABDOMINAL PROCEDURES,06,DISEASES AND DISORDERS OF THE DIGESTIVE SYSTEM,2,Moderate,Moderate,Surgical,Medicaid,Medicaid,Self-Pay,,,false,90930.05,29225.48
Long Island,Nassau,2909000,000513,Mercy Hospital,30 to 49,115,M,Other Race,Spanish/Hispanic,15,Emergency,Home or Self Care,2018,CIR039,OTHER SPECIFIED DISEASES OF VEINS AND LYMPHATICS,GIS025,OTHER GI SYSTEM DEVICE PROCEDURES,229,OTHER DIGESTIVE SYSTEM & ABDOMINAL PROCEDURES,06,DISEASES AND DISORDERS OF THE DIGESTIVE SYSTEM,3,Major,Major,Surgical,Medicaid,,,,,true,206677.6,39365.88
Long Island,Nassau,2953000,000563,St. Francis Hospital & Heart Center,50 to 69,118,F,White,Not Span/Hispanic,5,Elective,Home or Self Care,2018,NEO072,NEOPLASMS OF UNSPECIFIED NATURE OR UNCERTAIN BEHAVIOR,HEP005,PANCREATECTOMY,229,OTHER DIGESTIVE SYSTEM & ABDOMINAL PROCEDURES,06,DISEASES AND DISORDERS OF THE DIGESTIVE SYSTEM,1,Minor,Minor,Surgical,Medicare,Blue Cross/Blue Shield,,,,false,85597.66,15718.24
New York City,Queens,7003004,001630,Long Island Jewish Medical Center,50 to 69,113,F,Other Race,Spanish/Hispanic,1,Urgent,Home or Self Care,2018,SYM006,ABDOMINAL PAIN AND OTHER DIGESTIVE/ABDOMEN SIGNS AND SYMPTOMS,LYM002,LYMPH NODE EXCISION (THERAPEUTIC),229,OTHER DIGESTIVE SYSTEM & ABDOMINAL PROCEDURES,06,DISEASES AND DISORDERS OF THE DIGESTIVE SYSTEM,1,Minor,Minor,Surgical,Medicaid,Medicaid,Self-Pay,,,false,57118.18,13705.54
New York City,Manhattan,7002032,001466,Mount Sinai West,30 to 49,100,F,White,Not Span/Hispanic,4,Emergency,Home or Self Care,2018,DIG012,INTESTINAL OBSTRUCTION AND ILEUS,GIS005,EXPLORATION OF PERITONEAL CAVITY,229,OTHER DIGESTIVE SYSTEM & ABDOMINAL PROCEDURES,06,DISEASES AND DISORDERS OF THE DIGESTIVE SYSTEM,2,Moderate,Minor,Surgical,Private Health Insurance,Self-Pay,,,,true,60063.42,16578.5
New York City,Manhattan,7002054,001464,New York-Presbyterian Hospital - Columbia Presbyterian Center,30 to 49,104,F,Other Race,Spanish/Hispanic,2,Elective,Home or Self Care,2018,SYM006,ABDOMINAL PAIN AND OTHER DIGESTIVE/ABDOMEN SIGNS AND SYMPTOMS,GNR009,"RETROPERITONEAL PROCEDURES, NEC",229,OTHER DIGESTIVE SYSTEM & ABDOMINAL PROCEDURES,06,DISEASES AND DISORDERS OF THE DIGESTIVE SYSTEM,1,Minor,Minor,Surgical,Blue Cross/Blue Shield,Self-Pay,,,,false,41862.48,8749.02
New York City,Manhattan,7002032,001466,Mount Sinai West,70 or Older,100,F,White,Not Span/Hispanic,10,Emergency,Skilled Nursing Home,2018,DIG021,GASTROINTESTINAL HEMORRHAGE,CAR010,LIGATION AND EMBOLIZATION OF VESSELS,229,OTHER DIGESTIVE SYSTEM & ABDOMINAL PROCEDURES,06,DISEASES AND DISORDERS OF THE DIGESTIVE SYSTEM,4,Extreme,Extreme,Surgical,Medicare,Medicare,Self-Pay,,,true,203461.13,62563.18
New York City,Manhattan,7002032,001466,Mount Sinai West,70 or Older,104,F,Other Race,Spanish/Hispanic,3,Elective,Home or Self Care,2018,NEO070,SECONDARY MALIGNANCIES,GNR009,"RETROPERITONEAL PROCEDURES, NEC",229,OTHER DIGESTIVE SYSTEM & ABDOMINAL PROCEDURES,06,DISEASES AND DISORDERS OF THE DIGESTIVE SYSTEM,3,Major,Moderate,Surgical,Medicare,Medicare,Self-Pay,,,false,60162.98,17148.48
Long Island,Suffolk,5151001,000245,Stony Brook University Hospital,30 to 49,117,M,White,Not Span/Hispanic,3,Emergency,Home or Self Care,2018,DIG022,NONINFECTIOUS GASTROENTERITIS,GIS005,EXPLORATION OF PERITONEAL CAVITY,229,OTHER DIGESTIVE SYSTEM & ABDOMINAL PROCEDURES,06,DISEASES AND DISORDERS OF THE DIGESTIVE SYSTEM,2,Moderate,Minor,Surgical,Medicare,Medicaid,,,,true,57219.37,18752.96
New York City,Bronx,7000001,001178,BronxCare Hospital Center,30 to 49,104,F,Other Race,Spanish/Hispanic,3,Emergency,Home or Self Care,2018,INJ013,"OPEN WOUNDS OF TRUNK, INITIAL ENCOUNTER",MST028,"SUBCUTANEOUS TISSUE AND FASCIA PROCEDURES, NEC",229,OTHER DIGESTIVE SYSTEM & ABDOMINAL PROCEDURES,06,DISEASES AND DISORDERS OF THE DIGESTIVE SYSTEM,1,Minor,Minor,Surgical,Medicaid,Medicaid,,,,true,17025.94,20364
New York City,Manhattan,7002002,001439,Mount Sinai Beth Israel,70 or Older,112,F,Other Race,Not Span/Hispanic,3,Elective,Home w/ Home Health Services,2018,NEO070,SECONDARY MALIGNANCIES,GIS003,GI SYSTEM BIOPSY (NON-ENDOSCOPIC),229,OTHER DIGESTIVE SYSTEM & ABDOMINAL PROCEDURES,06,DISEASES AND DISORDERS OF THE DIGESTIVE SYSTEM,2,Moderate,Major,Surgical,Medicare,Miscellaneous/Other,Medicaid,,,false,43800.94,9161.01
New York City,Manhattan,7002054,001458,New York-Presbyterian Hospital - New York Weill Cornell Center,30 to 49,116,M,Other Race,Not Span/Hispanic,2,Elective,Home or Self Care,2018,SYM006,ABDOMINAL PAIN AND OTHER DIGESTIVE/ABDOMEN SIGNS AND SYMPTOMS,GNR009,"RETROPERITONEAL PROCEDURES, NEC",229,OTHER DIGESTIVE SYSTEM & ABDOMINAL PROCEDURES,06,DISEASES AND DISORDERS OF THE DIGESTIVE SYSTEM,1,Minor,Minor,Surgical,Private Health Insurance,Self-Pay,,,,false,61457.03,15984.89
New York City,Queens,7001024,001635,St Johns Episcopal Hospital So Shore,70 or Older,116,M,White,Not Span/Hispanic,7,Emergency,Home or Self Care,2018,DIG012,INTESTINAL OBSTRUCTION AND ILEUS,GIS005,EXPLORATION OF PERITONEAL CAVITY,229,OTHER DIGESTIVE SYSTEM & ABDOMINAL PROCEDURES,06,DISEASES AND DISORDERS OF THE DIGESTIVE SYSTEM,1,Minor,Minor,Surgical,Medicare,Medicare,Medicaid,,,true,69028.97,19364.26
New York City,Manhattan,7002053,001463,NYU Langone Hospitals,30 to 49,113,M,White,Not Span/Hispanic,2,Emergency,Home or Self Care,2018,DIG009,APPENDICITIS AND OTHER APPENDICEAL CONDITIONS,GIS005,EXPLORATION OF PERITONEAL CAVITY,229,OTHER DIGESTIVE SYSTEM & ABDOMINAL PROCEDURES,06,DISEASES AND DISORDERS OF THE DIGESTIVE SYSTEM,1,Minor,Minor,Surgical,Private Health Insurance,,,,,true,60745.24,15258.39
New York City,Queens,7003004,001630,Long Island Jewish Medical Center,70 or Older,114,F,White,Not Span/Hispanic,2,Elective,Home or Self Care,2018,NEO070,SECONDARY MALIGNANCIES,GIS015,OMENTECTOMY OR PERITONEUM RESECTION,229,OTHER DIGESTIVE SYSTEM & ABDOMINAL PROCEDURES,06,DISEASES AND DISORDERS OF THE DIGESTIVE SYSTEM,2,Moderate,Major,Surgical,Medicare,Private Health Insurance,Self-Pay,,,false,59398.44,13440.85
Western NY,Erie,1401010,000216,Roswell Park Cancer Institute,50 to 69,148,F,White,Not Span/Hispanic,5,Elective,Home or Self Care,2018,NEO070,SECONDARY MALIGNANCIES,GIS015,OMENTECTOMY OR PERITONEUM RESECTION,229,OTHER DIGESTIVE SYSTEM & ABDOMINAL PROCEDURES,06,DISEASES AND DISORDERS OF THE DIGESTIVE SYSTEM,2,Moderate,Moderate,Surgical,Medicare,Medicaid,,,,false,26114.2,10376.63
New York City,Queens,7003004,001630,Long Island Jewish Medical Center,70 or Older,117,M,White,Not Span/Hispanic,5,Elective,Home or Self Care,2018,SYM006,ABDOMINAL PAIN AND OTHER DIGESTIVE/ABDOMEN SIGNS AND SYMPTOMS,GNR009,"RETROPERITONEAL PROCEDURES, NEC",229,OTHER DIGESTIVE SYSTEM & ABDOMINAL PROCEDURES,06,DISEASES AND DISORDERS OF THE DIGESTIVE SYSTEM,2,Moderate,Major,Surgical,Medicare,Medicare,Self-Pay,,,false,81307.82,16681.19
Capital/Adirond,Saratoga,4501000,000818,Saratoga Hospital,50 to 69,128,F,White,Not Span/Hispanic,2,Emergency,Home or Self Care,2018,DIG013,DIVERTICULOSIS AND DIVERTICULITIS,GIS006,PARACENTESIS,229,OTHER DIGESTIVE SYSTEM & ABDOMINAL PROCEDURES,06,DISEASES AND DISORDERS OF THE DIGESTIVE SYSTEM,1,Minor,Minor,Surgical,Medicaid,,,,,true,28566.33,4796.55
New York City,Manhattan,7002032,001466,Mount Sinai West,50 to 69,112,M,Black/African American,Not Span/Hispanic,2,Emergency,Home or Self Care,2018,DIG024,POSTPROCEDURAL OR POSTOPERATIVE DIGESTIVE SYSTEM COMPLICATION,GNR008,"ABDOMINAL WALL PROCEDURES, NEC",229,OTHER DIGESTIVE SYSTEM & ABDOMINAL PROCEDURES,06,DISEASES AND DISORDERS OF THE DIGESTIVE SYSTEM,2,Moderate,Minor,Surgical,Medicare,Medicare,Self-Pay,,,true,24480.52,6242.26
New York City,Richmond,7004010,001738,Richmond University Medical Center,50 to 69,103,F,Black/African American,Not Span/Hispanic,6,Trauma,Psychiatric Hospital or Unit of Hosp,2018,INJ013,"OPEN WOUNDS OF TRUNK, INITIAL ENCOUNTER",ADM001,TRANSFUSION OF BLOOD AND BLOOD PRODUCTS,229,OTHER DIGESTIVE SYSTEM & ABDOMINAL PROCEDURES,06,DISEASES AND DISORDERS OF THE DIGESTIVE SYSTEM,3,Major,Major,Surgical,Medicare,Medicare,Self-Pay,,,true,67887.05,17261.48
Capital/Adirond,Albany,0101000,000001,Albany Medical Center Hospital,70 or Older,124,F,White,Not Span/Hispanic,8,Emergency,Skilled Nursing Home,2018,NEO020,GASTROINTESTINAL CANCERS - PERITONEUM,GIS003,GI SYSTEM BIOPSY (NON-ENDOSCOPIC),229,OTHER DIGESTIVE SYSTEM & ABDOMINAL PROCEDURES,06,DISEASES AND DISORDERS OF THE DIGESTIVE SYSTEM,2,Moderate,Moderate,Surgical,Medicare,Blue Cross/Blue Shield,,,,true,50167.29,17184.62
Hudson Valley,Westchester,5957001,001139,Westchester Medical Center,50 to 69,109,M,Black/African American,Not Span/Hispanic,23,Emergency,Home or Self Care,2018,DIG021,GASTROINTESTINAL HEMORRHAGE,GIS010,GASTRECTOMY,229,OTHER DIGESTIVE SYSTEM & ABDOMINAL PROCEDURES,06,DISEASES AND DISORDERS OF THE DIGESTIVE SYSTEM,3,Major,Major,Surgical,Medicare,,,,,true,558916.53,102437.81
Finger Lakes,Monroe,2701005,000413,Strong Memorial Hospital,50 to 69,146,F,Black/African American,Not Span/Hispanic,1,Elective,Home w/ Home Health Services,2018,DIG025,OTHER SPECIFIED AND UNSPECIFIED GASTROINTESTINAL DISORDERS,CAR008,ANGIOPLASTY AND RELATED VESSEL PROCEDURES (ENDOVASCULAR; EXCLUDING CAROTID),229,OTHER DIGESTIVE SYSTEM & ABDOMINAL PROCEDURES,06,DISEASES AND DISORDERS OF THE DIGESTIVE SYSTEM,3,Major,Major,Surgical,Medicare,Medicaid,Self-Pay,,,false,21747.01,11462.12
Finger Lakes,Monroe,2701003,000411,Rochester General Hospital,30 to 49,146,M,Black/African American,Not Span/Hispanic,2,Emergency,Home or Self Care,2018,DIG007,GASTRITIS AND DUODENITIS,CAR015,PERIPHERAL ARTERIOVENOUS FISTULA AND SHUNT PROCEDURES,229,OTHER DIGESTIVE SYSTEM & ABDOMINAL PROCEDURES,06,DISEASES AND DISORDERS OF THE DIGESTIVE SYSTEM,3,Major,Moderate,Surgical,Medicaid,,,,,true,12952.33,3857.2
Capital/Adirond,Otsego,3824000,000746,Mary Imogene Bassett Hospital,70 or Older,134,M,White,Not Span/Hispanic,3,Emergency,Home or Self Care,2018,DIG001,INTESTINAL INFECTION,LYM001,LYMPH NODE BIOPSY,229,OTHER DIGESTIVE SYSTEM & ABDOMINAL PROCEDURES,06,DISEASES AND DISORDERS OF THE DIGESTIVE SYSTEM,2,Moderate,Moderate,Surgical,Medicare,Private Health Insurance,Private Health Insurance,,,true,17806.97,9324.05
New York City,Manhattan,7002021,001454,Metropolitan Hospital Center,70 or Older,100,F,Other Race,Not Span/Hispanic,23,Emergency,Expired,2018,DIG005,GASTRODUODENAL ULCER,CAR010,LIGATION AND EMBOLIZATION OF VESSELS,229,OTHER DIGESTIVE SYSTEM & ABDOMINAL PROCEDURES,06,DISEASES AND DISORDERS OF THE DIGESTIVE SYSTEM,4,Extreme,Extreme,Surgical,Medicare,Medicare,Medicaid,,,false,164835.48,133178.83
Hudson Valley,Westchester,5902001,001045,White Plains Hospital Center,70 or Older,106,M,Other Race,Not Span/Hispanic,5,Emergency,Home w/ Home Health Services,2018,DIG024,POSTPROCEDURAL OR POSTOPERATIVE DIGESTIVE SYSTEM COMPLICATION,HEP004,HEPATOBILIARY RESECTION AND ABLATION,229,OTHER DIGESTIVE SYSTEM & ABDOMINAL PROCEDURES,06,DISEASES AND DISORDERS OF THE DIGESTIVE SYSTEM,2,Moderate,Major,Surgical,Medicare,,,,,true,57053,11693.89
Long Island,Nassau,2951001,000541,North Shore University Hospital,30 to 49,115,F,Other Race,Spanish/Hispanic,4,Emergency,Home or Self Care,2018,DIG012,INTESTINAL OBSTRUCTION AND ILEUS,GIS005,EXPLORATION OF PERITONEAL CAVITY,229,OTHER DIGESTIVE SYSTEM & ABDOMINAL PROCEDURES,06,DISEASES AND DISORDERS OF THE DIGESTIVE SYSTEM,2,Moderate,Minor,Surgical,Private Health Insurance,,,,,true,84547.2,17550.39
New York City,Queens,7003004,001638,Long Island Jewish Forest Hills,50 to 69,114,M,Other Race,Not Span/Hispanic,7,Emergency,Home or Self Care,2018,DIG016,PERITONITIS AND INTRA-ABDOMINAL ABSCESS,CAR015,PERIPHERAL ARTERIOVENOUS FISTULA AND SHUNT PROCEDURES,229,OTHER DIGESTIVE SYSTEM & ABDOMINAL PROCEDURES,06,DISEASES AND DISORDERS OF THE DIGESTIVE SYSTEM,2,Moderate,Moderate,Surgical,Medicare,Private Health Insurance,,,,true,108518.39,23304.48
New York City,Kings,7001020,001305,Maimonides Medical Center,30 to 49,112,F,Other Race,Not Span/Hispanic,6,Elective,Home or Self Care,2018,NEO070,SECONDARY MALIGNANCIES,GIS015,OMENTECTOMY OR PERITONEUM RESECTION,229,OTHER DIGESTIVE SYSTEM & ABDOMINAL PROCEDURES,06,DISEASES AND DISORDERS OF THE DIGESTIVE SYSTEM,3,Major,Major,Surgical,Medicaid,Medicaid,Self-Pay,,,false,91441.05,29404.61
Long Island,Nassau,2950001,000527,Mount Sinai South Nassau,50 to 69,115,F,White,Not Span/Hispanic,7,Emergency,Home or Self Care,2018,NEO070,SECONDARY MALIGNANCIES,CAR028,INFERIOR VENA CAVA (IVC) FILTER PROCEDURES,229,OTHER DIGESTIVE SYSTEM & ABDOMINAL PROCEDURES,06,DISEASES AND DISORDERS OF THE DIGESTIVE SYSTEM,4,Extreme,Extreme,Surgical,Blue Cross/Blue Shield,Blue Cross/Blue Shield,,,,true,156826.75,26171.74
New York City,Queens,7003010,001637,New York - Presbyterian/Queens,50 to 69,104,F,Black/African American,Not Span/Hispanic,4,Emergency,Home w/ Home Health Services,2018,DIG021,GASTROINTESTINAL HEMORRHAGE,CAR010,LIGATION AND EMBOLIZATION OF VESSELS,229,OTHER DIGESTIVE SYSTEM & ABDOMINAL PROCEDURES,06,DISEASES AND DISORDERS OF THE DIGESTIVE SYSTEM,2,Moderate,Minor,Surgical,Medicare,Medicare,Self-Pay,,,true,78809.17,25169.67
Western NY,Erie,1401014,003067,Millard Fillmore Suburban Hospital,70 or Older,140,F,White,Not Span/Hispanic,6,Emergency,Home or Self Care,2018,DIG021,GASTROINTESTINAL HEMORRHAGE,IMG002,FLUOROSCOPIC ANGIOGRAPHY (EXCLUDING CORONARY),229,OTHER DIGESTIVE SYSTEM & ABDOMINAL PROCEDURES,06,DISEASES AND DISORDERS OF THE DIGESTIVE SYSTEM,2,Moderate,Moderate,Surgical,Medicare,Self-Pay,Self-Pay,,,true,40997.19,20483.73