Hospital Service Area,Hospital County,Operating Certificate Number,Permanent Facility Id,Facility Name,Age Group,Zip Code - 3 digits,Gender,Race,Ethnicity,Length of Stay,Type of Admission,Patient Disposition,Discharge Year,CCS Diagnosis Code,CCS Diagnosis Description,CCS Procedure Code,CCS Procedure Description,APR DRG Code,APR DRG Description,APR MDC Code,APR MDC Description,APR Severity of Illness Code,APR Severity of Illness Description,APR Risk of Mortality,APR Medical Surgical Description,Payment Typology 1,Payment Typology 2,Payment Typology 3,Birth Weight,Abortion Edit Indicator,Emergency Department Indicator,Total Charges,Total Costs
Long Island,Suffolk,5151001,000245,Stony Brook University Hospital,50 to 69,119,F,White,Not Span/Hispanic,2,Emergency,Home or Self Care,2019,DIG005,GASTRODUODENAL ULCER,GIS005,EXPLORATION OF PERITONEAL CAVITY,229,OTHER DIGESTIVE SYSTEM & ABDOMINAL PROCEDURES,06,DISEASES AND DISORDERS OF THE DIGESTIVE SYSTEM,2,Moderate,Moderate,Surgical,Medicaid,Medicaid,,,,false,33035.14,11630.84
Central NY,Onondaga,3301008,000636,Crouse Hospital,50 to 69,131,F,Other Race,Not Span/Hispanic,3,Urgent,Expired,2019,DIG021,GASTROINTESTINAL HEMORRHAGE,CAR010,LIGATION AND EMBOLIZATION OF VESSELS,229,OTHER DIGESTIVE SYSTEM & ABDOMINAL PROCEDURES,06,DISEASES AND DISORDERS OF THE DIGESTIVE SYSTEM,4,Extreme,Extreme,Surgical,Medicare,Medicaid,,,,false,100691.8,42619.72
New York City,Manhattan,7002001,001438,Bellevue Hospital Center,30 to 49,112,F,Other Race,Not Span/Hispanic,2,Emergency,Home or Self Care,2019,SYM006,ABDOMINAL PAIN AND OTHER DIGESTIVE/ABDOMEN SIGNS AND SYMPTOMS,FRS003,SALPINGECTOMY,229,OTHER DIGESTIVE SYSTEM & ABDOMINAL PROCEDURES,06,DISEASES AND DISORDERS OF THE DIGESTIVE SYSTEM,1,Minor,Minor,Surgical,Medicaid,,,,,false,12933.14,8595.36
New York City,Kings,7001002,001286,Brookdale Hospital Medical Center,18 to 29,112,F,Other Race,Not Span/Hispanic,1,Emergency,Home or Self Care,2019,DIG025,OTHER SPECIFIED AND UNSPECIFIED GASTROINTESTINAL DISORDERS,GIS024,OTHER PERITONEAL CAVITY PROCEDURES,229,OTHER DIGESTIVE SYSTEM & ABDOMINAL PROCEDURES,06,DISEASES AND DISORDERS OF THE DIGESTIVE SYSTEM,1,Minor,Minor,Surgical,Medicaid,,,,,true,13813.03,8987.94
New York City,Manhattan,7002024,001456,Mount Sinai Hospital,50 to 69,100,M,White,Not Span/Hispanic,3,Emergency,Home or Self Care,2019,DIG001,INTESTINAL INFECTION,GIS005,EXPLORATION OF PERITONEAL CAVITY,229,OTHER DIGESTIVE SYSTEM & ABDOMINAL PROCEDURES,06,DISEASES AND DISORDERS OF THE DIGESTIVE SYSTEM,3,Major,Moderate,Surgical,Private Health Insurance,Self-Pay,,,,true,49639.58,16379.32
New York City,Kings,7002053,001304,NYU Langone Hospital-Brooklyn,70 or Older,112,F,Black/African American,Not Span/Hispanic,1,Elective,Home or Self Care,2019,NEO015,GASTROINTESTINAL CANCERS - COLORECTAL,GIS005,EXPLORATION OF PERITONEAL CAVITY,229,OTHER DIGESTIVE SYSTEM & ABDOMINAL PROCEDURES,06,DISEASES AND DISORDERS OF THE DIGESTIVE SYSTEM,3,Major,Major,Surgical,Medicare,,,,,false,56195.53,10101.04
Hudson Valley,Putnam,3950000,000752,Putnam Hospital,70 or Older,105,F,White,Not Span/Hispanic,5,Emergency,Home or Self Care,2019,DIG009,APPENDICITIS AND OTHER APPENDICEAL CONDITIONS,GIS024,OTHER PERITONEAL CAVITY PROCEDURES,229,OTHER DIGESTIVE SYSTEM & ABDOMINAL PROCEDURES,06,DISEASES AND DISORDERS OF THE DIGESTIVE SYSTEM,1,Minor,Minor,Surgical,Medicare,Federal/State/Local/VA,,,,true,45020,14609.84
New York City,Kings,7001002,001286,Brookdale Hospital Medical Center,50 to 69,112,F,Other Race,Unknown,4,Emergency,Home or Self Care,2019,DIG010,ABDOMINAL HERNIA,GIS021,GI SYSTEM REPAIR (EXCLUDING ANORECTAL),229,OTHER DIGESTIVE SYSTEM & ABDOMINAL PROCEDURES,06,DISEASES AND DISORDERS OF THE DIGESTIVE SYSTEM,2,Moderate,Minor,Surgical,Medicaid,,,,,true,33697.1,19533.61
Central NY,Oneida,3202003,000599,Faxton-St Lukes Healthcare St Lukes Division,70 or Older,135,F,White,Not Span/Hispanic,6,Emergency,Home or Self Care,2019,DIG024,POSTPROCEDURAL OR POSTOPERATIVE DIGESTIVE SYSTEM COMPLICATION,HEP001,LIVER BIOPSY,229,OTHER DIGESTIVE SYSTEM & ABDOMINAL PROCEDURES,06,DISEASES AND DISORDERS OF THE DIGESTIVE SYSTEM,2,Moderate,Moderate,Surgical,Medicare,,,,,true,62428.11,16488.62
Finger Lakes,Monroe,2701005,000413,Strong Memorial Hospital,18 to 29,145,F,White,Not Span/Hispanic,2,Emergency,Home or Self Care,2019,INJ013,"OPEN WOUNDS OF TRUNK, INITIAL ENCOUNTER",GIS024,OTHER PERITONEAL CAVITY PROCEDURES,229,OTHER DIGESTIVE SYSTEM & ABDOMINAL PROCEDURES,06,DISEASES AND DISORDERS OF THE DIGESTIVE SYSTEM,1,Minor,Minor,Surgical,Blue Cross/Blue Shield,,,,,true,19407.08,8466.75
Hudson Valley,Dutchess,5957001,000180,Mid-Hudson Valley Division of Westchester Medical Center,18 to 29,126,F,Black/African American,Not Span/Hispanic,5,Elective,Home w/ Home Health Services,2019,DIG025,OTHER SPECIFIED AND UNSPECIFIED GASTROINTESTINAL DISORDERS,GNR008,"ABDOMINAL WALL PROCEDURES, NEC",229,OTHER DIGESTIVE SYSTEM & ABDOMINAL PROCEDURES,06,DISEASES AND DISORDERS OF THE DIGESTIVE SYSTEM,3,Major,Moderate,Surgical,Medicaid,Medicaid,,,,true,109199.43,18756.18
Southern Tier,Broome,0301001,000043,Our Lady of Lourdes Memorial Hospital,70 or Older,137,M,White,Not Span/Hispanic,12,Emergency,Home or Self Care,2019,DIG013,DIVERTICULOSIS AND DIVERTICULITIS,GIS004,GI SYSTEM ENDOSCOPY WITHOUT BIOPSY (DIAGNOSTIC),229,OTHER DIGESTIVE SYSTEM & ABDOMINAL PROCEDURES,06,DISEASES AND DISORDERS OF THE DIGESTIVE SYSTEM,3,Major,Extreme,Surgical,Medicare,Medicare,Private Health Insurance,,,true,38332.76,13073.45
New York City,Manhattan,7002032,001466,Mount Sinai West,50 to 69,117,F,White,Not Span/Hispanic,2,Urgent,Home or Self Care,2019,DIG025,OTHER SPECIFIED AND UNSPECIFIED GASTROINTESTINAL DISORDERS,CAR008,ANGIOPLASTY AND RELATED VESSEL PROCEDURES (ENDOVASCULAR; EXCLUDING CAROTID),229,OTHER DIGESTIVE SYSTEM & ABDOMINAL PROCEDURES,06,DISEASES AND DISORDERS OF THE DIGESTIVE SYSTEM,2,Moderate,Major,Surgical,Private Health Insurance,Self-Pay,,,,false,121293.47,38521.12
Capital/Adirond,Albany,0101004,000005,St. Peter's Hospital,50 to 69,121,F,White,Not Span/Hispanic,19,Emergency,Home or Self Care,2019,DIG024,POSTPROCEDURAL OR POSTOPERATIVE DIGESTIVE SYSTEM COMPLICATION,GNR008,"ABDOMINAL WALL PROCEDURES, NEC",229,OTHER DIGESTIVE SYSTEM & ABDOMINAL PROCEDURES,06,DISEASES AND DISORDERS OF THE DIGESTIVE SYSTEM,4,Extreme,Extreme,Surgical,Private Health Insurance,,,,,true,97705.72,41476.97
New York City,Kings,7001021,001306,New York - Presbyterian Brooklyn Methodist Hospital,30 to 49,112,F,Black/African American,Not Span/Hispanic,4,Emergency,Home or Self Care,2019,SYM006,ABDOMINAL PAIN AND OTHER DIGESTIVE/ABDOMEN SIGNS AND SYMPTOMS,GIS006,PARACENTESIS,229,OTHER DIGESTIVE SYSTEM & ABDOMINAL PROCEDURES,06,DISEASES AND DISORDERS OF THE DIGESTIVE SYSTEM,1,Minor,Minor,Surgical,"Managed Care, Unspecified",Medicaid,Self-Pay,,,true,51532.27,8823.08
Capital/Adirond,Albany,0101004,000005,St. Peter's Hospital,70 or Older,120,F,White,Not Span/Hispanic,9,Elective,Home or Self Care,2019,NEO014,GASTROINTESTINAL CANCERS - SMALL INTESTINE,GIS003,GI SYSTEM BIOPSY (NON-ENDOSCOPIC),229,OTHER DIGESTIVE SYSTEM & ABDOMINAL PROCEDURES,06,DISEASES AND DISORDERS OF THE DIGESTIVE SYSTEM,2,Moderate,Moderate,Surgical,Medicare,Medicare,,,,false,85102.8,35798.22
New York City,Bronx,7000006,003058,Montefiore Med Center - Jack D Weiler Hosp of A Einstein College Div,70 or Older,104,F,Black/African American,Not Span/Hispanic,17,Emergency,Home or Self Care,2019,DIG025,OTHER SPECIFIED AND UNSPECIFIED GASTROINTESTINAL DISORDERS,CAR010,LIGATION AND EMBOLIZATION OF VESSELS,229,OTHER DIGESTIVE SYSTEM & ABDOMINAL PROCEDURES,06,DISEASES AND DISORDERS OF THE DIGESTIVE SYSTEM,3,Major,Major,Surgical,Private Health Insurance,Medicare,,,,true,366692.34,92009.53
New York City,Bronx,7000006,001169,Montefiore Medical Center - Henry & Lucy Moses Div,50 to 69,105,F,Black/African American,Not Span/Hispanic,10,Emergency,Home or Self Care,2019,DIG013,DIVERTICULOSIS AND DIVERTICULITIS,CAR010,LIGATION AND EMBOLIZATION OF VESSELS,229,OTHER DIGESTIVE SYSTEM & ABDOMINAL PROCEDURES,06,DISEASES AND DISORDERS OF THE DIGESTIVE SYSTEM,3,Major,Major,Surgical,Medicare,Medicaid,,,,false,253620.14,51255.75
Central NY,Oneida,3202003,000599,Faxton-St Lukes Healthcare St Lukes Division,30 to 49,133,F,White,Not Span/Hispanic,3,Emergency,Home or Self Care,2019,SYM006,ABDOMINAL PAIN AND OTHER DIGESTIVE/ABDOMEN SIGNS AND SYMPTOMS,GIS005,EXPLORATION OF PERITONEAL CAVITY,229,OTHER DIGESTIVE SYSTEM & ABDOMINAL PROCEDURES,06,DISEASES AND DISORDERS OF THE DIGESTIVE SYSTEM,1,Minor,Minor,Surgical,Blue Cross/Blue Shield,,,,,true,25432.37,8577.17
Long Island,Suffolk,5154001,000925,Good Samaritan Hospital Medical Center,30 to 49,117,F,Other Race,Spanish/Hispanic,4,Elective,Home or Self Care,2019,SYM006,ABDOMINAL PAIN AND OTHER DIGESTIVE/ABDOMEN SIGNS AND SYMPTOMS,FRS001,HYSTERECTOMY,229,OTHER DIGESTIVE SYSTEM & ABDOMINAL PROCEDURES,06,DISEASES AND DISORDERS OF THE DIGESTIVE SYSTEM,3,Major,Minor,Surgical,Private Health Insurance,,,,,false,97927.84,18194.42
Long Island,Suffolk,5154001,000925,Good Samaritan Hospital Medical Center,50 to 69,117,F,White,Not Span/Hispanic,3,Elective,Home or Self Care,2019,SYM006,ABDOMINAL PAIN AND OTHER DIGESTIVE/ABDOMEN SIGNS AND SYMPTOMS,FRS001,HYSTERECTOMY,229,OTHER DIGESTIVE SYSTEM & ABDOMINAL PROCEDURES,06,DISEASES AND DISORDERS OF THE DIGESTIVE SYSTEM,1,Minor,Minor,Surgical,Medicaid,,,,,false,57868.8,11397.47
Hudson Valley,Westchester,5932000,001129,Phelps Hospital,70 or Older,105,F,White,Not Span/Hispanic,13,Emergency,Skilled Nursing Home,2019,DIG008,OTHER SPECIFIED AND UNSPECIFIED DISORDERS OF STOMACH AND DUODENUM,CAR010,LIGATION AND EMBOLIZATION OF VESSELS,229,OTHER DIGESTIVE SYSTEM & ABDOMINAL PROCEDURES,06,DISEASES AND DISORDERS OF THE DIGESTIVE SYSTEM,3,Major,Major,Surgical,Medicare,,,,,true,205972.9,120551.17
New York City,Kings,7001046,001309,Interfaith Medical Center,30 to 49,112,F,Black/African American,Not Span/Hispanic,8,Emergency,Home or Self Care,2019,DIG004,ESOPHAGEAL DISORDERS,HEP006,CHOLECYSTECTOMY,229,OTHER DIGESTIVE SYSTEM & ABDOMINAL PROCEDURES,06,DISEASES AND DISORDERS OF THE DIGESTIVE SYSTEM,2,Moderate,Minor,Surgical,Medicaid,,,,,false,52000.82,33601.14
New York City,Manhattan,7002053,001463,NYU Langone Hospitals,70 or Older,OOS,F,White,Not Span/Hispanic,7,Elective,Home or Self Care,2019,NEO070,SECONDARY MALIGNANCIES,GIS005,EXPLORATION OF PERITONEAL CAVITY,229,OTHER DIGESTIVE SYSTEM & ABDOMINAL PROCEDURES,06,DISEASES AND DISORDERS OF THE DIGESTIVE SYSTEM,2,Moderate,Moderate,Surgical,Medicare,Blue Cross/Blue Shield,,,,false,129322.76,32368.24
Long Island,Suffolk,5151001,000245,Stony Brook University Hospital,30 to 49,117,F,Black/African American,Not Span/Hispanic,65,Emergency,Home or Self Care,2019,DIG021,GASTROINTESTINAL HEMORRHAGE,CAR010,LIGATION AND EMBOLIZATION OF VESSELS,229,OTHER DIGESTIVE SYSTEM & ABDOMINAL PROCEDURES,06,DISEASES AND DISORDERS OF THE DIGESTIVE SYSTEM,4,Extreme,Extreme,Surgical,Medicare,Blue Cross/Blue Shield,,,,true,819058.07,262413.85
Long Island,Suffolk,5151001,000245,Stony Brook University Hospital,30 to 49,117,F,White,Spanish/Hispanic,24,Emergency,Home or Self Care,2019,DIG021,GASTROINTESTINAL HEMORRHAGE,GIS005,EXPLORATION OF PERITONEAL CAVITY,229,OTHER DIGESTIVE SYSTEM & ABDOMINAL PROCEDURES,06,DISEASES AND DISORDERS OF THE DIGESTIVE SYSTEM,4,Extreme,Extreme,Surgical,Medicaid,,,,,true,272542.41,78220.91
New York City,Richmond,7004003,001740,Staten Island University Hosp-North,70 or Older,103,M,Other Race,Not Span/Hispanic,10,Emergency,Home w/ Home Health Services,2019,INJ010,"INTERNAL ORGAN INJURY, INITIAL ENCOUNTER",CAR010,LIGATION AND EMBOLIZATION OF VESSELS,229,OTHER DIGESTIVE SYSTEM & ABDOMINAL PROCEDURES,06,DISEASES AND DISORDERS OF THE DIGESTIVE SYSTEM,3,Major,Extreme,Surgical,Medicaid,Medicare,,,,true,169761.7,42316.56
New York City,Manhattan,7002054,001464,New York-Presbyterian Hospital - Columbia Presbyterian Center,30 to 49,112,F,White,Not Span/Hispanic,2,Urgent,Home or Self Care,2019,NEO073,BENIGN NEOPLASMS,ADM012,CHEMOTHERAPY,229,OTHER DIGESTIVE SYSTEM & ABDOMINAL PROCEDURES,06,DISEASES AND DISORDERS OF THE DIGESTIVE SYSTEM,1,Minor,Minor,Surgical,Medicaid,Medicaid,Self-Pay,,,false,29152.57,8477.96
New York City,Bronx,7000006,001169,Montefiore Medical Center - Henry & Lucy Moses Div,18 to 29,104,F,Other Race,Spanish/Hispanic,2,Emergency,Home or Self Care,2019,DIG024,POSTPROCEDURAL OR POSTOPERATIVE DIGESTIVE SYSTEM COMPLICATION,GIS021,GI SYSTEM REPAIR (EXCLUDING ANORECTAL),229,OTHER DIGESTIVE SYSTEM & ABDOMINAL PROCEDURES,06,DISEASES AND DISORDERS OF THE DIGESTIVE SYSTEM,2,Moderate,Minor,Surgical,Medicaid,,,,,true,56131.34,9223.55
Capital/Adirond,Albany,0101004,000005,St. Peter's Hospital,70 or Older,121,M,Other Race,Not Span/Hispanic,3,Emergency,Home or Self Care,2019,DIG021,GASTROINTESTINAL HEMORRHAGE,GNR005,CONTROL OF BLEEDING (NON-ENDOSCOPIC),229,OTHER DIGESTIVE SYSTEM & ABDOMINAL PROCEDURES,06,DISEASES AND DISORDERS OF THE DIGESTIVE SYSTEM,2,Moderate,Major,Surgical,Medicare,Blue Cross/Blue Shield,,,,true,21660.45,8917.14
Central NY,Oswego,3702000,000727,Oswego Hospital,70 or Older,131,M,White,Not Span/Hispanic,6,Emergency,Home or Self Care,2019,DIG013,DIVERTICULOSIS AND DIVERTICULITIS,GIS024,OTHER PERITONEAL CAVITY PROCEDURES,229,OTHER DIGESTIVE SYSTEM & ABDOMINAL PROCEDURES,06,DISEASES AND DISORDERS OF THE DIGESTIVE SYSTEM,3,Major,Moderate,Surgical,Medicare,,,,,true,25879.47,13366.78
New York City,Bronx,7000024,001186,North Central Bronx Hospital,50 to 69,104,M,Other Race,Spanish/Hispanic,21,Emergency,Home or Self Care,2019,DIG015,ANAL AND RECTAL CONDITIONS,ADM015,ADMINISTRATION OF ANTIBIOTICS,229,OTHER DIGESTIVE SYSTEM & ABDOMINAL PROCEDURES,06,DISEASES AND DISORDERS OF THE DIGESTIVE SYSTEM,1,Minor,Minor,Surgical,Medicare,Medicare,Medicaid,,,true,108473.08,65117.37
Long Island,Nassau,2908000,000511,NYU Langone Hospital-Long Island,70 or Older,112,F,Black/African American,Not Span/Hispanic,6,Emergency,Home or Self Care,2019,INJ020,"EFFECT OF FOREIGN BODY ENTERING OPENING, INITIAL ENCOUNTER",GIS005,EXPLORATION OF PERITONEAL CAVITY,229,OTHER DIGESTIVE SYSTEM & ABDOMINAL PROCEDURES,06,DISEASES AND DISORDERS OF THE DIGESTIVE SYSTEM,2,Moderate,Moderate,Surgical,Medicare,Medicare,Medicaid,,,true,146029.47,22645.93
Finger Lakes,Monroe,2701001,000409,Highland Hospital,18 to 29,144,F,White,Not Span/Hispanic,1,Elective,Home or Self Care,2019,NEO020,GASTROINTESTINAL CANCERS - PERITONEUM,GIS015,OMENTECTOMY OR PERITONEUM RESECTION,229,OTHER DIGESTIVE SYSTEM & ABDOMINAL PROCEDURES,06,DISEASES AND DISORDERS OF THE DIGESTIVE SYSTEM,1,Minor,Minor,Surgical,Self-Pay,,,,,false,31899.65,12011.44
New York City,Manhattan,7002054,003975,New York Presbyterian Hospital - Allen Hospital,30 to 49,100,M,Other Race,Not Span/Hispanic,9,Emergency,Home w/ Home Health Services,2019,DIG009,APPENDICITIS AND OTHER APPENDICEAL CONDITIONS,GIS006,PARACENTESIS,229,OTHER DIGESTIVE SYSTEM & ABDOMINAL PROCEDURES,06,DISEASES AND DISORDERS OF THE DIGESTIVE SYSTEM,3,Major,Moderate,Surgical,Medicaid,Medicaid,Self-Pay,,,true,101649.4,23066.31
New York City,Kings,7002053,001304,NYU Langone Hospital-Brooklyn,18 to 29,112,M,Other Race,Not Span/Hispanic,2,Emergency,Home or Self Care,2019,DIG004,ESOPHAGEAL DISORDERS,GIS005,EXPLORATION OF PERITONEAL CAVITY,229,OTHER DIGESTIVE SYSTEM & ABDOMINAL PROCEDURES,06,DISEASES AND DISORDERS OF THE DIGESTIVE SYSTEM,1,Minor,Minor,Surgical,Private Health Insurance,,,,,true,101762.55,21284.07
Central NY,Onondaga,3301008,000636,Crouse Hospital,70 or Older,130,F,White,Not Span/Hispanic,10,Emergency,Home w/ Home Health Services,2019,DIG012,INTESTINAL OBSTRUCTION AND ILEUS,GIS005,EXPLORATION OF PERITONEAL CAVITY,229,OTHER DIGESTIVE SYSTEM & ABDOMINAL PROCEDURES,06,DISEASES AND DISORDERS OF THE DIGESTIVE SYSTEM,3,Major,Moderate,Surgical,Medicare,Medicare,Private Health Insurance,,,true,41612.64,17716.69
New York City,Manhattan,7002054,001458,New York-Presbyterian Hospital - New York Weill Cornell Center,70 or Older,100,F,White,Not Span/Hispanic,14,Emergency,Hospice - Medical Facility,2019,NEO013,GASTROINTESTINAL CANCERS - STOMACH,GIS001,ESOPHAGOGASTRODUODENOSCOPY (EGD) WITH BIOPSY,229,OTHER DIGESTIVE SYSTEM & ABDOMINAL PROCEDURES,06,DISEASES AND DISORDERS OF THE DIGESTIVE SYSTEM,4,Extreme,Major,Surgical,Medicare,Self-Pay,,,,false,238808.64,60713.39
Hudson Valley,Westchester,5904001,001072,Montefiore New Rochelle Hospital,30 to 49,108,M,Other Race,Spanish/Hispanic,4,Emergency,Home or Self Care,2019,DIG022,NONINFECTIOUS GASTROENTERITIS,GIS005,EXPLORATION OF PERITONEAL CAVITY,229,OTHER DIGESTIVE SYSTEM & ABDOMINAL PROCEDURES,06,DISEASES AND DISORDERS OF THE DIGESTIVE SYSTEM,1,Minor,Minor,Surgical,Medicaid,Medicaid,Self-Pay,,,true,35721.09,8352.1
New York City,Manhattan,7002054,001464,New York-Presbyterian Hospital - Columbia Presbyterian Center,50 to 69,112,F,Other Race,Not Span/Hispanic,8,Elective,Home w/ Home Health Services,2019,NEO073,BENIGN NEOPLASMS,HEP004,HEPATOBILIARY RESECTION AND ABLATION,229,OTHER DIGESTIVE SYSTEM & ABDOMINAL PROCEDURES,06,DISEASES AND DISORDERS OF THE DIGESTIVE SYSTEM,3,Major,Moderate,Surgical,Medicaid,Medicaid,Self-Pay,,,false,149191.34,42124.43
New York City,Manhattan,7002054,001464,New York-Presbyterian Hospital - Columbia Presbyterian Center,50 to 69,104,F,Black/African American,Not Span/Hispanic,2,Emergency,Home w/ Home Health Services,2019,DIG025,OTHER SPECIFIED AND UNSPECIFIED GASTROINTESTINAL DISORDERS,GIS005,EXPLORATION OF PERITONEAL CAVITY,229,OTHER DIGESTIVE SYSTEM & ABDOMINAL PROCEDURES,06,DISEASES AND DISORDERS OF THE DIGESTIVE SYSTEM,3,Major,Moderate,Surgical,Medicaid,Medicaid,Self-Pay,,,true,66040.76,17668.87
Capital/Adirond,Albany,0101000,000001,Albany Medical Center Hospital,50 to 69,122,M,Black/African American,Not Span/Hispanic,2,Emergency,Home or Self Care,2019,DIG025,OTHER SPECIFIED AND UNSPECIFIED GASTROINTESTINAL DISORDERS,CAR008,ANGIOPLASTY AND RELATED VESSEL PROCEDURES (ENDOVASCULAR; EXCLUDING CAROTID),229,OTHER DIGESTIVE SYSTEM & ABDOMINAL PROCEDURES,06,DISEASES AND DISORDERS OF THE DIGESTIVE SYSTEM,2,Moderate,Minor,Surgical,"Managed Care, Unspecified",,,,,true,30104.95,10865.38
Capital/Adirond,Albany,0101000,000001,Albany Medical Center Hospital,50 to 69,125,M,White,Not Span/Hispanic,1,Urgent,Short-term Hospital,2019,DIG021,GASTROINTESTINAL HEMORRHAGE,CAR010,LIGATION AND EMBOLIZATION OF VESSELS,229,OTHER DIGESTIVE SYSTEM & ABDOMINAL PROCEDURES,06,DISEASES AND DISORDERS OF THE DIGESTIVE SYSTEM,2,Moderate,Moderate,Surgical,Medicare,,,,,false,29682.66,13217.93
New York City,Manhattan,7002024,001456,Mount Sinai Hospital,18 to 29,112,F,Black/African American,Spanish/Hispanic,6,Elective,Home or Self Care,2019,DIG011,REGIONAL ENTERITIS AND ULCERATIVE COLITIS,GIS024,OTHER PERITONEAL CAVITY PROCEDURES,229,OTHER DIGESTIVE SYSTEM & ABDOMINAL PROCEDURES,06,DISEASES AND DISORDERS OF THE DIGESTIVE SYSTEM,2,Moderate,Minor,Surgical,Medicaid,Medicaid,Self-Pay,,,false,76585.95,25464.3
Long Island,Suffolk,5154001,000925,Good Samaritan Hospital Medical Center,30 to 49,117,M,Black/African American,Not Span/Hispanic,4,Emergency,Home or Self Care,2019,INJ013,"OPEN WOUNDS OF TRUNK, INITIAL ENCOUNTER",GIS024,OTHER PERITONEAL CAVITY PROCEDURES,229,OTHER DIGESTIVE SYSTEM & ABDOMINAL PROCEDURES,06,DISEASES AND DISORDERS OF THE DIGESTIVE SYSTEM,2,Moderate,Moderate,Surgical,Medicare,Medicaid,,,,true,69457.15,14524.38
New York City,Queens,7003010,001637,New York - Presbyterian/Queens,50 to 69,117,M,Other Race,Spanish/Hispanic,27,Emergency,Skilled Nursing Home,2019,DIG024,POSTPROCEDURAL OR POSTOPERATIVE DIGESTIVE SYSTEM COMPLICATION,GIS021,GI SYSTEM REPAIR (EXCLUDING ANORECTAL),229,OTHER DIGESTIVE SYSTEM & ABDOMINAL PROCEDURES,06,DISEASES AND DISORDERS OF THE DIGESTIVE SYSTEM,3,Major,Major,Surgical,Medicare,Medicaid,Self-Pay,,,true,211309.8,63364.01
Long Island,Nassau,2951001,000541,North Shore University Hospital,18 to 29,114,F,Black/African American,Not Span/Hispanic,4,Emergency,Home or Self Care,2019,DIG025,OTHER SPECIFIED AND UNSPECIFIED GASTROINTESTINAL DISORDERS,GIS006,PARACENTESIS,229,OTHER DIGESTIVE SYSTEM & ABDOMINAL PROCEDURES,06,DISEASES AND DISORDERS OF THE DIGESTIVE SYSTEM,1,Minor,Minor,Surgical,Medicaid,Medicaid,Private Health Insurance,,,true,59343.36,10239.65
New York City,Manhattan,7002024,001456,Mount Sinai Hospital,0 to 17,112,F,Other Race,Unknown,5,Urgent,Home or Self Care,2019,CIR039,OTHER SPECIFIED DISEASES OF VEINS AND LYMPHATICS,LYM001,LYMPH NODE BIOPSY,229,OTHER DIGESTIVE SYSTEM & ABDOMINAL PROCEDURES,06,DISEASES AND DISORDERS OF THE DIGESTIVE SYSTEM,1,Minor,Minor,Surgical,Medicaid,Medicaid,Self-Pay,,,false,82977.91,37856.74
Central NY,Onondaga,3301007,000635,University Hospital SUNY Health Science Center,50 to 69,130,M,White,Not Span/Hispanic,6,Emergency,Skilled Nursing Home,2019,DIG021,GASTROINTESTINAL HEMORRHAGE,CAR010,LIGATION AND EMBOLIZATION OF VESSELS,229,OTHER DIGESTIVE SYSTEM & ABDOMINAL PROCEDURES,06,DISEASES AND DISORDERS OF THE DIGESTIVE SYSTEM,3,Major,Major,Surgical,Medicare,Medicaid,,,,false,218659.7,62000.86
Central NY,Cayuga,0501000,000085,Auburn Community Hospital,50 to 69,130,F,White,Not Span/Hispanic,3,Elective,Home or Self Care,2019,DIG010,ABDOMINAL HERNIA,GNR008,"ABDOMINAL WALL PROCEDURES, NEC",229,OTHER DIGESTIVE SYSTEM & ABDOMINAL PROCEDURES,06,DISEASES AND DISORDERS OF THE DIGESTIVE SYSTEM,2,Moderate,Minor,Surgical,Medicare,Self-Pay,,,,false,36384.38,10357.98
New York City,Manhattan,7002032,001469,Mount Sinai Morningside,50 to 69,113,M,Other Race,Spanish/Hispanic,5,Elective,Home or Self Care,2019,NEO070,SECONDARY MALIGNANCIES,GIS015,OMENTECTOMY OR PERITONEUM RESECTION,229,OTHER DIGESTIVE SYSTEM & ABDOMINAL PROCEDURES,06,DISEASES AND DISORDERS OF THE DIGESTIVE SYSTEM,2,Moderate,Moderate,Surgical,Medicaid,Medicaid,Self-Pay,,,false,88573.77,24928.41
Capital/Adirond,Albany,0101000,000001,Albany Medical Center Hospital,70 or Older,122,M,Other Race,Spanish/Hispanic,2,Emergency,Home or Self Care,2019,SYM006,ABDOMINAL PAIN AND OTHER DIGESTIVE/ABDOMEN SIGNS AND SYMPTOMS,CAR010,LIGATION AND EMBOLIZATION OF VESSELS,229,OTHER DIGESTIVE SYSTEM & ABDOMINAL PROCEDURES,06,DISEASES AND DISORDERS OF THE DIGESTIVE SYSTEM,2,Moderate,Moderate,Surgical,Medicare,Medicaid,,,,true,30517.68,11097.91
Finger Lakes,Monroe,2701003,000411,Rochester General Hospital,30 to 49,145,F,White,Not Span/Hispanic,2,Emergency,Home or Self Care,2019,DIG010,ABDOMINAL HERNIA,GIS021,GI SYSTEM REPAIR (EXCLUDING ANORECTAL),229,OTHER DIGESTIVE SYSTEM & ABDOMINAL PROCEDURES,06,DISEASES AND DISORDERS OF THE DIGESTIVE SYSTEM,1,Minor,Minor,Surgical,Blue Cross/Blue Shield,,,,,true,18654.95,6587.61
Western NY,Erie,1401014,000207,Buffalo General Medical Center,50 to 69,140,M,White,Not Span/Hispanic,7,Elective,Home or Self Care,2019,DIG025,OTHER SPECIFIED AND UNSPECIFIED GASTROINTESTINAL DISORDERS,CAR008,ANGIOPLASTY AND RELATED VESSEL PROCEDURES (ENDOVASCULAR; EXCLUDING CAROTID),229,OTHER DIGESTIVE SYSTEM & ABDOMINAL PROCEDURES,06,DISEASES AND DISORDERS OF THE DIGESTIVE SYSTEM,3,Major,Major,Surgical,Medicare,Self-Pay,,,,false,40547.15,18577.56
New York City,Bronx,7000014,001176,SBH Health System,18 to 29,104,M,Black/African American,Not Span/Hispanic,2,Emergency,Home or Self Care,2019,DIG012,INTESTINAL OBSTRUCTION AND ILEUS,GIS005,EXPLORATION OF PERITONEAL CAVITY,229,OTHER DIGESTIVE SYSTEM & ABDOMINAL PROCEDURES,06,DISEASES AND DISORDERS OF THE DIGESTIVE SYSTEM,1,Minor,Minor,Surgical,Medicaid,Medicaid,,,,true,24292.58,11246.59
Long Island,Nassau,2908000,000511,NYU Langone Hospital-Long Island,70 or Older,115,F,White,Not Span/Hispanic,6,Emergency,Home w/ Home Health Services,2019,DIG025,OTHER SPECIFIED AND UNSPECIFIED GASTROINTESTINAL DISORDERS,GIS005,EXPLORATION OF PERITONEAL CAVITY,229,OTHER DIGESTIVE SYSTEM & ABDOMINAL PROCEDURES,06,DISEASES AND DISORDERS OF THE DIGESTIVE SYSTEM,3,Major,Major,Surgical,Medicare,Medicare,,,,true,256172.26,44710.6