Hospital Service Area,Hospital County,Operating Certificate Number,Permanent Facility Id,Facility Name,Age Group,Zip Code - 3 digits,Gender,Race,Ethnicity,Length of Stay,Type of Admission,Patient Disposition,Discharge Year,CCS Diagnosis Code,CCS Diagnosis Description,CCS Procedure Code,CCS Procedure Description,APR DRG Code,APR DRG Description,APR MDC Code,APR MDC Description,APR Severity of Illness Code,APR Severity of Illness Description,APR Risk of Mortality,APR Medical Surgical Description,Payment Typology 1,Payment Typology 2,Payment Typology 3,Birth Weight,Abortion Edit Indicator,Emergency Department Indicator,Total Charges,Total Costs
New York City,Manhattan,7002001,001438,Bellevue Hospital Center,30 to 49,112,F,Other Race,Not Span/Hispanic,2,Emergency,Home or Self Care,2019,SYM006,ABDOMINAL PAIN AND OTHER DIGESTIVE/ABDOMEN SIGNS AND SYMPTOMS,FRS003,SALPINGECTOMY,229,OTHER DIGESTIVE SYSTEM & ABDOMINAL PROCEDURES,06,DISEASES AND DISORDERS OF THE DIGESTIVE SYSTEM,1,Minor,Minor,Surgical,Medicaid,,,,,false,12933.14,8595.36
New York City,Manhattan,7002001,001438,Bellevue Hospital Center,50 to 69,100,M,Other Race,Not Span/Hispanic,1,Elective,Home or Self Care,2019,NEO015,GASTROINTESTINAL CANCERS - COLORECTAL,GIS005,EXPLORATION OF PERITONEAL CAVITY,229,OTHER DIGESTIVE SYSTEM & ABDOMINAL PROCEDURES,06,DISEASES AND DISORDERS OF THE DIGESTIVE SYSTEM,2,Moderate,Moderate,Surgical,Medicare,Medicare,Medicaid,,,false,2676.97,1779.11
New York City,Manhattan,7002001,001438,Bellevue Hospital Center,30 to 49,100,M,Other Race,Spanish/Hispanic,4,Emergency,Home or Self Care,2019,DIG004,ESOPHAGEAL DISORDERS,GNR005,CONTROL OF BLEEDING (NON-ENDOSCOPIC),229,OTHER DIGESTIVE SYSTEM & ABDOMINAL PROCEDURES,06,DISEASES AND DISORDERS OF THE DIGESTIVE SYSTEM,3,Major,Major,Surgical,Self-Pay,,,,,true,26880.24,17864.61
New York City,Manhattan,7002001,001438,Bellevue Hospital Center,18 to 29,111,F,Other Race,Not Span/Hispanic,1,Emergency,Home or Self Care,2019,SYM006,ABDOMINAL PAIN AND OTHER DIGESTIVE/ABDOMEN SIGNS AND SYMPTOMS,GIS005,EXPLORATION OF PERITONEAL CAVITY,229,OTHER DIGESTIVE SYSTEM & ABDOMINAL PROCEDURES,06,DISEASES AND DISORDERS OF THE DIGESTIVE SYSTEM,1,Minor,Minor,Surgical,Self-Pay,,,,,true,7567.11,5029.1
New York City,Manhattan,7002001,001438,Bellevue Hospital Center,18 to 29,113,F,Other Race,Spanish/Hispanic,2,Emergency,Home or Self Care,2019,DIG024,POSTPROCEDURAL OR POSTOPERATIVE DIGESTIVE SYSTEM COMPLICATION,GNR008,"ABDOMINAL WALL PROCEDURES, NEC",229,OTHER DIGESTIVE SYSTEM & ABDOMINAL PROCEDURES,06,DISEASES AND DISORDERS OF THE DIGESTIVE SYSTEM,2,Moderate,Minor,Surgical,Medicaid,Medicaid,,,,true,15522.75,10316.42
New York City,Manhattan,7002001,001438,Bellevue Hospital Center,30 to 49,100,F,Other Race,Spanish/Hispanic,4,Urgent,Home or Self Care,2019,SYM006,ABDOMINAL PAIN AND OTHER DIGESTIVE/ABDOMEN SIGNS AND SYMPTOMS,GIS005,EXPLORATION OF PERITONEAL CAVITY,229,OTHER DIGESTIVE SYSTEM & ABDOMINAL PROCEDURES,06,DISEASES AND DISORDERS OF THE DIGESTIVE SYSTEM,1,Minor,Minor,Surgical,Medicaid,,,,,false,34089.45,22655.85
New York City,Manhattan,7002001,001438,Bellevue Hospital Center,50 to 69,OOS,M,Other Race,Not Span/Hispanic,2,Elective,Home or Self Care,2019,NEO073,BENIGN NEOPLASMS,LYM005,SPLENECTOMY,229,OTHER DIGESTIVE SYSTEM & ABDOMINAL PROCEDURES,06,DISEASES AND DISORDERS OF THE DIGESTIVE SYSTEM,1,Minor,Minor,Surgical,Private Health Insurance,,,,,false,46465.51,30880.98
New York City,Manhattan,7002001,001438,Bellevue Hospital Center,30 to 49,100,M,Black/African American,Not Span/Hispanic,15,Emergency,Home or Self Care,2019,NEO070,SECONDARY MALIGNANCIES,GIS024,OTHER PERITONEAL CAVITY PROCEDURES,229,OTHER DIGESTIVE SYSTEM & ABDOMINAL PROCEDURES,06,DISEASES AND DISORDERS OF THE DIGESTIVE SYSTEM,3,Major,Moderate,Surgical,Medicaid,,,,,true,125144.67,83171.15
New York City,Manhattan,7002001,001438,Bellevue Hospital Center,30 to 49,112,F,White,Not Span/Hispanic,1,Elective,Home or Self Care,2019,FAC010,OTHER AFTERCARE ENCOUNTER,ADM014,REGIONAL ANESTHESIA,229,OTHER DIGESTIVE SYSTEM & ABDOMINAL PROCEDURES,06,DISEASES AND DISORDERS OF THE DIGESTIVE SYSTEM,2,Moderate,Minor,Surgical,Medicaid,Medicaid,,,,false,34669.19,23041.14
New York City,Manhattan,7002001,001438,Bellevue Hospital Center,70 or Older,112,F,Other Race,Spanish/Hispanic,8,Emergency,Home or Self Care,2019,DIG021,GASTROINTESTINAL HEMORRHAGE,CAR010,LIGATION AND EMBOLIZATION OF VESSELS,229,OTHER DIGESTIVE SYSTEM & ABDOMINAL PROCEDURES,06,DISEASES AND DISORDERS OF THE DIGESTIVE SYSTEM,4,Extreme,Extreme,Surgical,Medicaid,,,,,true,114776.43,76280.42
New York City,Manhattan,7002001,001438,Bellevue Hospital Center,30 to 49,OOS,M,Other Race,Not Span/Hispanic,5,Emergency,Home or Self Care,2019,DIG022,NONINFECTIOUS GASTROENTERITIS,GIS003,GI SYSTEM BIOPSY (NON-ENDOSCOPIC),229,OTHER DIGESTIVE SYSTEM & ABDOMINAL PROCEDURES,06,DISEASES AND DISORDERS OF THE DIGESTIVE SYSTEM,3,Major,Moderate,Surgical,Self-Pay,,,,,true,76609.84,50914.9
New York City,Manhattan,7002001,001438,Bellevue Hospital Center,30 to 49,104,M,White,Not Span/Hispanic,13,Emergency,Home or Self Care,2019,DIG013,DIVERTICULOSIS AND DIVERTICULITIS,GIS024,OTHER PERITONEAL CAVITY PROCEDURES,229,OTHER DIGESTIVE SYSTEM & ABDOMINAL PROCEDURES,06,DISEASES AND DISORDERS OF THE DIGESTIVE SYSTEM,3,Major,Moderate,Surgical,Medicaid,,,,,true,112796.5,74964.55
New York City,Manhattan,7002001,001438,Bellevue Hospital Center,50 to 69,112,F,Other Race,Spanish/Hispanic,3,Elective,Home or Self Care,2019,SYM006,ABDOMINAL PAIN AND OTHER DIGESTIVE/ABDOMEN SIGNS AND SYMPTOMS,LYM001,LYMPH NODE BIOPSY,229,OTHER DIGESTIVE SYSTEM & ABDOMINAL PROCEDURES,06,DISEASES AND DISORDERS OF THE DIGESTIVE SYSTEM,2,Moderate,Minor,Surgical,Medicaid,,,,,false,72028.28,47869.99
New York City,Manhattan,7002001,001438,Bellevue Hospital Center,50 to 69,100,M,Other Race,Spanish/Hispanic,2,Emergency,Home or Self Care,2019,DIG009,APPENDICITIS AND OTHER APPENDICEAL CONDITIONS,GIS005,EXPLORATION OF PERITONEAL CAVITY,229,OTHER DIGESTIVE SYSTEM & ABDOMINAL PROCEDURES,06,DISEASES AND DISORDERS OF THE DIGESTIVE SYSTEM,1,Minor,Minor,Surgical,Medicaid,,,,,true,25284.53,16804.1
New York City,Manhattan,7002001,001438,Bellevue Hospital Center,50 to 69,100,M,Other Race,Spanish/Hispanic,14,Urgent,Short-term Hospital,2019,DIG021,GASTROINTESTINAL HEMORRHAGE,CAR010,LIGATION AND EMBOLIZATION OF VESSELS,229,OTHER DIGESTIVE SYSTEM & ABDOMINAL PROCEDURES,06,DISEASES AND DISORDERS OF THE DIGESTIVE SYSTEM,4,Extreme,Extreme,Surgical,Medicaid,,,,,false,139338.34,92604.26
