Hospital Service Area,Hospital County,Operating Certificate Number,Permanent Facility Id,Facility Name,Age Group,Zip Code - 3 digits,Gender,Race,Ethnicity,Length of Stay,Type of Admission,Patient Disposition,Discharge Year,CCS Diagnosis Code,CCS Diagnosis Description,CCS Procedure Code,CCS Procedure Description,APR DRG Code,APR DRG Description,APR MDC Code,APR MDC Description,APR Severity of Illness Code,APR Severity of Illness Description,APR Risk of Mortality,APR Medical Surgical Description,Payment Typology 1,Payment Typology 2,Payment Typology 3,Birth Weight,Abortion Edit Indicator,Emergency Department Indicator,Total Charges,Total Costs
Hudson Valley,Orange,3523000,000699,Orange Regional Medical Center,70 or Older,125,M,White,Not Span/Hispanic,2,Emergency,Home or Self Care,2017,095,Other nervous system disorders,009,OTHER OR THER NERV SYS,023,Spinal procedures,01,Diseases and Disorders of the Nervous System,2,Moderate,Minor,Surgical,Medicare,Blue Cross/Blue Shield,,,N,Y,18929.04,5701.79
New York City,Manhattan,7002002,001439,Mount Sinai Beth Israel,50 to 69,100,M,White,Not Span/Hispanic,13,Urgent,Skilled Nursing Home,2017,227,Spinal cord injury,158,SPINAL FUSION,023,Spinal procedures,01,Diseases and Disorders of the Nervous System,3,Major,Major,Surgical,Medicare,Self-Pay,,,N,Y,204398.19,76255.07
New York City,Manhattan,7002002,001439,Mount Sinai Beth Israel,50 to 69,100,M,White,Unknown,1,Elective,Home or Self Care,2017,205,Spondylosis; intervertebral disc disorders; other back problems,158,SPINAL FUSION,023,Spinal procedures,01,Diseases and Disorders of the Nervous System,2,Moderate,Minor,Surgical,Private Health Insurance,Self-Pay,,,N,N,45129.17,14225.34
New York City,Manhattan,7002024,001456,Mount Sinai Hospital,70 or Older,113,M,White,Not Span/Hispanic,6,Urgent,Short-term Hospital,2017,082,Paralysis,009,OTHER OR THER NERV SYS,023,Spinal procedures,01,Diseases and Disorders of the Nervous System,3,Major,Moderate,Surgical,Medicare,Self-Pay,,,N,N,64202.78,22093.01
New York City,Manhattan,7002032,001466,Mount Sinai West,50 to 69,100,F,White,Not Span/Hispanic,6,Elective,Inpatient Rehabilitation Facility,2017,076,Meningitis (except that caused by tuberculosis or sexually transmitted disease),009,OTHER OR THER NERV SYS,023,Spinal procedures,01,Diseases and Disorders of the Nervous System,2,Moderate,Minor,Surgical,Private Health Insurance,Self-Pay,,,N,N,85489.89,30845.88
New York City,Bronx,7000006,001168,Montefiore Medical Center-Wakefield Hospital,30 to 49,104,M,Black/African American,Not Span/Hispanic,5,Emergency,Home or Self Care,2017,084,Headache; including migraine,007,OTHER DX NERV SYS PRCS,023,Spinal procedures,01,Diseases and Disorders of the Nervous System,2,Moderate,Minor,Surgical,Medicare,Medicaid,,,N,Y,67422.17,10819.13
New York City,Bronx,7000006,001169,Montefiore Medical Center - Henry & Lucy Moses Div,18 to 29,105,M,Other Race,Not Span/Hispanic,13,Emergency,Home or Self Care,2017,047,Other and unspecified benign neoplasm,004,DIAGNOSTIC SPINAL TAP,023,Spinal procedures,01,Diseases and Disorders of the Nervous System,2,Moderate,Minor,Surgical,Medicaid,,,,N,N,183047.79,43708.40
New York City,Manhattan,7002024,001456,Mount Sinai Hospital,30 to 49,100,M,White,Not Span/Hispanic,1,Elective,Home or Self Care,2017,227,Spinal cord injury,009,OTHER OR THER NERV SYS,023,Spinal procedures,01,Diseases and Disorders of the Nervous System,2,Moderate,Moderate,Surgical,Private Health Insurance,Self-Pay,,,N,N,20899.78,8993.46
New York City,Manhattan,7002024,001456,Mount Sinai Hospital,50 to 69,117,M,White,Not Span/Hispanic,4,Elective,Inpatient Rehabilitation Facility,2017,238,Complications of surgical procedures or medical care,006,DECOMP PERIPHERAL NERVE,023,Spinal procedures,01,Diseases and Disorders of the Nervous System,1,Minor,Minor,Surgical,Medicare,Self-Pay,,,N,N,52196.75,20704.52
New York City,Manhattan,7002024,001456,Mount Sinai Hospital,30 to 49,OOS,M,White,Not Span/Hispanic,1,Elective,Home or Self Care,2017,238,Complications of surgical procedures or medical care,009,OTHER OR THER NERV SYS,023,Spinal procedures,01,Diseases and Disorders of the Nervous System,2,Moderate,Moderate,Surgical,Blue Cross/Blue Shield,Self-Pay,,,N,N,26810.83,10902.40
New York City,Manhattan,7002032,001466,Mount Sinai West,30 to 49,112,F,White,Not Span/Hispanic,6,Urgent,Home w/ Home Health Services,2017,254,Rehabilitation care; fitting of prostheses; and adjustment of devices,005,INS CATHETER/SPNL STIM,023,Spinal procedures,01,Diseases and Disorders of the Nervous System,1,Minor,Minor,Surgical,Medicare,Medicare,Self-Pay,,N,N,186553.78,64424.18
New York City,Kings,7001021,001306,New York - Presbyterian Brooklyn Methodist Hospital,50 to 69,112,M,Other Race,Not Span/Hispanic,1,Elective,Home or Self Care,2017,205,Spondylosis; intervertebral disc disorders; other back problems,158,SPINAL FUSION,023,Spinal procedures,01,Diseases and Disorders of the Nervous System,1,Minor,Minor,Surgical,Miscellaneous/Other,Self-Pay,,,N,N,21276.52,11487.15
New York City,Kings,7001021,001306,New York - Presbyterian Brooklyn Methodist Hospital,50 to 69,114,M,Other Race,Not Span/Hispanic,1,Elective,Home or Self Care,2017,227,Spinal cord injury,158,SPINAL FUSION,023,Spinal procedures,01,Diseases and Disorders of the Nervous System,2,Moderate,Minor,Surgical,Miscellaneous/Other,Self-Pay,,,N,N,22387.40,12387.93
New York City,Kings,7001021,001306,New York - Presbyterian Brooklyn Methodist Hospital,70 or Older,112,M,Black/African American,Not Span/Hispanic,9,Emergency,Inpatient Rehabilitation Facility,2017,042,Secondary malignancies,009,OTHER OR THER NERV SYS,023,Spinal procedures,01,Diseases and Disorders of the Nervous System,3,Major,Major,Surgical,Medicare,Medicare,Self-Pay,,N,Y,104939.15,39043.35
New York City,Manhattan,7002054,001437,New York-Presbyterian/Lower Manhattan Hospital,30 to 49,104,M,Other Race,Spanish/Hispanic,2,Elective,Home or Self Care,2017,205,Spondylosis; intervertebral disc disorders; other back problems,158,SPINAL FUSION,023,Spinal procedures,01,Diseases and Disorders of the Nervous System,1,Minor,Minor,Surgical,Miscellaneous/Other,Self-Pay,,,N,N,43006.40,14662.68
New York City,Manhattan,7002054,001437,New York-Presbyterian/Lower Manhattan Hospital,50 to 69,OOS,M,Other Race,Not Span/Hispanic,2,Elective,Home or Self Care,2017,205,Spondylosis; intervertebral disc disorders; other back problems,158,SPINAL FUSION,023,Spinal procedures,01,Diseases and Disorders of the Nervous System,1,Minor,Minor,Surgical,Medicaid,Self-Pay,,,N,N,74057.08,29341.90
New York City,Manhattan,7002054,001437,New York-Presbyterian/Lower Manhattan Hospital,50 to 69,103,M,White,Not Span/Hispanic,1,Elective,Home or Self Care,2017,205,Spondylosis; intervertebral disc disorders; other back problems,009,OTHER OR THER NERV SYS,023,Spinal procedures,01,Diseases and Disorders of the Nervous System,1,Minor,Minor,Surgical,Medicare,Private Health Insurance,Self-Pay,,N,N,34636.25,11306.64
New York City,Manhattan,7002054,001437,New York-Presbyterian/Lower Manhattan Hospital,30 to 49,104,M,Other Race,Not Span/Hispanic,3,Elective,Home or Self Care,2017,205,Spondylosis; intervertebral disc disorders; other back problems,158,SPINAL FUSION,023,Spinal procedures,01,Diseases and Disorders of the Nervous System,1,Minor,Minor,Surgical,Miscellaneous/Other,Self-Pay,,,N,N,48410.83,15713.94
New York City,Manhattan,7002054,001437,New York-Presbyterian/Lower Manhattan Hospital,30 to 49,104,F,Other Race,Not Span/Hispanic,2,Elective,Home or Self Care,2017,205,Spondylosis; intervertebral disc disorders; other back problems,158,SPINAL FUSION,023,Spinal procedures,01,Diseases and Disorders of the Nervous System,1,Minor,Minor,Surgical,Miscellaneous/Other,Self-Pay,,,N,N,47079.44,17052.88
New York City,Manhattan,7002054,001437,New York-Presbyterian/Lower Manhattan Hospital,50 to 69,OOS,M,Multi-racial,Not Span/Hispanic,1,Elective,Home or Self Care,2017,205,Spondylosis; intervertebral disc disorders; other back problems,158,SPINAL FUSION,023,Spinal procedures,01,Diseases and Disorders of the Nervous System,1,Minor,Minor,Surgical,Miscellaneous/Other,Self-Pay,,,N,N,54092.30,21791.01
New York City,Manhattan,7002054,001437,New York-Presbyterian/Lower Manhattan Hospital,30 to 49,104,F,Multi-racial,Not Span/Hispanic,2,Elective,Home or Self Care,2017,205,Spondylosis; intervertebral disc disorders; other back problems,158,SPINAL FUSION,023,Spinal procedures,01,Diseases and Disorders of the Nervous System,1,Minor,Moderate,Surgical,Miscellaneous/Other,Self-Pay,,,N,N,39661.51,13573.33
New York City,Manhattan,7002054,001437,New York-Presbyterian/Lower Manhattan Hospital,50 to 69,,M,Multi-racial,Not Span/Hispanic,1,Elective,Home or Self Care,2017,205,Spondylosis; intervertebral disc disorders; other back problems,158,SPINAL FUSION,023,Spinal procedures,01,Diseases and Disorders of the Nervous System,1,Minor,Minor,Surgical,Miscellaneous/Other,Self-Pay,,,N,N,38549.12,15072.80
New York City,Manhattan,7002054,001437,New York-Presbyterian/Lower Manhattan Hospital,70 or Older,100,M,Multi-racial,Not Span/Hispanic,7,Emergency,Home w/ Home Health Services,2017,035,Cancer of brain and nervous system,009,OTHER OR THER NERV SYS,023,Spinal procedures,01,Diseases and Disorders of the Nervous System,3,Major,Minor,Surgical,Medicare,Medicare,Medicaid,,N,Y,148375.99,49490.64
New York City,Manhattan,7002054,001458,New York Presbyterian Hospital - New York Weill Cornell Center,0 to 17,113,M,Other Race,Spanish/Hispanic,3,Elective,Home or Self Care,2017,216,Nervous system congenital anomalies,009,OTHER OR THER NERV SYS,023,Spinal procedures,01,Diseases and Disorders of the Nervous System,2,Moderate,Minor,Surgical,Medicaid,Medicaid,Self-Pay,,N,N,77264.57,42561.02
New York City,Manhattan,7002054,001458,New York Presbyterian Hospital - New York Weill Cornell Center,30 to 49,OOS,F,Other Race,Not Span/Hispanic,7,Elective,Home w/ Home Health Services,2017,216,Nervous system congenital anomalies,006,DECOMP PERIPHERAL NERVE,023,Spinal procedures,01,Diseases and Disorders of the Nervous System,2,Moderate,Minor,Surgical,Blue Cross/Blue Shield,Self-Pay,,,N,N,97340.64,28325.40
New York City,Manhattan,7002054,001458,New York Presbyterian Hospital - New York Weill Cornell Center,18 to 29,117,F,Multi-racial,Not Span/Hispanic,6,Emergency,Home or Self Care,2017,095,Other nervous system disorders,009,OTHER OR THER NERV SYS,023,Spinal procedures,01,Diseases and Disorders of the Nervous System,1,Minor,Minor,Surgical,Blue Cross/Blue Shield,Self-Pay,,,N,Y,130283.67,69839.52
New York City,Manhattan,7002054,001458,New York Presbyterian Hospital - New York Weill Cornell Center,30 to 49,,M,Other Race,Not Span/Hispanic,6,Emergency,Home or Self Care,2017,044,Neoplasms of unspecified nature or uncertain behavior,007,OTHER DX NERV SYS PRCS,023,Spinal procedures,01,Diseases and Disorders of the Nervous System,2,Moderate,Minor,Surgical,Private Health Insurance,Self-Pay,,,N,N,154203.62,78947.97
New York City,Manhattan,7002054,001464,New York Presbyterian Hospital - Columbia Presbyterian Center,30 to 49,OOS,F,Other Race,Not Span/Hispanic,4,Elective,Home or Self Care,2017,047,Other and unspecified benign neoplasm,001,INCISION & EXCISION CNS,023,Spinal procedures,01,Diseases and Disorders of the Nervous System,1,Minor,Minor,Surgical,Blue Cross/Blue Shield,Self-Pay,,,N,N,72540.64,22932.54
New York City,Manhattan,7002054,001464,New York Presbyterian Hospital - Columbia Presbyterian Center,50 to 69,125,F,White,Not Span/Hispanic,2,Elective,Home or Self Care,2017,205,Spondylosis; intervertebral disc disorders; other back problems,158,SPINAL FUSION,023,Spinal procedures,01,Diseases and Disorders of the Nervous System,1,Minor,Minor,Surgical,Blue Cross/Blue Shield,Self-Pay,,,N,N,24179.80,7220.81
New York City,Manhattan,7002054,001464,New York Presbyterian Hospital - Columbia Presbyterian Center,50 to 69,OOS,F,Other Race,Not Span/Hispanic,8,Elective,Inpatient Rehabilitation Facility,2017,095,Other nervous system disorders,009,OTHER OR THER NERV SYS,023,Spinal procedures,01,Diseases and Disorders of the Nervous System,2,Moderate,Moderate,Surgical,Blue Cross/Blue Shield,Self-Pay,,,N,N,107523.47,31389.06
New York City,Manhattan,7002054,001464,New York Presbyterian Hospital - Columbia Presbyterian Center,30 to 49,100,M,Other Race,Not Span/Hispanic,4,Elective,Home or Self Care,2017,047,Other and unspecified benign neoplasm,009,OTHER OR THER NERV SYS,023,Spinal procedures,01,Diseases and Disorders of the Nervous System,1,Minor,Minor,Surgical,Blue Cross/Blue Shield,Self-Pay,,,N,N,58396.30,15466.05
New York City,Manhattan,7002054,001464,New York Presbyterian Hospital - Columbia Presbyterian Center,30 to 49,OOS,F,White,Not Span/Hispanic,2,Elective,Home or Self Care,2017,047,Other and unspecified benign neoplasm,009,OTHER OR THER NERV SYS,023,Spinal procedures,01,Diseases and Disorders of the Nervous System,2,Moderate,Minor,Surgical,Private Health Insurance,Self-Pay,,,N,N,27127.33,7593.39
New York City,Manhattan,7002054,001464,New York Presbyterian Hospital - Columbia Presbyterian Center,70 or Older,OOS,F,Other Race,Not Span/Hispanic,4,Elective,Home w/ Home Health Services,2017,047,Other and unspecified benign neoplasm,009,OTHER OR THER NERV SYS,023,Spinal procedures,01,Diseases and Disorders of the Nervous System,1,Minor,Minor,Surgical,Private Health Insurance,Self-Pay,,,N,N,46762.46,11832.33
New York City,Manhattan,7002054,001464,New York Presbyterian Hospital - Columbia Presbyterian Center,30 to 49,125,M,Other Race,Not Span/Hispanic,3,Elective,Home or Self Care,2017,095,Other nervous system disorders,007,OTHER DX NERV SYS PRCS,023,Spinal procedures,01,Diseases and Disorders of the Nervous System,1,Minor,Minor,Surgical,Private Health Insurance,Self-Pay,,,N,N,103286.55,38026.96
New York City,Manhattan,7002054,001464,New York Presbyterian Hospital - Columbia Presbyterian Center,70 or Older,OOS,M,Multi-racial,Not Span/Hispanic,3,Elective,Home w/ Home Health Services,2017,095,Other nervous system disorders,009,OTHER OR THER NERV SYS,023,Spinal procedures,01,Diseases and Disorders of the Nervous System,1,Minor,Minor,Surgical,Medicare,Blue Cross/Blue Shield,Self-Pay,,N,N,28468.79,7126.16
New York City,Manhattan,7002054,003975,New York Presbyterian Hospital - Allen Hospital,50 to 69,104,F,Black/African American,Spanish/Hispanic,4,Elective,Home w/ Home Health Services,2017,237,Complication of device; implant or graft,009,OTHER OR THER NERV SYS,023,Spinal procedures,01,Diseases and Disorders of the Nervous System,2,Moderate,Moderate,Surgical,Medicare,Medicare,Medicaid,,N,N,113458.45,40255.63
New York City,Manhattan,7002054,003975,New York Presbyterian Hospital - Allen Hospital,30 to 49,OOS,M,Other Race,Not Span/Hispanic,2,Elective,Home or Self Care,2017,205,Spondylosis; intervertebral disc disorders; other back problems,158,SPINAL FUSION,023,Spinal procedures,01,Diseases and Disorders of the Nervous System,1,Minor,Minor,Surgical,Blue Cross/Blue Shield,Self-Pay,,,N,N,82402.03,31544.00
Central NY,Onondaga,3301008,000636,Crouse Hospital,50 to 69,136,F,White,Not Span/Hispanic,1,Emergency,Home or Self Care,2017,237,Complication of device; implant or graft,174,OT NON-OR THER PRC SKIN,023,Spinal procedures,01,Diseases and Disorders of the Nervous System,1,Minor,Minor,Surgical,Blue Cross/Blue Shield,,,,N,N,13447.49,4890.54
Hudson Valley,Rockland,4329000,000779,Good Samaritan Hospital of Suffern,50 to 69,109,M,White,Not Span/Hispanic,6,Emergency,Home w/ Home Health Services,2017,227,Spinal cord injury,009,OTHER OR THER NERV SYS,023,Spinal procedures,01,Diseases and Disorders of the Nervous System,2,Moderate,Minor,Surgical,Blue Cross/Blue Shield,Medicare,Blue Cross/Blue Shield,,N,Y,130873.80,33896.53
New York City,Bronx,7000001,001178,Bronx-Lebanon Hospital Center - Concourse Division,50 to 69,104,F,Other Race,Unknown,1,Elective,Home or Self Care,2017,205,Spondylosis; intervertebral disc disorders; other back problems,003,LAMINECTOMY; EXC IV DSC,023,Spinal procedures,01,Diseases and Disorders of the Nervous System,1,Minor,Minor,Surgical,Medicaid,Medicaid,,,N,N,19138.70,19851.86
New York City,Manhattan,7002053,001463,NYU Langone Hospitals,50 to 69,119,F,White,Not Span/Hispanic,49,Emergency,Inpatient Rehabilitation Facility,2017,227,Spinal cord injury,158,SPINAL FUSION,023,Spinal procedures,01,Diseases and Disorders of the Nervous System,4,Extreme,Major,Surgical,Private Health Insurance,,,,N,Y,2208489.27,537086.21
New York City,Manhattan,7002053,001463,NYU Langone Hospitals,30 to 49,114,F,Other Race,Not Span/Hispanic,5,Elective,Home or Self Care,2017,216,Nervous system congenital anomalies,158,SPINAL FUSION,023,Spinal procedures,01,Diseases and Disorders of the Nervous System,3,Major,Minor,Surgical,Private Health Insurance,,,,N,N,275875.68,63206.80
New York City,Manhattan,7002053,001463,NYU Langone Hospitals,0 to 17,112,M,Black/African American,Spanish/Hispanic,15,Urgent,Home w/ Home Health Services,2017,035,Cancer of brain and nervous system,007,OTHER DX NERV SYS PRCS,023,Spinal procedures,01,Diseases and Disorders of the Nervous System,3,Major,Minor,Surgical,Private Health Insurance,,,,N,N,320747.69,79655.04
New York City,Manhattan,7002053,001463,NYU Langone Hospitals,50 to 69,OOS,F,White,Not Span/Hispanic,6,Emergency,Home w/ Home Health Services,2017,042,Secondary malignancies,158,SPINAL FUSION,023,Spinal procedures,01,Diseases and Disorders of the Nervous System,3,Major,Minor,Surgical,Private Health Insurance,,,,N,Y,374500.09,91770.05
New York City,Manhattan,7002053,001463,NYU Langone Hospitals,70 or Older,115,M,Black/African American,Not Span/Hispanic,6,Emergency,Home w/ Home Health Services,2017,095,Other nervous system disorders,009,OTHER OR THER NERV SYS,023,Spinal procedures,01,Diseases and Disorders of the Nervous System,2,Moderate,Major,Surgical,Medicare,,,,N,Y,163285.64,46256.62
Western NY,Erie,1401014,000207,Buffalo General Medical Center,18 to 29,140,F,White,Not Span/Hispanic,6,Elective,Home or Self Care,2017,095,Other nervous system disorders,008,OT NON-OR THER NERV SYS,023,Spinal procedures,01,Diseases and Disorders of the Nervous System,1,Minor,Moderate,Surgical,Blue Cross/Blue Shield,Self-Pay,,,N,N,60241.07,24062.59
Western NY,Erie,1401014,000207,Buffalo General Medical Center,50 to 69,140,F,White,Not Span/Hispanic,8,Elective,Inpatient Rehabilitation Facility,2017,044,Neoplasms of unspecified nature or uncertain behavior,007,OTHER DX NERV SYS PRCS,023,Spinal procedures,01,Diseases and Disorders of the Nervous System,3,Major,Major,Surgical,Blue Cross/Blue Shield,Self-Pay,,,N,N,99700.18,35750.54
Western NY,Erie,1401014,000208,Women And Children's Hospital Of Buffalo,0 to 17,142,M,Black/African American,Not Span/Hispanic,2,Elective,Home or Self Care,2017,216,Nervous system congenital anomalies,009,OTHER OR THER NERV SYS,023,Spinal procedures,01,Diseases and Disorders of the Nervous System,2,Moderate,Minor,Surgical,Medicaid,Self-Pay,,,N,N,27098.16,10884.16
Western NY,Erie,1401014,000208,Women And Children's Hospital Of Buffalo,0 to 17,147,M,Black/African American,Not Span/Hispanic,1,Elective,Home or Self Care,2017,216,Nervous system congenital anomalies,009,OTHER OR THER NERV SYS,023,Spinal procedures,01,Diseases and Disorders of the Nervous System,3,Major,Minor,Surgical,Medicaid,Self-Pay,,,N,N,23736.44,9202.24
Western NY,Erie,1401014,000208,Women And Children's Hospital Of Buffalo,0 to 17,142,M,White,Not Span/Hispanic,2,Elective,Home or Self Care,2017,216,Nervous system congenital anomalies,003,LAMINECTOMY; EXC IV DSC,023,Spinal procedures,01,Diseases and Disorders of the Nervous System,2,Moderate,Minor,Surgical,Blue Cross/Blue Shield,Self-Pay,,,N,N,20077.30,8102.23
Western NY,Erie,1401014,000208,Women And Children's Hospital Of Buffalo,0 to 17,140,F,White,Not Span/Hispanic,4,Elective,Home or Self Care,2017,216,Nervous system congenital anomalies,009,OTHER OR THER NERV SYS,023,Spinal procedures,01,Diseases and Disorders of the Nervous System,2,Moderate,Minor,Surgical,Private Health Insurance,Medicaid,Self-Pay,,N,N,38802.40,16363.43
Western NY,Erie,1401014,000208,Women And Children's Hospital Of Buffalo,0 to 17,147,M,White,Not Span/Hispanic,3,Elective,Home or Self Care,2017,216,Nervous system congenital anomalies,009,OTHER OR THER NERV SYS,023,Spinal procedures,01,Diseases and Disorders of the Nervous System,2,Moderate,Minor,Surgical,Medicaid,Self-Pay,,,N,N,38493.27,16147.73
Western NY,Erie,1401005,000210,Erie County Medical Center,30 to 49,141,M,Other Race,Not Span/Hispanic,4,Emergency,Home w/ Home Health Services,2017,095,Other nervous system disorders,158,SPINAL FUSION,023,Spinal procedures,01,Diseases and Disorders of the Nervous System,2,Moderate,Minor,Surgical,Self-Pay,,,,N,Y,36676.09,19375.29
Hudson Valley,Orange,3523000,000699,Orange Regional Medical Center,50 to 69,109,M,Other Race,Spanish/Hispanic,7,Trauma,Skilled Nursing Home,2017,227,Spinal cord injury,009,OTHER OR THER NERV SYS,023,Spinal procedures,01,Diseases and Disorders of the Nervous System,2,Moderate,Minor,Surgical,Miscellaneous/Other,Private Health Insurance,,,N,Y,64099.85,22500.40
Hudson Valley,Orange,3523000,000699,Orange Regional Medical Center,50 to 69,OOS,M,White,Not Span/Hispanic,11,Trauma,Inpatient Rehabilitation Facility,2017,227,Spinal cord injury,009,OTHER OR THER NERV SYS,023,Spinal procedures,01,Diseases and Disorders of the Nervous System,3,Major,Moderate,Surgical,Medicare,,,,N,Y,103024.78,45272.22
New York City,Bronx,7000006,001169,Montefiore Medical Center - Henry & Lucy Moses Div,50 to 69,104,M,Other Race,Not Span/Hispanic,9,Elective,Inpatient Rehabilitation Facility,2017,047,Other and unspecified benign neoplasm,009,OTHER OR THER NERV SYS,023,Spinal procedures,01,Diseases and Disorders of the Nervous System,2,Moderate,Minor,Surgical,Medicare,,,,N,N,155759.86,33651.52
New York City,Richmond,7004003,001740,Staten Island University Hosp-North,30 to 49,103,F,White,Not Span/Hispanic,2,Elective,Home or Self Care,2017,047,Other and unspecified benign neoplasm,007,OTHER DX NERV SYS PRCS,023,Spinal procedures,01,Diseases and Disorders of the Nervous System,1,Minor,Minor,Surgical,Medicaid,Medicaid,,,N,N,32359.69,8865.25
New York City,Richmond,7004003,001740,Staten Island University Hosp-North,50 to 69,103,F,White,Not Span/Hispanic,13,Emergency,Home w/ Home Health Services,2017,080,Multiple sclerosis,009,OTHER OR THER NERV SYS,023,Spinal procedures,01,Diseases and Disorders of the Nervous System,2,Moderate,Minor,Surgical,Medicare,Private Health Insurance,Medicaid,,N,Y,88642.04,20844.03
Central NY,Jefferson,2201000,000367,Samaritan Medical Center,50 to 69,136,M,White,Not Span/Hispanic,1,Elective,Home or Self Care,2017,082,Paralysis,158,SPINAL FUSION,023,Spinal procedures,01,Diseases and Disorders of the Nervous System,3,Major,Minor,Surgical,Private Health Insurance,Medicare,Self-Pay,,N,N,36045.80,22636.53
Central NY,Jefferson,2201000,000367,Samaritan Medical Center,30 to 49,136,F,White,Not Span/Hispanic,1,Elective,Home or Self Care,2017,237,Complication of device; implant or graft,002,IRR XCRANIAL VENT SHUNT,023,Spinal procedures,01,Diseases and Disorders of the Nervous System,1,Minor,Minor,Surgical,Medicaid,Self-Pay,Self-Pay,,N,N,17313.98,9008.93
Central NY,Oneida,3202002,000598,St Elizabeth Medical Center,70 or Older,,M,White,Not Span/Hispanic,7,Emergency,Skilled Nursing Home,2017,227,Spinal cord injury,158,SPINAL FUSION,023,Spinal procedures,01,Diseases and Disorders of the Nervous System,2,Moderate,Major,Surgical,Medicare,,,,N,Y,87869.05,33875.83
Central NY,Oneida,3202002,000598,St Elizabeth Medical Center,50 to 69,135,F,Black/African American,Not Span/Hispanic,8,Emergency,Home or Self Care,2017,078,Other CNS infection and poliomyelitis,003,LAMINECTOMY; EXC IV DSC,023,Spinal procedures,01,Diseases and Disorders of the Nervous System,1,Minor,Minor,Surgical,Medicaid,,,,N,Y,54729.61,22236.55