Hospital Service Area,Hospital County,Operating Certificate Number,Permanent Facility Id,Facility Name,Age Group,Zip Code - 3 digits,Gender,Race,Ethnicity,Length of Stay,Type of Admission,Patient Disposition,Discharge Year,CCS Diagnosis Code,CCS Diagnosis Description,CCS Procedure Code,CCS Procedure Description,APR DRG Code,APR DRG Description,APR MDC Code,APR MDC Description,APR Severity of Illness Code,APR Severity of Illness Description,APR Risk of Mortality,APR Medical Surgical Description,Payment Typology 1,Payment Typology 2,Payment Typology 3,Birth Weight,Abortion Edit Indicator,Emergency Department Indicator,Total Charges,Total Costs
New York City,Kings,7002053,001304,NYU Langone Hospital-Brooklyn,30 to 49,112,M,Other Race,Spanish/Hispanic,19,Emergency,Home or Self Care,2019,NVS014,CNS ABSCESS,MST013,SPINE FUSION,023,SPINAL PROCEDURES,01,DISEASES AND DISORDERS OF THE NERVOUS SYSTEM,3,Major,Moderate,Surgical,Medicaid,,,,,true,522831.28,108078.15
New York City,Kings,7002053,001304,NYU Langone Hospital-Brooklyn,50 to 69,103,F,Other Race,Spanish/Hispanic,7,Emergency,Inpatient Rehabilitation Facility,2019,NVS014,CNS ABSCESS,CNS003,SPINAL CANAL AND SPINAL CORD DRAINAGE (EXCLUDING LUMBAR PUNCTURE),023,SPINAL PROCEDURES,01,DISEASES AND DISORDERS OF THE NERVOUS SYSTEM,3,Major,Major,Surgical,Medicaid,,,,,true,188110.5,39067.65
New York City,Kings,7002053,001304,NYU Langone Hospital-Brooklyn,30 to 49,112,M,Other Race,Spanish/Hispanic,3,Emergency,Home or Self Care,2019,INJ008,"TRAUMATIC BRAIN INJURY (TBI); CONCUSSION, INITIAL ENCOUNTER",CNS004,INTRACRANIAL EPIDURAL AND SUBDURAL SPACE DRAINAGE,023,SPINAL PROCEDURES,01,DISEASES AND DISORDERS OF THE NERVOUS SYSTEM,2,Moderate,Minor,Surgical,Medicaid,,,,,true,175676.43,34429.85
New York City,Kings,7002053,001304,NYU Langone Hospital-Brooklyn,70 or Older,112,F,White,Not Span/Hispanic,17,Emergency,Inpatient Rehabilitation Facility,2019,NVS014,CNS ABSCESS,CNS003,SPINAL CANAL AND SPINAL CORD DRAINAGE (EXCLUDING LUMBAR PUNCTURE),023,SPINAL PROCEDURES,01,DISEASES AND DISORDERS OF THE NERVOUS SYSTEM,4,Extreme,Extreme,Surgical,Medicare,Medicare,,,,true,441797.73,105844.96
New York City,Kings,7002053,001304,NYU Langone Hospital-Brooklyn,18 to 29,112,F,Black/African American,Spanish/Hispanic,6,Emergency,Inpatient Rehabilitation Facility,2019,NVS008,PARALYSIS (OTHER THAN CEREBRAL PALSY),MST016,VERTEBRAL DISCECTOMY,023,SPINAL PROCEDURES,01,DISEASES AND DISORDERS OF THE NERVOUS SYSTEM,2,Moderate,Minor,Surgical,Private Health Insurance,,,,,true,117430.5,29390.72
New York City,Kings,7002053,001304,NYU Langone Hospital-Brooklyn,0 to 17,112,M,White,Not Span/Hispanic,1,Emergency,Short-term Hospital,2019,INJ008,"TRAUMATIC BRAIN INJURY (TBI); CONCUSSION, INITIAL ENCOUNTER",CNS004,INTRACRANIAL EPIDURAL AND SUBDURAL SPACE DRAINAGE,023,SPINAL PROCEDURES,01,DISEASES AND DISORDERS OF THE NERVOUS SYSTEM,2,Moderate,Minor,Surgical,Blue Cross/Blue Shield,Medicaid,,,,true,109807.47,19195.14
New York City,Kings,7002053,001304,NYU Langone Hospital-Brooklyn,70 or Older,112,M,White,Not Span/Hispanic,13,Emergency,Inpatient Rehabilitation Facility,2019,INJ009,"SPINAL CORD INJURY (SCI), INITIAL ENCOUNTER",CNS011,MENINGES REPAIR,023,SPINAL PROCEDURES,01,DISEASES AND DISORDERS OF THE NERVOUS SYSTEM,3,Major,Major,Surgical,Medicare,Blue Cross/Blue Shield,,,,true,241284.67,62015.25
New York City,Kings,7002053,001304,NYU Langone Hospital-Brooklyn,0 to 17,112,F,Other Race,Spanish/Hispanic,2,Emergency,Short-term Hospital,2019,INJ008,"TRAUMATIC BRAIN INJURY (TBI); CONCUSSION, INITIAL ENCOUNTER",CNS004,INTRACRANIAL EPIDURAL AND SUBDURAL SPACE DRAINAGE,023,SPINAL PROCEDURES,01,DISEASES AND DISORDERS OF THE NERVOUS SYSTEM,2,Moderate,Minor,Surgical,Medicaid,,,,,true,128243.63,28323.99
New York City,Kings,7002053,001304,NYU Langone Hospital-Brooklyn,50 to 69,112,F,Other Race,Spanish/Hispanic,12,Emergency,Home w/ Home Health Services,2019,NEO070,SECONDARY MALIGNANCIES,CNS007,CNS EXCISION PROCEDURES,023,SPINAL PROCEDURES,01,DISEASES AND DISORDERS OF THE NERVOUS SYSTEM,3,Major,Major,Surgical,Medicaid,,,,,true,667918.68,122176.87
New York City,Kings,7002053,001304,NYU Langone Hospital-Brooklyn,50 to 69,103,F,Other Race,Not Span/Hispanic,6,Elective,Inpatient Rehabilitation Facility,2019,NEO073,BENIGN NEOPLASMS,CNS007,CNS EXCISION PROCEDURES,023,SPINAL PROCEDURES,01,DISEASES AND DISORDERS OF THE NERVOUS SYSTEM,3,Major,Minor,Surgical,Private Health Insurance,,,,,false,230519.58,45531.25
New York City,Kings,7002053,001304,NYU Langone Hospital-Brooklyn,70 or Older,104,M,Other Race,Spanish/Hispanic,3,Elective,Inpatient Rehabilitation Facility,2019,NEO070,SECONDARY MALIGNANCIES,CNS007,CNS EXCISION PROCEDURES,023,SPINAL PROCEDURES,01,DISEASES AND DISORDERS OF THE NERVOUS SYSTEM,2,Moderate,Moderate,Surgical,Medicaid,,,,,false,166001.43,31160.66
New York City,Kings,7002053,001304,NYU Langone Hospital-Brooklyn,30 to 49,112,F,White,Spanish/Hispanic,21,Emergency,Inpatient Rehabilitation Facility,2019,INJ009,"SPINAL CORD INJURY (SCI), INITIAL ENCOUNTER",MST013,SPINE FUSION,023,SPINAL PROCEDURES,01,DISEASES AND DISORDERS OF THE NERVOUS SYSTEM,3,Major,Moderate,Surgical,Medicaid,,,,,true,729765.37,168574.1
New York City,Kings,7002053,001304,NYU Langone Hospital-Brooklyn,18 to 29,112,M,White,Not Span/Hispanic,11,Emergency,Home or Self Care,2019,INJ008,"TRAUMATIC BRAIN INJURY (TBI); CONCUSSION, INITIAL ENCOUNTER",CNS004,INTRACRANIAL EPIDURAL AND SUBDURAL SPACE DRAINAGE,023,SPINAL PROCEDURES,01,DISEASES AND DISORDERS OF THE NERVOUS SYSTEM,3,Major,Major,Surgical,Private Health Insurance,,,,,true,242839.45,69464.4
New York City,Kings,7002053,001304,NYU Langone Hospital-Brooklyn,50 to 69,112,F,Other Race,Not Span/Hispanic,9,Emergency,Home w/ Home Health Services,2019,NEO070,SECONDARY MALIGNANCIES,CNS008,SPINAL CORD DECOMPRESSION,023,SPINAL PROCEDURES,01,DISEASES AND DISORDERS OF THE NERVOUS SYSTEM,2,Moderate,Major,Surgical,Medicaid,,,,,true,284875.5,49785.74
New York City,Kings,7002053,001304,NYU Langone Hospital-Brooklyn,50 to 69,112,M,Other Race,Spanish/Hispanic,3,Emergency,Home or Self Care,2019,NVS008,PARALYSIS (OTHER THAN CEREBRAL PALSY),CNS008,SPINAL CORD DECOMPRESSION,023,SPINAL PROCEDURES,01,DISEASES AND DISORDERS OF THE NERVOUS SYSTEM,2,Moderate,Minor,Surgical,Blue Cross/Blue Shield,,,,,true,151888.44,27949.01
