Hospital Service Area,Hospital County,Operating Certificate Number,Permanent Facility Id,Facility Name,Age Group,Zip Code - 3 digits,Gender,Race,Ethnicity,Length of Stay,Type of Admission,Patient Disposition,Discharge Year,CCS Diagnosis Code,CCS Diagnosis Description,CCS Procedure Code,CCS Procedure Description,APR DRG Code,APR DRG Description,APR MDC Code,APR MDC Description,APR Severity of Illness Code,APR Severity of Illness Description,APR Risk of Mortality,APR Medical Surgical Description,Payment Typology 1,Payment Typology 2,Payment Typology 3,Birth Weight,Abortion Edit Indicator,Emergency Department Indicator,Total Charges,Total Costs
New York City,Manhattan,7002053,001463,NYU Langone Hospitals,70 or Older,113,F,White,Not Span/Hispanic,1,Elective,Home w/ Home Health Services,2019,MUS011,SPONDYLOPATHIES/SPONDYLOARTHROPATHY (INCLUDING INFECTIVE),MST013,SPINE FUSION,023,SPINAL PROCEDURES,01,DISEASES AND DISORDERS OF THE NERVOUS SYSTEM,1,Minor,Minor,Surgical,Medicaid,,,,,false,143622.17,25438.9
New York City,Manhattan,7002053,001463,NYU Langone Hospitals,50 to 69,103,F,Other Race,Not Span/Hispanic,10,Emergency,Inpatient Rehabilitation Facility,2019,NVS020,OTHER SPECIFIED NERVOUS SYSTEM DISORDERS,MST013,SPINE FUSION,023,SPINAL PROCEDURES,01,DISEASES AND DISORDERS OF THE NERVOUS SYSTEM,2,Moderate,Moderate,Surgical,Medicaid,,,,,true,427522.88,86487.66
New York City,Manhattan,7002053,001463,NYU Langone Hospitals,0 to 17,103,M,Other Race,Not Span/Hispanic,3,Elective,Home or Self Care,2019,MAL004,NERVOUS SYSTEM CONGENITAL ANOMALIES,CNS008,SPINAL CORD DECOMPRESSION,023,SPINAL PROCEDURES,01,DISEASES AND DISORDERS OF THE NERVOUS SYSTEM,2,Moderate,Minor,Surgical,Medicaid,,,,,false,75124.85,15902.09
New York City,Manhattan,7002053,001463,NYU Langone Hospitals,50 to 69,112,F,Black/African American,Not Span/Hispanic,26,Elective,Inpatient Rehabilitation Facility,2019,NEO073,BENIGN NEOPLASMS,CNS007,CNS EXCISION PROCEDURES,023,SPINAL PROCEDURES,01,DISEASES AND DISORDERS OF THE NERVOUS SYSTEM,4,Extreme,Extreme,Surgical,Medicare,Medicaid,,,,false,764952.31,203447.7
New York City,Manhattan,7002053,001463,NYU Langone Hospitals,0 to 17,113,F,White,Not Span/Hispanic,7,Elective,Inpatient Rehabilitation Facility,2019,MAL004,NERVOUS SYSTEM CONGENITAL ANOMALIES,CNS007,CNS EXCISION PROCEDURES,023,SPINAL PROCEDURES,01,DISEASES AND DISORDERS OF THE NERVOUS SYSTEM,2,Moderate,Minor,Surgical,Medicaid,,,,,false,133566.74,36251.17
New York City,Manhattan,7002053,001463,NYU Langone Hospitals,50 to 69,103,M,Other Race,Spanish/Hispanic,5,Elective,Home w/ Home Health Services,2019,NVS021,POSTPROCEDURAL OR POSTOPERATIVE NERVOUS SYSTEM COMPLICATION,MST013,SPINE FUSION,023,SPINAL PROCEDURES,01,DISEASES AND DISORDERS OF THE NERVOUS SYSTEM,3,Major,Moderate,Surgical,Blue Cross/Blue Shield,,,,,false,386659.24,71120.15
New York City,Manhattan,7002053,001463,NYU Langone Hospitals,70 or Older,112,F,Other Race,Not Span/Hispanic,7,Urgent,Skilled Nursing Home,2019,NEO073,BENIGN NEOPLASMS,CNS007,CNS EXCISION PROCEDURES,023,SPINAL PROCEDURES,01,DISEASES AND DISORDERS OF THE NERVOUS SYSTEM,2,Moderate,Minor,Surgical,Medicare,Medicaid,,,,false,231940.41,50305.52
New York City,Manhattan,7002053,001463,NYU Langone Hospitals,0 to 17,117,F,White,Not Span/Hispanic,2,Elective,Home or Self Care,2019,MAL004,NERVOUS SYSTEM CONGENITAL ANOMALIES,CNS008,SPINAL CORD DECOMPRESSION,023,SPINAL PROCEDURES,01,DISEASES AND DISORDERS OF THE NERVOUS SYSTEM,1,Minor,Minor,Surgical,Blue Cross/Blue Shield,,,,,false,88893.8,17531.14
New York City,Manhattan,7002053,001463,NYU Langone Hospitals,18 to 29,OOS,M,White,Not Span/Hispanic,4,Elective,Home w/ Home Health Services,2019,MAL004,NERVOUS SYSTEM CONGENITAL ANOMALIES,PNS005,PERIPHERAL NERVE DENERVATION,023,SPINAL PROCEDURES,01,DISEASES AND DISORDERS OF THE NERVOUS SYSTEM,2,Moderate,Minor,Surgical,Blue Cross/Blue Shield,,,,,false,164142.16,36882.77
New York City,Manhattan,7002053,001463,NYU Langone Hospitals,50 to 69,110,F,White,Not Span/Hispanic,3,Elective,Home or Self Care,2019,NEO072,NEOPLASMS OF UNSPECIFIED NATURE OR UNCERTAIN BEHAVIOR,CNS007,CNS EXCISION PROCEDURES,023,SPINAL PROCEDURES,01,DISEASES AND DISORDERS OF THE NERVOUS SYSTEM,2,Moderate,Minor,Surgical,Medicaid,,,,,false,165329.11,35538.92
New York City,Manhattan,7002053,001463,NYU Langone Hospitals,70 or Older,OOS,F,White,Not Span/Hispanic,18,Emergency,Home w/ Home Health Services,2019,NVS021,POSTPROCEDURAL OR POSTOPERATIVE NERVOUS SYSTEM COMPLICATION,CNS010,CEREBROSPINAL FLUID SHUNT PROCEDURES,023,SPINAL PROCEDURES,01,DISEASES AND DISORDERS OF THE NERVOUS SYSTEM,3,Major,Minor,Surgical,Medicare,Blue Cross/Blue Shield,,,,false,363308.13,120639.39
New York City,Manhattan,7002053,001463,NYU Langone Hospitals,18 to 29,107,M,White,Not Span/Hispanic,2,Elective,Home or Self Care,2019,NEO073,BENIGN NEOPLASMS,CNS007,CNS EXCISION PROCEDURES,023,SPINAL PROCEDURES,01,DISEASES AND DISORDERS OF THE NERVOUS SYSTEM,1,Minor,Minor,Surgical,Private Health Insurance,,,,,false,158719.55,29609.64
New York City,Manhattan,7002053,001463,NYU Langone Hospitals,70 or Older,113,F,White,Not Span/Hispanic,3,Elective,Home or Self Care,2019,NVS020,OTHER SPECIFIED NERVOUS SYSTEM DISORDERS,CNS008,SPINAL CORD DECOMPRESSION,023,SPINAL PROCEDURES,01,DISEASES AND DISORDERS OF THE NERVOUS SYSTEM,2,Moderate,Moderate,Surgical,Medicaid,,,,,false,108774.5,24208.7
New York City,Manhattan,7002053,001463,NYU Langone Hospitals,30 to 49,100,M,White,Not Span/Hispanic,6,Elective,Home or Self Care,2019,NEO072,NEOPLASMS OF UNSPECIFIED NATURE OR UNCERTAIN BEHAVIOR,MST012,BONE FIXATION (EXCLUDING EXTREMITIES),023,SPINAL PROCEDURES,01,DISEASES AND DISORDERS OF THE NERVOUS SYSTEM,2,Moderate,Minor,Surgical,Private Health Insurance,,,,,false,240478.58,54470.28
New York City,Manhattan,7002053,001463,NYU Langone Hospitals,0 to 17,112,M,Black/African American,Not Span/Hispanic,1,Elective,Home or Self Care,2019,MAL004,NERVOUS SYSTEM CONGENITAL ANOMALIES,CNS008,SPINAL CORD DECOMPRESSION,023,SPINAL PROCEDURES,01,DISEASES AND DISORDERS OF THE NERVOUS SYSTEM,2,Moderate,Minor,Surgical,Blue Cross/Blue Shield,,,,,false,53866.93,10182.42
New York City,Manhattan,7002053,001463,NYU Langone Hospitals,50 to 69,103,M,Black/African American,Not Span/Hispanic,6,Elective,Inpatient Rehabilitation Facility,2019,NVS020,OTHER SPECIFIED NERVOUS SYSTEM DISORDERS,CNS008,SPINAL CORD DECOMPRESSION,023,SPINAL PROCEDURES,01,DISEASES AND DISORDERS OF THE NERVOUS SYSTEM,1,Minor,Minor,Surgical,Blue Cross/Blue Shield,,,,,false,223734.01,48880.52
New York City,Manhattan,7002053,001463,NYU Langone Hospitals,0 to 17,112,F,Other Race,Spanish/Hispanic,7,Elective,Home or Self Care,2019,NVS021,POSTPROCEDURAL OR POSTOPERATIVE NERVOUS SYSTEM COMPLICATION,CNS011,MENINGES REPAIR,023,SPINAL PROCEDURES,01,DISEASES AND DISORDERS OF THE NERVOUS SYSTEM,2,Moderate,Minor,Surgical,Private Health Insurance,,,,,false,90759.96,25543.42
New York City,Manhattan,7002053,001463,NYU Langone Hospitals,30 to 49,112,M,Other Race,Not Span/Hispanic,15,Emergency,Home or Self Care,2019,NVS021,POSTPROCEDURAL OR POSTOPERATIVE NERVOUS SYSTEM COMPLICATION,CNS011,MENINGES REPAIR,023,SPINAL PROCEDURES,01,DISEASES AND DISORDERS OF THE NERVOUS SYSTEM,2,Moderate,Minor,Surgical,Private Health Insurance,,,,,true,334178.49,105453.92
New York City,Manhattan,7002053,001463,NYU Langone Hospitals,0 to 17,,F,White,Not Span/Hispanic,2,Elective,Home or Self Care,2019,MAL004,NERVOUS SYSTEM CONGENITAL ANOMALIES,CNS007,CNS EXCISION PROCEDURES,023,SPINAL PROCEDURES,01,DISEASES AND DISORDERS OF THE NERVOUS SYSTEM,2,Moderate,Minor,Surgical,Private Health Insurance,,,,,false,64902.92,14085.15
New York City,Manhattan,7002053,001463,NYU Langone Hospitals,30 to 49,100,M,Other Race,Spanish/Hispanic,5,Elective,Home or Self Care,2019,MAL004,NERVOUS SYSTEM CONGENITAL ANOMALIES,CAR010,LIGATION AND EMBOLIZATION OF VESSELS,023,SPINAL PROCEDURES,01,DISEASES AND DISORDERS OF THE NERVOUS SYSTEM,2,Moderate,Minor,Surgical,Blue Cross/Blue Shield,,,,,false,311643.38,66058.93
New York City,Manhattan,7002053,001463,NYU Langone Hospitals,0 to 17,OOS,M,White,Not Span/Hispanic,6,Elective,Inpatient Rehabilitation Facility,2019,NVS007,CEREBRAL PALSY,PNS001,LUMBOSACRAL NERVE DECOMPRESSION,023,SPINAL PROCEDURES,01,DISEASES AND DISORDERS OF THE NERVOUS SYSTEM,3,Major,Minor,Surgical,Blue Cross/Blue Shield,,,,,false,108339.95,30695.61
New York City,Manhattan,7002053,001463,NYU Langone Hospitals,70 or Older,100,M,Black/African American,Not Span/Hispanic,23,Emergency,Home w/ Home Health Services,2019,NVS021,POSTPROCEDURAL OR POSTOPERATIVE NERVOUS SYSTEM COMPLICATION,MST013,SPINE FUSION,023,SPINAL PROCEDURES,01,DISEASES AND DISORDERS OF THE NERVOUS SYSTEM,4,Extreme,Major,Surgical,Medicare,Medicaid,,,,true,626423.93,145604.55
New York City,Manhattan,7002053,001463,NYU Langone Hospitals,50 to 69,108,F,White,Not Span/Hispanic,16,Emergency,Home or Self Care,2019,NEO070,SECONDARY MALIGNANCIES,CNS007,CNS EXCISION PROCEDURES,023,SPINAL PROCEDURES,01,DISEASES AND DISORDERS OF THE NERVOUS SYSTEM,3,Major,Major,Surgical,Private Health Insurance,Medicare,,,,true,398221.1,107514.36
New York City,Manhattan,7002053,001463,NYU Langone Hospitals,70 or Older,114,F,Black/African American,Not Span/Hispanic,8,Emergency,Home w/ Home Health Services,2019,NVS021,POSTPROCEDURAL OR POSTOPERATIVE NERVOUS SYSTEM COMPLICATION,ENT012,"ENT EXCISION (EXCLUDING NASAL PASSAGE, SINUSES, TONGUE, SALIVARY GLANDS, LARYNX)",023,SPINAL PROCEDURES,01,DISEASES AND DISORDERS OF THE NERVOUS SYSTEM,3,Major,Moderate,Surgical,Medicare,Blue Cross/Blue Shield,,,,false,213812.81,61723.5
New York City,Manhattan,7002053,001463,NYU Langone Hospitals,0 to 17,112,F,Other Race,Spanish/Hispanic,2,Elective,Home or Self Care,2019,MAL004,NERVOUS SYSTEM CONGENITAL ANOMALIES,CNS008,SPINAL CORD DECOMPRESSION,023,SPINAL PROCEDURES,01,DISEASES AND DISORDERS OF THE NERVOUS SYSTEM,1,Minor,Minor,Surgical,Private Health Insurance,,,,,false,87822.61,17768.17
New York City,Manhattan,7002053,001463,NYU Langone Hospitals,50 to 69,117,F,White,Not Span/Hispanic,10,Urgent,Inpatient Rehabilitation Facility,2019,NVS020,OTHER SPECIFIED NERVOUS SYSTEM DISORDERS,CNS008,SPINAL CORD DECOMPRESSION,023,SPINAL PROCEDURES,01,DISEASES AND DISORDERS OF THE NERVOUS SYSTEM,1,Minor,Minor,Surgical,Blue Cross/Blue Shield,,,,,false,260926.25,63918.67
New York City,Manhattan,7002053,001463,NYU Langone Hospitals,50 to 69,103,M,Black/African American,Not Span/Hispanic,14,Emergency,Inpatient Rehabilitation Facility,2019,NVS021,POSTPROCEDURAL OR POSTOPERATIVE NERVOUS SYSTEM COMPLICATION,CNS011,MENINGES REPAIR,023,SPINAL PROCEDURES,01,DISEASES AND DISORDERS OF THE NERVOUS SYSTEM,2,Moderate,Moderate,Surgical,Blue Cross/Blue Shield,,,,,true,277143.61,77537.55
New York City,Manhattan,7002053,001463,NYU Langone Hospitals,30 to 49,112,F,Black/African American,Not Span/Hispanic,2,Elective,Home w/ Home Health Services,2019,NVS015,POLYNEUROPATHIES,MST028,"SUBCUTANEOUS TISSUE AND FASCIA PROCEDURES, NEC",023,SPINAL PROCEDURES,01,DISEASES AND DISORDERS OF THE NERVOUS SYSTEM,2,Moderate,Minor,Surgical,Blue Cross/Blue Shield,,,,,false,449175.57,73282.33
New York City,Manhattan,7002053,001463,NYU Langone Hospitals,0 to 17,OOS,M,Multi-racial,Not Span/Hispanic,6,Elective,Home or Self Care,2019,MAL004,NERVOUS SYSTEM CONGENITAL ANOMALIES,CNS008,SPINAL CORD DECOMPRESSION,023,SPINAL PROCEDURES,01,DISEASES AND DISORDERS OF THE NERVOUS SYSTEM,2,Moderate,Minor,Surgical,Blue Cross/Blue Shield,,,,,false,204466.88,42438.76
New York City,Manhattan,7002053,001463,NYU Langone Hospitals,18 to 29,112,F,Other Race,Spanish/Hispanic,3,Elective,Inpatient Rehabilitation Facility,2019,NEO049,NERVOUS SYSTEM CANCERS - ALL OTHER TYPES,CNS007,CNS EXCISION PROCEDURES,023,SPINAL PROCEDURES,01,DISEASES AND DISORDERS OF THE NERVOUS SYSTEM,2,Moderate,Minor,Surgical,Blue Cross/Blue Shield,,,,,false,176681.16,37679.31
New York City,Manhattan,7002053,001463,NYU Langone Hospitals,50 to 69,113,F,White,Not Span/Hispanic,4,Elective,Home w/ Home Health Services,2019,NEO073,BENIGN NEOPLASMS,CNS007,CNS EXCISION PROCEDURES,023,SPINAL PROCEDURES,01,DISEASES AND DISORDERS OF THE NERVOUS SYSTEM,2,Moderate,Minor,Surgical,Blue Cross/Blue Shield,,,,,false,203571.25,39910.39
New York City,Manhattan,7002053,001463,NYU Langone Hospitals,50 to 69,100,F,White,Not Span/Hispanic,5,Elective,Home or Self Care,2019,NEO073,BENIGN NEOPLASMS,CNS007,CNS EXCISION PROCEDURES,023,SPINAL PROCEDURES,01,DISEASES AND DISORDERS OF THE NERVOUS SYSTEM,2,Moderate,Minor,Surgical,Private Health Insurance,,,,,false,228892.93,44957.31
New York City,Manhattan,7002053,001463,NYU Langone Hospitals,30 to 49,112,M,Black/African American,Not Span/Hispanic,9,Emergency,Inpatient Rehabilitation Facility,2019,NVS020,OTHER SPECIFIED NERVOUS SYSTEM DISORDERS,CNS007,CNS EXCISION PROCEDURES,023,SPINAL PROCEDURES,01,DISEASES AND DISORDERS OF THE NERVOUS SYSTEM,1,Minor,Minor,Surgical,Blue Cross/Blue Shield,,,,,true,303984.8,72870.18
New York City,Manhattan,7002053,001463,NYU Langone Hospitals,70 or Older,112,M,White,Not Span/Hispanic,1,Elective,Home or Self Care,2019,NVS020,OTHER SPECIFIED NERVOUS SYSTEM DISORDERS,CNS008,SPINAL CORD DECOMPRESSION,023,SPINAL PROCEDURES,01,DISEASES AND DISORDERS OF THE NERVOUS SYSTEM,1,Minor,Moderate,Surgical,Medicare,Blue Cross/Blue Shield,,,,false,55577.07,10457.65
New York City,Manhattan,7002053,001463,NYU Langone Hospitals,0 to 17,113,F,White,Not Span/Hispanic,6,Emergency,Home or Self Care,2019,NVS021,POSTPROCEDURAL OR POSTOPERATIVE NERVOUS SYSTEM COMPLICATION,CNS011,MENINGES REPAIR,023,SPINAL PROCEDURES,01,DISEASES AND DISORDERS OF THE NERVOUS SYSTEM,2,Moderate,Minor,Surgical,Medicaid,,,,,true,98284.62,25126.84
New York City,Manhattan,7002053,001463,NYU Langone Hospitals,50 to 69,114,F,Other Race,Not Span/Hispanic,8,Elective,Skilled Nursing Home,2019,NEO073,BENIGN NEOPLASMS,CNS007,CNS EXCISION PROCEDURES,023,SPINAL PROCEDURES,01,DISEASES AND DISORDERS OF THE NERVOUS SYSTEM,2,Moderate,Moderate,Surgical,Private Health Insurance,,,,,false,292108.12,71587.95
New York City,Manhattan,7002053,001463,NYU Langone Hospitals,30 to 49,113,F,White,Not Span/Hispanic,8,Elective,Home or Self Care,2019,MAL004,NERVOUS SYSTEM CONGENITAL ANOMALIES,CNS007,CNS EXCISION PROCEDURES,023,SPINAL PROCEDURES,01,DISEASES AND DISORDERS OF THE NERVOUS SYSTEM,3,Major,Moderate,Surgical,Blue Cross/Blue Shield,,,,,false,311733.67,70302.72
New York City,Manhattan,7002053,001463,NYU Langone Hospitals,70 or Older,115,M,White,Not Span/Hispanic,13,Elective,Skilled Nursing Home,2019,NVS021,POSTPROCEDURAL OR POSTOPERATIVE NERVOUS SYSTEM COMPLICATION,PNS001,LUMBOSACRAL NERVE DECOMPRESSION,023,SPINAL PROCEDURES,01,DISEASES AND DISORDERS OF THE NERVOUS SYSTEM,3,Major,Major,Surgical,Medicare,Medicare,,,,false,219391.06,70378.35
New York City,Manhattan,7002053,001463,NYU Langone Hospitals,30 to 49,OOS,F,Other Race,Unknown,8,Elective,Inpatient Rehabilitation Facility,2019,NEO049,NERVOUS SYSTEM CANCERS - ALL OTHER TYPES,CNS007,CNS EXCISION PROCEDURES,023,SPINAL PROCEDURES,01,DISEASES AND DISORDERS OF THE NERVOUS SYSTEM,2,Moderate,Moderate,Surgical,Private Health Insurance,,,,,false,400210.39,80796.23
New York City,Manhattan,7002053,001463,NYU Langone Hospitals,70 or Older,113,M,White,Not Span/Hispanic,4,Elective,Inpatient Rehabilitation Facility,2019,INJ009,"SPINAL CORD INJURY (SCI), INITIAL ENCOUNTER",CNS008,SPINAL CORD DECOMPRESSION,023,SPINAL PROCEDURES,01,DISEASES AND DISORDERS OF THE NERVOUS SYSTEM,3,Major,Moderate,Surgical,Medicare,Medicare,,,,false,190621.05,41266.36
New York City,Manhattan,7002053,001463,NYU Langone Hospitals,18 to 29,,M,White,Unknown,1,Elective,Home w/ Home Health Services,2019,NVS007,CEREBRAL PALSY,CNS001,MINIMALLY INVASIVE CNS BIOPSY,023,SPINAL PROCEDURES,01,DISEASES AND DISORDERS OF THE NERVOUS SYSTEM,3,Major,Moderate,Surgical,Medicaid,,,,,false,81698.13,14437.6
New York City,Manhattan,7002053,001463,NYU Langone Hospitals,30 to 49,OOS,F,Other Race,Not Span/Hispanic,12,Elective,Inpatient Rehabilitation Facility,2019,NEO073,BENIGN NEOPLASMS,CNS007,CNS EXCISION PROCEDURES,023,SPINAL PROCEDURES,01,DISEASES AND DISORDERS OF THE NERVOUS SYSTEM,3,Major,Moderate,Surgical,Federal/State/Local/VA,,,,,false,416916.09,103736.94
New York City,Manhattan,7002053,001463,NYU Langone Hospitals,30 to 49,111,F,White,Not Span/Hispanic,2,Elective,Home or Self Care,2019,MAL004,NERVOUS SYSTEM CONGENITAL ANOMALIES,CNS007,CNS EXCISION PROCEDURES,023,SPINAL PROCEDURES,01,DISEASES AND DISORDERS OF THE NERVOUS SYSTEM,2,Moderate,Minor,Surgical,Blue Cross/Blue Shield,Medicaid,,,,false,116570.46,25932.92
New York City,Manhattan,7002053,001463,NYU Langone Hospitals,30 to 49,104,F,Other Race,Spanish/Hispanic,8,Elective,Home w/ Home Health Services,2019,MAL004,NERVOUS SYSTEM CONGENITAL ANOMALIES,CNS007,CNS EXCISION PROCEDURES,023,SPINAL PROCEDURES,01,DISEASES AND DISORDERS OF THE NERVOUS SYSTEM,3,Major,Major,Surgical,Medicare,Medicaid,,,,false,238498.96,58601.91
New York City,Manhattan,7002053,001463,NYU Langone Hospitals,50 to 69,103,F,White,Not Span/Hispanic,4,Elective,Home w/ Home Health Services,2019,NEO073,BENIGN NEOPLASMS,CNS007,CNS EXCISION PROCEDURES,023,SPINAL PROCEDURES,01,DISEASES AND DISORDERS OF THE NERVOUS SYSTEM,2,Moderate,Minor,Surgical,Private Health Insurance,,,,,false,205748.91,41781.67
New York City,Manhattan,7002053,001463,NYU Langone Hospitals,0 to 17,125,F,White,Not Span/Hispanic,4,Elective,Inpatient Rehabilitation Facility,2019,NVS007,CEREBRAL PALSY,PNS005,PERIPHERAL NERVE DENERVATION,023,SPINAL PROCEDURES,01,DISEASES AND DISORDERS OF THE NERVOUS SYSTEM,3,Major,Minor,Surgical,Medicaid,,,,,false,92610.24,23347.99
New York City,Manhattan,7002053,001463,NYU Langone Hospitals,70 or Older,116,F,Other Race,Not Span/Hispanic,16,Emergency,Home w/ Home Health Services,2019,NEO070,SECONDARY MALIGNANCIES,CNS007,CNS EXCISION PROCEDURES,023,SPINAL PROCEDURES,01,DISEASES AND DISORDERS OF THE NERVOUS SYSTEM,3,Major,Major,Surgical,Medicare,,,,,true,711139.16,143180.17
New York City,Manhattan,7002053,001463,NYU Langone Hospitals,70 or Older,112,F,Black/African American,Not Span/Hispanic,10,Emergency,Inpatient Rehabilitation Facility,2019,NEO073,BENIGN NEOPLASMS,CNS007,CNS EXCISION PROCEDURES,023,SPINAL PROCEDURES,01,DISEASES AND DISORDERS OF THE NERVOUS SYSTEM,3,Major,Major,Surgical,Medicare,,,,,true,405609.95,74833.89
New York City,Manhattan,7002053,001463,NYU Langone Hospitals,30 to 49,112,F,Other Race,Not Span/Hispanic,1,Elective,Home or Self Care,2019,MUS011,SPONDYLOPATHIES/SPONDYLOARTHROPATHY (INCLUDING INFECTIVE),MST016,VERTEBRAL DISCECTOMY,023,SPINAL PROCEDURES,01,DISEASES AND DISORDERS OF THE NERVOUS SYSTEM,1,Minor,Minor,Surgical,Private Health Insurance,,,,,false,235642.49,37317.88
New York City,Manhattan,7002053,001463,NYU Langone Hospitals,0 to 17,109,M,White,Not Span/Hispanic,1,Elective,Home or Self Care,2019,MAL004,NERVOUS SYSTEM CONGENITAL ANOMALIES,CNS008,SPINAL CORD DECOMPRESSION,023,SPINAL PROCEDURES,01,DISEASES AND DISORDERS OF THE NERVOUS SYSTEM,3,Major,Minor,Surgical,Medicaid,,,,,false,75881.38,13449.49
New York City,Manhattan,7002053,001463,NYU Langone Hospitals,0 to 17,117,F,White,Not Span/Hispanic,4,Elective,Home or Self Care,2019,NVS020,OTHER SPECIFIED NERVOUS SYSTEM DISORDERS,CNS007,CNS EXCISION PROCEDURES,023,SPINAL PROCEDURES,01,DISEASES AND DISORDERS OF THE NERVOUS SYSTEM,1,Minor,Minor,Surgical,Blue Cross/Blue Shield,,,,,false,161478.99,36853.95
New York City,Manhattan,7002053,001463,NYU Langone Hospitals,70 or Older,103,M,Other Race,Not Span/Hispanic,4,Elective,Home or Self Care,2019,NEO073,BENIGN NEOPLASMS,CNS008,SPINAL CORD DECOMPRESSION,023,SPINAL PROCEDURES,01,DISEASES AND DISORDERS OF THE NERVOUS SYSTEM,2,Moderate,Moderate,Surgical,Medicare,,,,,false,169392.03,33462.45
New York City,Manhattan,7002053,001463,NYU Langone Hospitals,18 to 29,112,F,White,Spanish/Hispanic,3,Elective,Home w/ Home Health Services,2019,NEO072,NEOPLASMS OF UNSPECIFIED NATURE OR UNCERTAIN BEHAVIOR,CNS007,CNS EXCISION PROCEDURES,023,SPINAL PROCEDURES,01,DISEASES AND DISORDERS OF THE NERVOUS SYSTEM,2,Moderate,Minor,Surgical,Blue Cross/Blue Shield,,,,,false,179185.56,33286.27
New York City,Manhattan,7002053,001463,NYU Langone Hospitals,30 to 49,100,M,White,Not Span/Hispanic,5,Emergency,Home or Self Care,2019,NVS009,EPILEPSY; CONVULSIONS,MST029,"MUSCULOSKELETAL DEVICE PROCEDURES, NEC",023,SPINAL PROCEDURES,01,DISEASES AND DISORDERS OF THE NERVOUS SYSTEM,3,Major,Moderate,Surgical,Private Health Insurance,,,,,true,337466.54,57426.05
New York City,Manhattan,7002053,001463,NYU Langone Hospitals,30 to 49,113,M,White,Not Span/Hispanic,7,Emergency,Home w/ Home Health Services,2019,NEO073,BENIGN NEOPLASMS,CNS011,MENINGES REPAIR,023,SPINAL PROCEDURES,01,DISEASES AND DISORDERS OF THE NERVOUS SYSTEM,2,Moderate,Moderate,Surgical,Blue Cross/Blue Shield,,,,,false,316863.99,61730.61
New York City,Manhattan,7002053,001463,NYU Langone Hospitals,0 to 17,OOS,F,Other Race,Not Span/Hispanic,4,Elective,Home or Self Care,2019,MAL004,NERVOUS SYSTEM CONGENITAL ANOMALIES,CNS008,SPINAL CORD DECOMPRESSION,023,SPINAL PROCEDURES,01,DISEASES AND DISORDERS OF THE NERVOUS SYSTEM,2,Moderate,Minor,Surgical,Private Health Insurance,,,,,false,174231.12,36898.75
New York City,Manhattan,7002053,001463,NYU Langone Hospitals,70 or Older,105,M,White,Not Span/Hispanic,1,Elective,Home or Self Care,2019,NVS014,CNS ABSCESS,CNS007,CNS EXCISION PROCEDURES,023,SPINAL PROCEDURES,01,DISEASES AND DISORDERS OF THE NERVOUS SYSTEM,2,Moderate,Moderate,Surgical,Medicare,Private Health Insurance,,,,false,91976.27,15471.38
New York City,Manhattan,7002053,001463,NYU Langone Hospitals,30 to 49,117,M,Other Race,Not Span/Hispanic,5,Emergency,Home w/ Home Health Services,2019,NVS021,POSTPROCEDURAL OR POSTOPERATIVE NERVOUS SYSTEM COMPLICATION,CNS010,CEREBROSPINAL FLUID SHUNT PROCEDURES,023,SPINAL PROCEDURES,01,DISEASES AND DISORDERS OF THE NERVOUS SYSTEM,2,Moderate,Minor,Surgical,Blue Cross/Blue Shield,,,,,false,102022.61,24463
New York City,Manhattan,7002053,001463,NYU Langone Hospitals,30 to 49,100,F,White,Not Span/Hispanic,14,Emergency,Skilled Nursing Home,2019,NVS020,OTHER SPECIFIED NERVOUS SYSTEM DISORDERS,CNS007,CNS EXCISION PROCEDURES,023,SPINAL PROCEDURES,01,DISEASES AND DISORDERS OF THE NERVOUS SYSTEM,3,Major,Major,Surgical,Blue Cross/Blue Shield,,,,,true,328076.9,73164.95
New York City,Manhattan,7002053,001463,NYU Langone Hospitals,30 to 49,113,M,White,Not Span/Hispanic,8,Emergency,Home w/ Home Health Services,2019,NVS021,POSTPROCEDURAL OR POSTOPERATIVE NERVOUS SYSTEM COMPLICATION,MST005,INCISION AND DRAINAGE OF SUBCUTANEOUS TISSUE AND FASCIA,023,SPINAL PROCEDURES,01,DISEASES AND DISORDERS OF THE NERVOUS SYSTEM,1,Minor,Minor,Surgical,Blue Cross/Blue Shield,,,,,true,235199.97,51904.26
New York City,Manhattan,7002053,001463,NYU Langone Hospitals,50 to 69,112,M,White,Not Span/Hispanic,3,Elective,Home w/ Home Health Services,2019,NVS020,OTHER SPECIFIED NERVOUS SYSTEM DISORDERS,CNS008,SPINAL CORD DECOMPRESSION,023,SPINAL PROCEDURES,01,DISEASES AND DISORDERS OF THE NERVOUS SYSTEM,1,Minor,Moderate,Surgical,Medicaid,,,,,false,103821.07,23807.5
New York City,Manhattan,7002053,001463,NYU Langone Hospitals,30 to 49,103,M,White,Not Span/Hispanic,9,Emergency,Inpatient Rehabilitation Facility,2019,NVS020,OTHER SPECIFIED NERVOUS SYSTEM DISORDERS,CNS008,SPINAL CORD DECOMPRESSION,023,SPINAL PROCEDURES,01,DISEASES AND DISORDERS OF THE NERVOUS SYSTEM,2,Moderate,Minor,Surgical,Medicare,Medicaid,,,,true,293108.45,58918.27
New York City,Manhattan,7002053,001463,NYU Langone Hospitals,0 to 17,113,M,Other Race,Spanish/Hispanic,1,Elective,Home or Self Care,2019,FAC009,"IMPLANT, DEVICE OR GRAFT RELATED ENCOUNTER",CNS013,SPINAL EPIDURAL CATHETER PLACEMENT,023,SPINAL PROCEDURES,01,DISEASES AND DISORDERS OF THE NERVOUS SYSTEM,1,Minor,Moderate,Surgical,Medicaid,,,,,false,157902.16,25617.1