Hospital Service Area,Hospital County,Operating Certificate Number,Permanent Facility Id,Facility Name,Age Group,Zip Code - 3 digits,Gender,Race,Ethnicity,Length of Stay,Type of Admission,Patient Disposition,Discharge Year,CCS Diagnosis Code,CCS Diagnosis Description,CCS Procedure Code,CCS Procedure Description,APR DRG Code,APR DRG Description,APR MDC Code,APR MDC Description,APR Severity of Illness Code,APR Severity of Illness Description,APR Risk of Mortality,APR Medical Surgical Description,Payment Typology 1,Payment Typology 2,Payment Typology 3,Birth Weight,Abortion Edit Indicator,Emergency Department Indicator,Total Charges,Total Costs
New York City,Manhattan,7002053,001463,NYU Langone Hospitals,30 to 49,103,M,White,Not Span/Hispanic,11,Emergency,Inpatient Rehabilitation Facility,2020,NVS021,POSTPROCEDURAL OR POSTOPERATIVE NERVOUS SYSTEM COMPLICATION,CNS008,SPINAL CORD DECOMPRESSION,023,SPINAL PROCEDURES,01,DISEASES AND DISORDERS OF THE NERVOUS SYSTEM,3,Major,Moderate,Surgical,Medicare,Medicaid,,,,N,262767.61,58566.6
New York City,Manhattan,7002053,001463,NYU Langone Hospitals,50 to 69,100,M,White,Not Span/Hispanic,2,Elective,Home w/ Home Health Services,2020,MUS011,SPONDYLOPATHIES/SPONDYLOARTHROPATHY (INCLUDING INFECTIVE),CNS008,SPINAL CORD DECOMPRESSION,023,SPINAL PROCEDURES,01,DISEASES AND DISORDERS OF THE NERVOUS SYSTEM,1,Minor,Minor,Surgical,Miscellaneous/Other,,,,,N,218934.09,34654.7
New York City,Manhattan,7002053,001463,NYU Langone Hospitals,18 to 29,117,M,White,Unknown,18,Emergency,Home w/ Home Health Services,2020,NVS020,OTHER SPECIFIED NERVOUS SYSTEM DISORDERS,CNS008,SPINAL CORD DECOMPRESSION,023,SPINAL PROCEDURES,01,DISEASES AND DISORDERS OF THE NERVOUS SYSTEM,3,Major,Minor,Surgical,Medicaid,,,,,Y,329660.67,85606.8
New York City,Manhattan,7002053,001463,NYU Langone Hospitals,30 to 49,OOS,M,Black/African American,Not Span/Hispanic,7,Elective,Inpatient Rehabilitation Facility,2020,MAL004,NERVOUS SYSTEM CONGENITAL ANOMALIES,CNS007,CNS EXCISION PROCEDURES,023,SPINAL PROCEDURES,01,DISEASES AND DISORDERS OF THE NERVOUS SYSTEM,3,Major,Minor,Surgical,Blue Cross/Blue Shield,,,,,N,253821.33,50289.27
New York City,Manhattan,7002053,001463,NYU Langone Hospitals,70 or Older,OOS,M,White,Not Span/Hispanic,5,Emergency,Home or Self Care,2020,NVS021,POSTPROCEDURAL OR POSTOPERATIVE NERVOUS SYSTEM COMPLICATION,CNS011,MENINGES REPAIR,023,SPINAL PROCEDURES,01,DISEASES AND DISORDERS OF THE NERVOUS SYSTEM,2,Moderate,Minor,Surgical,Medicare,Medicare,,,,Y,130311.86,27203.47
New York City,Manhattan,7002053,001463,NYU Langone Hospitals,18 to 29,OOS,M,White,Not Span/Hispanic,3,Elective,Home or Self Care,2020,MAL004,NERVOUS SYSTEM CONGENITAL ANOMALIES,CNS007,CNS EXCISION PROCEDURES,023,SPINAL PROCEDURES,01,DISEASES AND DISORDERS OF THE NERVOUS SYSTEM,2,Moderate,Minor,Surgical,Private Health Insurance,,,,,N,197758.45,34851.91
New York City,Manhattan,7002053,001463,NYU Langone Hospitals,70 or Older,114,F,Other Race,Not Span/Hispanic,9,Elective,Inpatient Rehabilitation Facility,2020,NVS020,OTHER SPECIFIED NERVOUS SYSTEM DISORDERS,CNS010,CEREBROSPINAL FLUID SHUNT PROCEDURES,023,SPINAL PROCEDURES,01,DISEASES AND DISORDERS OF THE NERVOUS SYSTEM,3,Major,Minor,Surgical,Medicare,Private Health Insurance,,,,N,368904.75,68505.6
New York City,Manhattan,7002053,001463,NYU Langone Hospitals,50 to 69,125,M,White,Not Span/Hispanic,5,Emergency,Home or Self Care,2020,NVS021,POSTPROCEDURAL OR POSTOPERATIVE NERVOUS SYSTEM COMPLICATION,CNS011,MENINGES REPAIR,023,SPINAL PROCEDURES,01,DISEASES AND DISORDERS OF THE NERVOUS SYSTEM,2,Moderate,Moderate,Surgical,Medicare,Blue Cross/Blue Shield,,,,Y,185646.48,44033.19
New York City,Manhattan,7002053,001463,NYU Langone Hospitals,50 to 69,113,M,White,Not Span/Hispanic,21,Emergency,Skilled Nursing Home,2020,NVS020,OTHER SPECIFIED NERVOUS SYSTEM DISORDERS,MST013,SPINE FUSION,023,SPINAL PROCEDURES,01,DISEASES AND DISORDERS OF THE NERVOUS SYSTEM,3,Major,Major,Surgical,Medicare,Private Health Insurance,,,,Y,716005.85,183588.09
New York City,Manhattan,7002053,001463,NYU Langone Hospitals,18 to 29,112,M,Black/African American,Not Span/Hispanic,7,Elective,Home or Self Care,2020,FAC009,"IMPLANT, DEVICE OR GRAFT RELATED ENCOUNTER",MST028,"SUBCUTANEOUS TISSUE AND FASCIA PROCEDURES, NEC",023,SPINAL PROCEDURES,01,DISEASES AND DISORDERS OF THE NERVOUS SYSTEM,4,Extreme,Extreme,Surgical,Private Health Insurance,,,,,N,293082.32,62421.18
New York City,Manhattan,7002053,001463,NYU Langone Hospitals,30 to 49,117,M,White,Not Span/Hispanic,7,Elective,Inpatient Rehabilitation Facility,2020,NVS020,OTHER SPECIFIED NERVOUS SYSTEM DISORDERS,CNS007,CNS EXCISION PROCEDURES,023,SPINAL PROCEDURES,01,DISEASES AND DISORDERS OF THE NERVOUS SYSTEM,2,Moderate,Minor,Surgical,Miscellaneous/Other,,,,,N,285921.55,61937.65
New York City,Manhattan,7002053,001463,NYU Langone Hospitals,0 to 17,103,F,Other Race,Not Span/Hispanic,2,Elective,Home or Self Care,2020,MAL004,NERVOUS SYSTEM CONGENITAL ANOMALIES,CNS008,SPINAL CORD DECOMPRESSION,023,SPINAL PROCEDURES,01,DISEASES AND DISORDERS OF THE NERVOUS SYSTEM,2,Moderate,Minor,Surgical,Private Health Insurance,,,,,N,109618.82,20087.08
New York City,Manhattan,7002053,001463,NYU Langone Hospitals,30 to 49,113,M,White,Not Span/Hispanic,5,Emergency,Inpatient Rehabilitation Facility,2020,MAL004,NERVOUS SYSTEM CONGENITAL ANOMALIES,CNS007,CNS EXCISION PROCEDURES,023,SPINAL PROCEDURES,01,DISEASES AND DISORDERS OF THE NERVOUS SYSTEM,3,Major,Moderate,Surgical,Blue Cross/Blue Shield,,,,,Y,253843.64,56556.81
New York City,Manhattan,7002053,001463,NYU Langone Hospitals,30 to 49,112,M,White,Not Span/Hispanic,8,Emergency,Inpatient Rehabilitation Facility,2020,NVS014,CNS ABSCESS,MST018,BONE EXCISION,023,SPINAL PROCEDURES,01,DISEASES AND DISORDERS OF THE NERVOUS SYSTEM,3,Major,Moderate,Surgical,Medicaid,,,,,Y,273139.69,68691.82
New York City,Manhattan,7002053,001463,NYU Langone Hospitals,30 to 49,119,M,White,Unknown,6,Elective,Inpatient Rehabilitation Facility,2020,MAL004,NERVOUS SYSTEM CONGENITAL ANOMALIES,CNS007,CNS EXCISION PROCEDURES,023,SPINAL PROCEDURES,01,DISEASES AND DISORDERS OF THE NERVOUS SYSTEM,2,Moderate,Minor,Surgical,Private Health Insurance,,,,,N,254430.84,56158.14
New York City,Manhattan,7002053,001463,NYU Langone Hospitals,0 to 17,100,F,Other Race,Spanish/Hispanic,1,Elective,Home or Self Care,2020,MAL004,NERVOUS SYSTEM CONGENITAL ANOMALIES,CNS008,SPINAL CORD DECOMPRESSION,023,SPINAL PROCEDURES,01,DISEASES AND DISORDERS OF THE NERVOUS SYSTEM,2,Moderate,Minor,Surgical,Medicaid,,,,,N,67380.79,12351.12
New York City,Manhattan,7002053,001463,NYU Langone Hospitals,18 to 29,OOS,F,White,Not Span/Hispanic,1,Elective,Home or Self Care,2020,NEO049,NERVOUS SYSTEM CANCERS - ALL OTHER TYPES,CNS007,CNS EXCISION PROCEDURES,023,SPINAL PROCEDURES,01,DISEASES AND DISORDERS OF THE NERVOUS SYSTEM,2,Moderate,Minor,Surgical,Private Health Insurance,,,,,N,100175.37,15600.93
New York City,Manhattan,7002053,001463,NYU Langone Hospitals,70 or Older,100,M,White,Not Span/Hispanic,6,Elective,Inpatient Rehabilitation Facility,2020,NVS020,OTHER SPECIFIED NERVOUS SYSTEM DISORDERS,CNS006,OTHER CNS DRAINAGE AND RELATED PROCEDURES,023,SPINAL PROCEDURES,01,DISEASES AND DISORDERS OF THE NERVOUS SYSTEM,1,Minor,Minor,Surgical,Medicare,Blue Cross/Blue Shield,,,,N,227792,50849.2
New York City,Manhattan,7002053,001463,NYU Langone Hospitals,0 to 17,112,F,White,Not Span/Hispanic,1,Elective,Home or Self Care,2020,MAL004,NERVOUS SYSTEM CONGENITAL ANOMALIES,CNS008,SPINAL CORD DECOMPRESSION,023,SPINAL PROCEDURES,01,DISEASES AND DISORDERS OF THE NERVOUS SYSTEM,2,Moderate,Moderate,Surgical,Medicaid,,,,,N,62590.09,11619.48
New York City,Manhattan,7002053,001463,NYU Langone Hospitals,50 to 69,100,F,White,Not Span/Hispanic,5,Elective,Inpatient Rehabilitation Facility,2020,INJ037,"COMPLICATION OF OTHER SURGICAL OR MEDICAL CARE, INJURY, INITIAL ENCOUNTER",CNS012,CNS NEUROSTIMULATOR PROCEDURES,023,SPINAL PROCEDURES,01,DISEASES AND DISORDERS OF THE NERVOUS SYSTEM,1,Minor,Minor,Surgical,Medicare,Medicaid,,,,N,440017.01,76467.33
New York City,Manhattan,7002053,001463,NYU Langone Hospitals,0 to 17,112,M,White,Not Span/Hispanic,2,Elective,Home or Self Care,2020,NEO070,SECONDARY MALIGNANCIES,CNS007,CNS EXCISION PROCEDURES,023,SPINAL PROCEDURES,01,DISEASES AND DISORDERS OF THE NERVOUS SYSTEM,2,Moderate,Moderate,Surgical,Medicaid,,,,,N,166734.93,32196.8
New York City,Manhattan,7002053,001463,NYU Langone Hospitals,50 to 69,115,M,White,Not Span/Hispanic,14,Emergency,Inpatient Rehabilitation Facility,2020,NVS014,CNS ABSCESS,CNS008,SPINAL CORD DECOMPRESSION,023,SPINAL PROCEDURES,01,DISEASES AND DISORDERS OF THE NERVOUS SYSTEM,3,Major,Moderate,Surgical,Private Health Insurance,,,,,N,334066.42,86477.68
New York City,Manhattan,7002053,001463,NYU Langone Hospitals,30 to 49,113,M,White,Not Span/Hispanic,1,Elective,Home or Self Care,2020,MUS011,SPONDYLOPATHIES/SPONDYLOARTHROPATHY (INCLUDING INFECTIVE),MST013,SPINE FUSION,023,SPINAL PROCEDURES,01,DISEASES AND DISORDERS OF THE NERVOUS SYSTEM,1,Minor,Minor,Surgical,Miscellaneous/Other,,,,,N,199000.12,30541.86
New York City,Manhattan,7002053,001463,NYU Langone Hospitals,50 to 69,125,M,White,Not Span/Hispanic,5,Emergency,Inpatient Rehabilitation Facility,2020,INJ009,"SPINAL CORD INJURY (SCI), INITIAL ENCOUNTER",MST013,SPINE FUSION,023,SPINAL PROCEDURES,01,DISEASES AND DISORDERS OF THE NERVOUS SYSTEM,3,Major,Moderate,Surgical,Medicare,Blue Cross/Blue Shield,,,,N,889948.71,139156.79
New York City,Manhattan,7002053,001463,NYU Langone Hospitals,0 to 17,112,F,White,Not Span/Hispanic,1,Elective,Home or Self Care,2020,MAL004,NERVOUS SYSTEM CONGENITAL ANOMALIES,CNS008,SPINAL CORD DECOMPRESSION,023,SPINAL PROCEDURES,01,DISEASES AND DISORDERS OF THE NERVOUS SYSTEM,2,Moderate,Minor,Surgical,Medicaid,,,,,N,78264.66,13104
New York City,Manhattan,7002053,001463,NYU Langone Hospitals,0 to 17,OOS,M,Other Race,Spanish/Hispanic,1,Elective,Home or Self Care,2020,MAL004,NERVOUS SYSTEM CONGENITAL ANOMALIES,CNS008,SPINAL CORD DECOMPRESSION,023,SPINAL PROCEDURES,01,DISEASES AND DISORDERS OF THE NERVOUS SYSTEM,2,Moderate,Minor,Surgical,Blue Cross/Blue Shield,,,,,N,64302.87,11944.68
New York City,Manhattan,7002053,001463,NYU Langone Hospitals,50 to 69,OOS,F,White,Not Span/Hispanic,7,Emergency,Home w/ Home Health Services,2020,NVS020,OTHER SPECIFIED NERVOUS SYSTEM DISORDERS,CNS011,MENINGES REPAIR,023,SPINAL PROCEDURES,01,DISEASES AND DISORDERS OF THE NERVOUS SYSTEM,1,Minor,Minor,Surgical,Private Health Insurance,,,,,Y,189447.02,48084.7
New York City,Manhattan,7002053,001463,NYU Langone Hospitals,50 to 69,100,M,Other Race,Not Span/Hispanic,6,Elective,Inpatient Rehabilitation Facility,2020,NEO049,NERVOUS SYSTEM CANCERS - ALL OTHER TYPES,CNS007,CNS EXCISION PROCEDURES,023,SPINAL PROCEDURES,01,DISEASES AND DISORDERS OF THE NERVOUS SYSTEM,3,Major,Minor,Surgical,Private Health Insurance,Private Health Insurance,,,,N,381165.63,69313.88
New York City,Manhattan,7002053,001463,NYU Langone Hospitals,30 to 49,103,F,White,Not Span/Hispanic,2,Elective,Home or Self Care,2020,NEO072,NEOPLASMS OF UNSPECIFIED NATURE OR UNCERTAIN BEHAVIOR,CNS007,CNS EXCISION PROCEDURES,023,SPINAL PROCEDURES,01,DISEASES AND DISORDERS OF THE NERVOUS SYSTEM,2,Moderate,Minor,Surgical,Blue Cross/Blue Shield,,,,,N,223828.17,36317.76
New York City,Manhattan,7002053,001463,NYU Langone Hospitals,30 to 49,118,M,White,Not Span/Hispanic,1,Elective,Home or Self Care,2020,INJ037,"COMPLICATION OF OTHER SURGICAL OR MEDICAL CARE, INJURY, INITIAL ENCOUNTER",CNS012,CNS NEUROSTIMULATOR PROCEDURES,023,SPINAL PROCEDURES,01,DISEASES AND DISORDERS OF THE NERVOUS SYSTEM,1,Minor,Minor,Surgical,Miscellaneous/Other,,,,,N,600821.57,86777.86
New York City,Manhattan,7002053,001463,NYU Langone Hospitals,70 or Older,114,F,Other Race,Not Span/Hispanic,9,Elective,Inpatient Rehabilitation Facility,2020,NVS020,OTHER SPECIFIED NERVOUS SYSTEM DISORDERS,CNS008,SPINAL CORD DECOMPRESSION,023,SPINAL PROCEDURES,01,DISEASES AND DISORDERS OF THE NERVOUS SYSTEM,1,Minor,Moderate,Surgical,Medicare,Private Health Insurance,,,,N,268840.27,55971
New York City,Manhattan,7002053,001463,NYU Langone Hospitals,30 to 49,119,M,White,Unknown,12,Emergency,Expired,2020,NEO049,NERVOUS SYSTEM CANCERS - ALL OTHER TYPES,CNS008,SPINAL CORD DECOMPRESSION,023,SPINAL PROCEDURES,01,DISEASES AND DISORDERS OF THE NERVOUS SYSTEM,4,Extreme,Extreme,Surgical,Private Health Insurance,,,,,Y,542072.69,117126.74
New York City,Manhattan,7002053,001463,NYU Langone Hospitals,18 to 29,OOS,F,White,Not Span/Hispanic,6,Emergency,Inpatient Rehabilitation Facility,2020,MAL004,NERVOUS SYSTEM CONGENITAL ANOMALIES,PNS002,CERVICOTHORACIC NERVE DECOMPRESSION,023,SPINAL PROCEDURES,01,DISEASES AND DISORDERS OF THE NERVOUS SYSTEM,2,Moderate,Minor,Surgical,Private Health Insurance,,,,,Y,352592.68,66610.43
New York City,Manhattan,7002053,001463,NYU Langone Hospitals,70 or Older,OOS,F,Other Race,Unknown,4,Elective,Home w/ Home Health Services,2020,NEO073,BENIGN NEOPLASMS,CNS007,CNS EXCISION PROCEDURES,023,SPINAL PROCEDURES,01,DISEASES AND DISORDERS OF THE NERVOUS SYSTEM,3,Major,Moderate,Surgical,Medicare,Blue Cross/Blue Shield,,,,N,323597.41,58564.85
