Hospital Service Area,Hospital County,Operating Certificate Number,Permanent Facility Id,Facility Name,Age Group,Zip Code - 3 digits,Gender,Race,Ethnicity,Length of Stay,Type of Admission,Patient Disposition,Discharge Year,CCS Diagnosis Code,CCS Diagnosis Description,CCS Procedure Code,CCS Procedure Description,APR DRG Code,APR DRG Description,APR MDC Code,APR MDC Description,APR Severity of Illness Code,APR Severity of Illness Description,APR Risk of Mortality,APR Medical Surgical Description,Payment Typology 1,Payment Typology 2,Payment Typology 3,Birth Weight,Abortion Edit Indicator,Emergency Department Indicator,Total Charges,Total Costs
Hudson Valley,Westchester,5902001,001045,White Plains Hospital Center,70 or Older,106,F,Black/African American,Not Span/Hispanic,3,Urgent,Home w/ Home Health Services,2019,DIG024,POSTPROCEDURAL OR POSTOPERATIVE DIGESTIVE SYSTEM COMPLICATION,GIS018,ILEOSTOMY AND COLOSTOMY,231,MAJOR LARGE BOWEL PROCEDURES,06,DISEASES AND DISORDERS OF THE DIGESTIVE SYSTEM,1,Minor,Minor,Surgical,Medicare,,,,,false,40422,7501.9
New York City,Kings,7001020,001305,Maimonides Medical Center,70 or Older,112,F,White,Not Span/Hispanic,5,Elective,Skilled Nursing Home,2019,FAC010,OTHER AFTERCARE ENCOUNTER,GIS009,COLECTOMY,231,MAJOR LARGE BOWEL PROCEDURES,06,DISEASES AND DISORDERS OF THE DIGESTIVE SYSTEM,2,Moderate,Minor,Surgical,Medicare,Private Health Insurance,Self-Pay,,,false,92424.06,28103.45
Southern Tier,Broome,0303001,000058,United Health Services Hospitals Inc. - Wilson Medical Center,50 to 69,139,M,White,Not Span/Hispanic,2,Elective,Home or Self Care,2019,NEO015,GASTROINTESTINAL CANCERS - COLORECTAL,GIS009,COLECTOMY,231,MAJOR LARGE BOWEL PROCEDURES,06,DISEASES AND DISORDERS OF THE DIGESTIVE SYSTEM,2,Moderate,Moderate,Surgical,Medicare,Medicare,,,,false,37525.7,19047.67
Long Island,Suffolk,5151001,000245,Stony Brook University Hospital,50 to 69,119,M,White,Not Span/Hispanic,5,Elective,Home or Self Care,2019,DIG013,DIVERTICULOSIS AND DIVERTICULITIS,GIS009,COLECTOMY,231,MAJOR LARGE BOWEL PROCEDURES,06,DISEASES AND DISORDERS OF THE DIGESTIVE SYSTEM,3,Major,Moderate,Surgical,Blue Cross/Blue Shield,,,,,false,81031.92,32059.94
New York City,Manhattan,7002053,001463,NYU Langone Hospitals,30 to 49,OOS,F,White,Not Span/Hispanic,5,Elective,Home w/ Home Health Services,2019,NEO015,GASTROINTESTINAL CANCERS - COLORECTAL,GIS009,COLECTOMY,231,MAJOR LARGE BOWEL PROCEDURES,06,DISEASES AND DISORDERS OF THE DIGESTIVE SYSTEM,2,Moderate,Moderate,Surgical,Private Health Insurance,,,,,false,158833.35,32840.87
New York City,Kings,7002002,001324,Mount Sinai Brooklyn,70 or Older,112,F,Other Race,Unknown,13,Emergency,Home or Self Care,2019,NEO015,GASTROINTESTINAL CANCERS - COLORECTAL,GIS009,COLECTOMY,231,MAJOR LARGE BOWEL PROCEDURES,06,DISEASES AND DISORDERS OF THE DIGESTIVE SYSTEM,2,Moderate,Moderate,Surgical,Medicare,Medicaid,Self-Pay,,,true,184529.58,32810.81
New York City,Kings,7001016,001301,Kings County Hospital Center,50 to 69,112,M,Black/African American,Not Span/Hispanic,2,Elective,Home or Self Care,2019,NEO073,BENIGN NEOPLASMS,GIS009,COLECTOMY,231,MAJOR LARGE BOWEL PROCEDURES,06,DISEASES AND DISORDERS OF THE DIGESTIVE SYSTEM,1,Minor,Minor,Surgical,Medicaid,,,,,false,27593.46,19601.32
Finger Lakes,Monroe,2701003,000411,Rochester General Hospital,0 to 17,145,F,White,Not Span/Hispanic,5,Elective,Home or Self Care,2019,MAL002,DIGESTIVE CONGENITAL ANOMALIES,GIS009,COLECTOMY,231,MAJOR LARGE BOWEL PROCEDURES,06,DISEASES AND DISORDERS OF THE DIGESTIVE SYSTEM,1,Minor,Minor,Surgical,Medicaid,,,,,false,24307.79,10620.02
Finger Lakes,Monroe,2701003,000411,Rochester General Hospital,50 to 69,145,M,White,Not Span/Hispanic,8,Emergency,Expired,2019,DIG025,OTHER SPECIFIED AND UNSPECIFIED GASTROINTESTINAL DISORDERS,GIS009,COLECTOMY,231,MAJOR LARGE BOWEL PROCEDURES,06,DISEASES AND DISORDERS OF THE DIGESTIVE SYSTEM,4,Extreme,Extreme,Surgical,Medicare,Medicaid,,,,true,87210.18,31530.49
New York City,Manhattan,7002053,001463,NYU Langone Hospitals,70 or Older,100,F,White,Not Span/Hispanic,4,Elective,Home w/ Home Health Services,2019,FAC010,OTHER AFTERCARE ENCOUNTER,GIS009,COLECTOMY,231,MAJOR LARGE BOWEL PROCEDURES,06,DISEASES AND DISORDERS OF THE DIGESTIVE SYSTEM,3,Major,Moderate,Surgical,Medicare,,,,,false,133258.47,25358.7
Long Island,Nassau,2908000,000511,NYU Langone Hospital-Long Island,18 to 29,115,F,White,Not Span/Hispanic,4,Elective,Home or Self Care,2019,DIG025,OTHER SPECIFIED AND UNSPECIFIED GASTROINTESTINAL DISORDERS,GIS009,COLECTOMY,231,MAJOR LARGE BOWEL PROCEDURES,06,DISEASES AND DISORDERS OF THE DIGESTIVE SYSTEM,2,Moderate,Minor,Surgical,Private Health Insurance,,,,,false,210104.95,33424.32
New York City,Manhattan,7002054,001458,New York-Presbyterian Hospital - New York Weill Cornell Center,50 to 69,100,M,Other Race,Not Span/Hispanic,3,Elective,Home or Self Care,2019,DIG013,DIVERTICULOSIS AND DIVERTICULITIS,GNR002,ABDOMINAL WALL REPAIR (INCLUDING HERNIA),231,MAJOR LARGE BOWEL PROCEDURES,06,DISEASES AND DISORDERS OF THE DIGESTIVE SYSTEM,1,Minor,Minor,Surgical,Private Health Insurance,Self-Pay,,,,false,66139.96,18043.63
New York City,Manhattan,7002054,001458,New York-Presbyterian Hospital - New York Weill Cornell Center,30 to 49,OOS,F,Other Race,Spanish/Hispanic,6,Elective,Home or Self Care,2019,FAC010,OTHER AFTERCARE ENCOUNTER,GIS009,COLECTOMY,231,MAJOR LARGE BOWEL PROCEDURES,06,DISEASES AND DISORDERS OF THE DIGESTIVE SYSTEM,1,Minor,Minor,Surgical,Private Health Insurance,,,,,false,111909.84,30145.84
New York City,Manhattan,7002054,001458,New York-Presbyterian Hospital - New York Weill Cornell Center,70 or Older,OOS,M,Other Race,Not Span/Hispanic,3,Elective,Home or Self Care,2019,NEO015,GASTROINTESTINAL CANCERS - COLORECTAL,GIS009,COLECTOMY,231,MAJOR LARGE BOWEL PROCEDURES,06,DISEASES AND DISORDERS OF THE DIGESTIVE SYSTEM,2,Moderate,Minor,Surgical,Medicare,Blue Cross/Blue Shield,Self-Pay,,,false,68649.3,19582.7
Capital/Adirond,Albany,0101004,000005,St. Peter's Hospital,50 to 69,121,M,White,Not Span/Hispanic,19,Elective,Home or Self Care,2019,NEO015,GASTROINTESTINAL CANCERS - COLORECTAL,GIS013,PROCTECTOMY OR ANAL RESECTION,231,MAJOR LARGE BOWEL PROCEDURES,06,DISEASES AND DISORDERS OF THE DIGESTIVE SYSTEM,3,Major,Moderate,Surgical,Blue Cross/Blue Shield,,,,,false,100313.35,44605.69
Capital/Adirond,Albany,0101004,000005,St. Peter's Hospital,50 to 69,120,F,White,Not Span/Hispanic,7,Elective,Home or Self Care,2019,DIG015,ANAL AND RECTAL CONDITIONS,GIS009,COLECTOMY,231,MAJOR LARGE BOWEL PROCEDURES,06,DISEASES AND DISORDERS OF THE DIGESTIVE SYSTEM,2,Moderate,Minor,Surgical,Medicare,Medicare,,,,false,39643.9,18853.37
Finger Lakes,Wayne,5820000,001028,Newark-Wayne Community Hospital,50 to 69,145,M,White,Not Span/Hispanic,7,Emergency,Skilled Nursing Home,2019,NEO015,GASTROINTESTINAL CANCERS - COLORECTAL,GIS009,COLECTOMY,231,MAJOR LARGE BOWEL PROCEDURES,06,DISEASES AND DISORDERS OF THE DIGESTIVE SYSTEM,3,Major,Moderate,Surgical,Medicare,Medicaid,,,,true,34210.73,11993.36
Finger Lakes,Wayne,5820000,001028,Newark-Wayne Community Hospital,30 to 49,144,M,White,Not Span/Hispanic,3,Elective,Home or Self Care,2019,DIG013,DIVERTICULOSIS AND DIVERTICULITIS,GIS009,COLECTOMY,231,MAJOR LARGE BOWEL PROCEDURES,06,DISEASES AND DISORDERS OF THE DIGESTIVE SYSTEM,1,Minor,Minor,Surgical,Blue Cross/Blue Shield,,,,,false,21831.84,8313.76
New York City,Kings,7001002,001286,Brookdale Hospital Medical Center,50 to 69,112,M,Black/African American,Not Span/Hispanic,18,Emergency,Expired,2019,DIG024,POSTPROCEDURAL OR POSTOPERATIVE DIGESTIVE SYSTEM COMPLICATION,GIS018,ILEOSTOMY AND COLOSTOMY,231,MAJOR LARGE BOWEL PROCEDURES,06,DISEASES AND DISORDERS OF THE DIGESTIVE SYSTEM,4,Extreme,Extreme,Surgical,Medicaid,,,,,true,198551.62,107819.82
Long Island,Nassau,2951001,000541,North Shore University Hospital,50 to 69,117,F,White,Not Span/Hispanic,5,Elective,Home or Self Care,2019,DIG013,DIVERTICULOSIS AND DIVERTICULITIS,GIS009,COLECTOMY,231,MAJOR LARGE BOWEL PROCEDURES,06,DISEASES AND DISORDERS OF THE DIGESTIVE SYSTEM,1,Minor,Minor,Surgical,Medicare,Private Health Insurance,,,,false,80669.94,19558.79
Western NY,Erie,1401014,003067,Millard Fillmore Suburban Hospital,70 or Older,142,F,White,Not Span/Hispanic,13,Emergency,Home w/ Home Health Services,2019,DIG013,DIVERTICULOSIS AND DIVERTICULITIS,GIS018,ILEOSTOMY AND COLOSTOMY,231,MAJOR LARGE BOWEL PROCEDURES,06,DISEASES AND DISORDERS OF THE DIGESTIVE SYSTEM,2,Moderate,Moderate,Surgical,Private Health Insurance,Self-Pay,,,,true,76237.47,29380.67
Finger Lakes,Monroe,2701003,000411,Rochester General Hospital,70 or Older,145,M,White,Not Span/Hispanic,8,Elective,Home w/ Home Health Services,2019,NEO015,GASTROINTESTINAL CANCERS - COLORECTAL,GIS009,COLECTOMY,231,MAJOR LARGE BOWEL PROCEDURES,06,DISEASES AND DISORDERS OF THE DIGESTIVE SYSTEM,3,Major,Major,Surgical,Medicare,,,,,false,46113.82,21584.5
Western NY,Erie,1401014,003067,Millard Fillmore Suburban Hospital,50 to 69,142,F,White,Not Span/Hispanic,3,Elective,Home or Self Care,2019,DIG013,DIVERTICULOSIS AND DIVERTICULITIS,GIS009,COLECTOMY,231,MAJOR LARGE BOWEL PROCEDURES,06,DISEASES AND DISORDERS OF THE DIGESTIVE SYSTEM,1,Minor,Minor,Surgical,Medicare,Self-Pay,,,,false,57179.59,17669.13
Finger Lakes,Monroe,2701001,000409,Highland Hospital,50 to 69,145,F,White,Not Span/Hispanic,3,Elective,Home or Self Care,2019,DIG013,DIVERTICULOSIS AND DIVERTICULITIS,GIS009,COLECTOMY,231,MAJOR LARGE BOWEL PROCEDURES,06,DISEASES AND DISORDERS OF THE DIGESTIVE SYSTEM,1,Minor,Minor,Surgical,Self-Pay,,,,,false,40496.3,14459
Finger Lakes,Monroe,2701003,000411,Rochester General Hospital,30 to 49,145,F,White,Not Span/Hispanic,13,Elective,Home or Self Care,2019,MAL002,DIGESTIVE CONGENITAL ANOMALIES,GIS009,COLECTOMY,231,MAJOR LARGE BOWEL PROCEDURES,06,DISEASES AND DISORDERS OF THE DIGESTIVE SYSTEM,2,Moderate,Minor,Surgical,Blue Cross/Blue Shield,,,,,false,49659.78,24030.17
Finger Lakes,Monroe,2701003,000411,Rochester General Hospital,50 to 69,146,F,White,Not Span/Hispanic,2,Elective,Home or Self Care,2019,DIG013,DIVERTICULOSIS AND DIVERTICULITIS,GIS009,COLECTOMY,231,MAJOR LARGE BOWEL PROCEDURES,06,DISEASES AND DISORDERS OF THE DIGESTIVE SYSTEM,1,Minor,Minor,Surgical,Medicaid,,,,,false,19320.75,8042.34
Finger Lakes,Monroe,2701003,000411,Rochester General Hospital,70 or Older,146,F,Black/African American,Not Span/Hispanic,3,Elective,Home or Self Care,2019,NEO073,BENIGN NEOPLASMS,GIS009,COLECTOMY,231,MAJOR LARGE BOWEL PROCEDURES,06,DISEASES AND DISORDERS OF THE DIGESTIVE SYSTEM,1,Minor,Minor,Surgical,Medicare,,,,,false,27144.52,11700.92
Long Island,Suffolk,5154001,000925,Good Samaritan Hospital Medical Center,50 to 69,,F,Other Race,Not Span/Hispanic,5,Elective,Home w/ Home Health Services,2019,FAC010,OTHER AFTERCARE ENCOUNTER,GIS009,COLECTOMY,231,MAJOR LARGE BOWEL PROCEDURES,06,DISEASES AND DISORDERS OF THE DIGESTIVE SYSTEM,1,Minor,Minor,Surgical,Medicare,,,,,false,86366.94,19262.11
Central NY,Oneida,3202003,000599,Faxton-St Lukes Healthcare St Lukes Division,30 to 49,134,M,White,Not Span/Hispanic,6,Elective,Home or Self Care,2019,DIG013,DIVERTICULOSIS AND DIVERTICULITIS,GIS005,EXPLORATION OF PERITONEAL CAVITY,231,MAJOR LARGE BOWEL PROCEDURES,06,DISEASES AND DISORDERS OF THE DIGESTIVE SYSTEM,2,Moderate,Minor,Surgical,Blue Cross/Blue Shield,,,,,false,56452.79,28017.58
Long Island,Nassau,2951001,000541,North Shore University Hospital,50 to 69,113,F,Other Race,Not Span/Hispanic,3,Emergency,Home or Self Care,2019,DIG025,OTHER SPECIFIED AND UNSPECIFIED GASTROINTESTINAL DISORDERS,GIS009,COLECTOMY,231,MAJOR LARGE BOWEL PROCEDURES,06,DISEASES AND DISORDERS OF THE DIGESTIVE SYSTEM,1,Minor,Minor,Surgical,Private Health Insurance,,,,,true,51511.1,9901.17
Long Island,Suffolk,5154001,000925,Good Samaritan Hospital Medical Center,70 or Older,117,M,White,Not Span/Hispanic,18,Emergency,Skilled Nursing Home,2019,DIG013,DIVERTICULOSIS AND DIVERTICULITIS,GIS009,COLECTOMY,231,MAJOR LARGE BOWEL PROCEDURES,06,DISEASES AND DISORDERS OF THE DIGESTIVE SYSTEM,2,Moderate,Moderate,Surgical,Medicare,Blue Cross/Blue Shield,,,,true,226987.04,43317.73
New York City,Kings,7002053,001304,NYU Langone Hospital-Brooklyn,30 to 49,112,F,Other Race,Not Span/Hispanic,4,Emergency,Home w/ Home Health Services,2019,NEO015,GASTROINTESTINAL CANCERS - COLORECTAL,GIS009,COLECTOMY,231,MAJOR LARGE BOWEL PROCEDURES,06,DISEASES AND DISORDERS OF THE DIGESTIVE SYSTEM,2,Moderate,Moderate,Surgical,Medicaid,,,,,true,110199.32,24880.44
Long Island,Suffolk,5154001,000925,Good Samaritan Hospital Medical Center,30 to 49,119,M,White,Not Span/Hispanic,4,Elective,Home or Self Care,2019,DIG013,DIVERTICULOSIS AND DIVERTICULITIS,GIS009,COLECTOMY,231,MAJOR LARGE BOWEL PROCEDURES,06,DISEASES AND DISORDERS OF THE DIGESTIVE SYSTEM,2,Moderate,Minor,Surgical,Blue Cross/Blue Shield,,,,,false,104750.6,22577.23
Hudson Valley,Dutchess,1302001,000181,Vassar Brothers Medical Center,70 or Older,126,M,White,Not Span/Hispanic,7,Elective,Skilled Nursing Home,2019,NEO015,GASTROINTESTINAL CANCERS - COLORECTAL,GIS009,COLECTOMY,231,MAJOR LARGE BOWEL PROCEDURES,06,DISEASES AND DISORDERS OF THE DIGESTIVE SYSTEM,4,Extreme,Extreme,Surgical,Medicare,,,,,false,102874.19,49515.42
Hudson Valley,Dutchess,1302001,000181,Vassar Brothers Medical Center,70 or Older,125,F,White,Not Span/Hispanic,4,Elective,Home or Self Care,2019,DIG013,DIVERTICULOSIS AND DIVERTICULITIS,GIS009,COLECTOMY,231,MAJOR LARGE BOWEL PROCEDURES,06,DISEASES AND DISORDERS OF THE DIGESTIVE SYSTEM,3,Major,Major,Surgical,Medicare,Blue Cross/Blue Shield,,,,false,56646.95,20250.43
Hudson Valley,Dutchess,1302001,000181,Vassar Brothers Medical Center,50 to 69,125,M,White,Not Span/Hispanic,12,Elective,Home or Self Care,2019,NEO015,GASTROINTESTINAL CANCERS - COLORECTAL,GIS009,COLECTOMY,231,MAJOR LARGE BOWEL PROCEDURES,06,DISEASES AND DISORDERS OF THE DIGESTIVE SYSTEM,3,Major,Major,Surgical,Blue Cross/Blue Shield,"Managed Care, Unspecified",,,,false,136604.17,54319.92
Hudson Valley,Dutchess,1302001,000181,Vassar Brothers Medical Center,50 to 69,125,M,White,Not Span/Hispanic,4,Elective,Home or Self Care,2019,DIG013,DIVERTICULOSIS AND DIVERTICULITIS,GIS009,COLECTOMY,231,MAJOR LARGE BOWEL PROCEDURES,06,DISEASES AND DISORDERS OF THE DIGESTIVE SYSTEM,2,Moderate,Minor,Surgical,Blue Cross/Blue Shield,,,,,false,64155.14,24707.95
Capital/Adirond,Warren,5601000,001005,Glens Falls Hospital,30 to 49,128,M,White,Not Span/Hispanic,4,Elective,Home or Self Care,2019,NEO015,GASTROINTESTINAL CANCERS - COLORECTAL,GIS009,COLECTOMY,231,MAJOR LARGE BOWEL PROCEDURES,06,DISEASES AND DISORDERS OF THE DIGESTIVE SYSTEM,3,Major,Moderate,Surgical,Blue Cross/Blue Shield,,,,,false,42459.11,19541.15
Hudson Valley,Putnam,3950000,000752,Putnam Hospital,50 to 69,105,M,White,Not Span/Hispanic,9,Elective,Home or Self Care,2019,FAC010,OTHER AFTERCARE ENCOUNTER,GIS022,GI SYSTEM LYSIS OF ADHESIONS,231,MAJOR LARGE BOWEL PROCEDURES,06,DISEASES AND DISORDERS OF THE DIGESTIVE SYSTEM,2,Moderate,Minor,Surgical,Medicare,Blue Cross/Blue Shield,,,,false,135017.55,74353.86
Capital/Adirond,Warren,5601000,001005,Glens Falls Hospital,70 or Older,128,F,White,Not Span/Hispanic,4,Elective,Home or Self Care,2019,NEO015,GASTROINTESTINAL CANCERS - COLORECTAL,GIS009,COLECTOMY,231,MAJOR LARGE BOWEL PROCEDURES,06,DISEASES AND DISORDERS OF THE DIGESTIVE SYSTEM,1,Minor,Minor,Surgical,Medicare,,,,,false,34236.02,15577.46
New York City,Manhattan,7002024,001456,Mount Sinai Hospital,50 to 69,100,M,White,Not Span/Hispanic,5,Elective,Home or Self Care,2019,NEO015,GASTROINTESTINAL CANCERS - COLORECTAL,GIS009,COLECTOMY,231,MAJOR LARGE BOWEL PROCEDURES,06,DISEASES AND DISORDERS OF THE DIGESTIVE SYSTEM,1,Minor,Minor,Surgical,Medicaid,Medicaid,Self-Pay,,,false,95548.15,33082.11
Capital/Adirond,Albany,0101004,000005,St. Peter's Hospital,30 to 49,121,F,White,Not Span/Hispanic,3,Elective,Home or Self Care,2019,NEO015,GASTROINTESTINAL CANCERS - COLORECTAL,GIS009,COLECTOMY,231,MAJOR LARGE BOWEL PROCEDURES,06,DISEASES AND DISORDERS OF THE DIGESTIVE SYSTEM,2,Moderate,Moderate,Surgical,Private Health Insurance,,,,,false,48468.15,19489.74
Capital/Adirond,Albany,0101004,000005,St. Peter's Hospital,30 to 49,121,F,White,Not Span/Hispanic,4,Elective,Home or Self Care,2019,DIG013,DIVERTICULOSIS AND DIVERTICULITIS,GIS022,GI SYSTEM LYSIS OF ADHESIONS,231,MAJOR LARGE BOWEL PROCEDURES,06,DISEASES AND DISORDERS OF THE DIGESTIVE SYSTEM,1,Minor,Minor,Surgical,Private Health Insurance,,,,,false,31241.05,14500.05
New York City,Manhattan,7002021,001454,Metropolitan Hospital Center,30 to 49,113,M,Other Race,Not Span/Hispanic,9,Emergency,Home or Self Care,2019,NEO015,GASTROINTESTINAL CANCERS - COLORECTAL,GIS013,PROCTECTOMY OR ANAL RESECTION,231,MAJOR LARGE BOWEL PROCEDURES,06,DISEASES AND DISORDERS OF THE DIGESTIVE SYSTEM,2,Moderate,Minor,Surgical,Medicaid,,,,,false,68645.76,55462.34
New York City,Manhattan,7002054,001458,New York-Presbyterian Hospital - New York Weill Cornell Center,50 to 69,113,F,White,Not Span/Hispanic,6,Elective,Home or Self Care,2019,NEO015,GASTROINTESTINAL CANCERS - COLORECTAL,GIS009,COLECTOMY,231,MAJOR LARGE BOWEL PROCEDURES,06,DISEASES AND DISORDERS OF THE DIGESTIVE SYSTEM,1,Minor,Minor,Surgical,"Managed Care, Unspecified",Medicaid,Self-Pay,,,false,102207.39,26692.83
Hudson Valley,Rockland,4324000,000776,Montefiore Nyack,18 to 29,109,F,White,Not Span/Hispanic,2,Elective,Home or Self Care,2019,NEO072,NEOPLASMS OF UNSPECIFIED NATURE OR UNCERTAIN BEHAVIOR,GIS009,COLECTOMY,231,MAJOR LARGE BOWEL PROCEDURES,06,DISEASES AND DISORDERS OF THE DIGESTIVE SYSTEM,1,Minor,Minor,Surgical,Medicaid,,,,,false,57292.69,13874.15
Long Island,Suffolk,5154001,000925,Good Samaritan Hospital Medical Center,70 or Older,117,F,White,Not Span/Hispanic,5,Elective,Home or Self Care,2019,DIG013,DIVERTICULOSIS AND DIVERTICULITIS,GIS009,COLECTOMY,231,MAJOR LARGE BOWEL PROCEDURES,06,DISEASES AND DISORDERS OF THE DIGESTIVE SYSTEM,2,Moderate,Moderate,Surgical,Private Health Insurance,Medicare,,,,false,77024.08,18232.54
New York City,Kings,7001002,001286,Brookdale Hospital Medical Center,18 to 29,112,M,Black/African American,Not Span/Hispanic,7,Elective,Home w/ Home Health Services,2019,FAC010,OTHER AFTERCARE ENCOUNTER,GIS009,COLECTOMY,231,MAJOR LARGE BOWEL PROCEDURES,06,DISEASES AND DISORDERS OF THE DIGESTIVE SYSTEM,2,Moderate,Minor,Surgical,Medicaid,,,,,false,37036.29,22689.66
Western NY,Erie,1401014,003067,Millard Fillmore Suburban Hospital,70 or Older,141,M,Black/African American,Not Span/Hispanic,4,Urgent,Home w/ Home Health Services,2019,NEO015,GASTROINTESTINAL CANCERS - COLORECTAL,GIS009,COLECTOMY,231,MAJOR LARGE BOWEL PROCEDURES,06,DISEASES AND DISORDERS OF THE DIGESTIVE SYSTEM,1,Minor,Minor,Surgical,Medicare,Self-Pay,,,,false,51908.05,17512.71
Hudson Valley,Orange,3529000,000704,St Anthony Community Hospital,70 or Older,109,F,White,Not Span/Hispanic,5,Emergency,Skilled Nursing Home,2019,DIG021,GASTROINTESTINAL HEMORRHAGE,GIS001,ESOPHAGOGASTRODUODENOSCOPY (EGD) WITH BIOPSY,231,MAJOR LARGE BOWEL PROCEDURES,06,DISEASES AND DISORDERS OF THE DIGESTIVE SYSTEM,2,Moderate,Moderate,Surgical,Medicare,Private Health Insurance,,,,true,107326.9,44026.72
Capital/Adirond,Albany,0101004,000005,St. Peter's Hospital,50 to 69,121,F,White,Not Span/Hispanic,8,Elective,Home or Self Care,2019,FAC010,OTHER AFTERCARE ENCOUNTER,GIS009,COLECTOMY,231,MAJOR LARGE BOWEL PROCEDURES,06,DISEASES AND DISORDERS OF THE DIGESTIVE SYSTEM,2,Moderate,Moderate,Surgical,Medicaid,Medicaid,,,,false,34101.25,17696.72
Hudson Valley,Westchester,5957001,001139,Westchester Medical Center,70 or Older,127,M,White,Not Span/Hispanic,14,Elective,Skilled Nursing Home,2019,NEO015,GASTROINTESTINAL CANCERS - COLORECTAL,MRS003,PROSTATECTOMY,231,MAJOR LARGE BOWEL PROCEDURES,06,DISEASES AND DISORDERS OF THE DIGESTIVE SYSTEM,3,Major,Extreme,Surgical,Medicare,Medicare,,,,false,445960.77,87236.56
Hudson Valley,Westchester,5957001,001139,Westchester Medical Center,0 to 17,107,F,Other Race,Unknown,4,Emergency,Home or Self Care,2019,DIG009,APPENDICITIS AND OTHER APPENDICEAL CONDITIONS,GIS009,COLECTOMY,231,MAJOR LARGE BOWEL PROCEDURES,06,DISEASES AND DISORDERS OF THE DIGESTIVE SYSTEM,1,Minor,Minor,Surgical,Medicaid,Medicaid,,,,true,100146.99,18584.3
New York City,Queens,7003004,001630,Long Island Jewish Medical Center,50 to 69,114,F,White,Not Span/Hispanic,5,Elective,Home or Self Care,2019,NEO015,GASTROINTESTINAL CANCERS - COLORECTAL,GIS009,COLECTOMY,231,MAJOR LARGE BOWEL PROCEDURES,06,DISEASES AND DISORDERS OF THE DIGESTIVE SYSTEM,2,Moderate,Moderate,Surgical,Private Health Insurance,Self-Pay,,,,false,72957.86,15240.88
New York City,Manhattan,7002053,001463,NYU Langone Hospitals,70 or Older,100,F,Other Race,Not Span/Hispanic,2,Elective,Home or Self Care,2019,NEO015,GASTROINTESTINAL CANCERS - COLORECTAL,GIS009,COLECTOMY,231,MAJOR LARGE BOWEL PROCEDURES,06,DISEASES AND DISORDERS OF THE DIGESTIVE SYSTEM,2,Moderate,Moderate,Surgical,Medicare,,,,,false,145048.36,24948.87
New York City,Manhattan,7002002,001439,Mount Sinai Beth Israel,50 to 69,114,M,Other Race,Unknown,13,Emergency,Home or Self Care,2019,NEO015,GASTROINTESTINAL CANCERS - COLORECTAL,GIS009,COLECTOMY,231,MAJOR LARGE BOWEL PROCEDURES,06,DISEASES AND DISORDERS OF THE DIGESTIVE SYSTEM,4,Extreme,Extreme,Surgical,Medicaid,Medicaid,Self-Pay,,,true,214736.32,51519.68
Finger Lakes,Monroe,2701005,000413,Strong Memorial Hospital,30 to 49,149,F,White,Not Span/Hispanic,12,Urgent,Home or Self Care,2019,DIG012,INTESTINAL OBSTRUCTION AND ILEUS,GIS009,COLECTOMY,231,MAJOR LARGE BOWEL PROCEDURES,06,DISEASES AND DISORDERS OF THE DIGESTIVE SYSTEM,3,Major,Minor,Surgical,Blue Cross/Blue Shield,,,,,false,70701.03,36467.12
New York City,Kings,7001046,001309,Interfaith Medical Center,50 to 69,100,M,Black/African American,Not Span/Hispanic,10,Emergency,Home or Self Care,2019,DIG010,ABDOMINAL HERNIA,GIS009,COLECTOMY,231,MAJOR LARGE BOWEL PROCEDURES,06,DISEASES AND DISORDERS OF THE DIGESTIVE SYSTEM,2,Moderate,Moderate,Surgical,Medicaid,Medicaid,,,,true,61950.32,45982.14
New York City,Manhattan,7002024,001456,Mount Sinai Hospital,30 to 49,113,F,Other Race,Not Span/Hispanic,4,Elective,Home or Self Care,2019,DIG011,REGIONAL ENTERITIS AND ULCERATIVE COLITIS,GIS009,COLECTOMY,231,MAJOR LARGE BOWEL PROCEDURES,06,DISEASES AND DISORDERS OF THE DIGESTIVE SYSTEM,2,Moderate,Minor,Surgical,Medicaid,Medicaid,Self-Pay,,,false,68061.36,23149.87
Capital/Adirond,Albany,0101004,000005,St. Peter's Hospital,30 to 49,122,F,Black/African American,Not Span/Hispanic,2,Elective,Home or Self Care,2019,FAC010,OTHER AFTERCARE ENCOUNTER,GNR002,ABDOMINAL WALL REPAIR (INCLUDING HERNIA),231,MAJOR LARGE BOWEL PROCEDURES,06,DISEASES AND DISORDERS OF THE DIGESTIVE SYSTEM,2,Moderate,Minor,Surgical,Medicare,Medicare,,,,false,31455.85,13107.07
New York City,Manhattan,7002054,001464,New York-Presbyterian Hospital - Columbia Presbyterian Center,50 to 69,104,F,White,Not Span/Hispanic,2,Elective,Home or Self Care,2019,NEO073,BENIGN NEOPLASMS,GIS009,COLECTOMY,231,MAJOR LARGE BOWEL PROCEDURES,06,DISEASES AND DISORDERS OF THE DIGESTIVE SYSTEM,2,Moderate,Minor,Surgical,Private Health Insurance,Self-Pay,,,,false,59498.03,17654.6
New York City,Manhattan,7002054,001464,New York-Presbyterian Hospital - Columbia Presbyterian Center,50 to 69,OOS,F,Other Race,Not Span/Hispanic,2,Elective,Home or Self Care,2019,DIG013,DIVERTICULOSIS AND DIVERTICULITIS,GIS009,COLECTOMY,231,MAJOR LARGE BOWEL PROCEDURES,06,DISEASES AND DISORDERS OF THE DIGESTIVE SYSTEM,3,Major,Moderate,Surgical,Medicare,Private Health Insurance,Self-Pay,,,false,51095.48,14959.73
New York City,Manhattan,7002054,001464,New York-Presbyterian Hospital - Columbia Presbyterian Center,50 to 69,104,F,Other Race,Not Span/Hispanic,2,Elective,Home or Self Care,2019,NEO015,GASTROINTESTINAL CANCERS - COLORECTAL,GIS009,COLECTOMY,231,MAJOR LARGE BOWEL PROCEDURES,06,DISEASES AND DISORDERS OF THE DIGESTIVE SYSTEM,2,Moderate,Moderate,Surgical,Medicare,Medicare,Self-Pay,,,false,52079.48,15353.12