Hospital Service Area,Hospital County,Operating Certificate Number,Permanent Facility Id,Facility Name,Age Group,Zip Code - 3 digits,Gender,Race,Ethnicity,Length of Stay,Type of Admission,Patient Disposition,Discharge Year,CCS Diagnosis Code,CCS Diagnosis Description,CCS Procedure Code,CCS Procedure Description,APR DRG Code,APR DRG Description,APR MDC Code,APR MDC Description,APR Severity of Illness Code,APR Severity of Illness Description,APR Risk of Mortality,APR Medical Surgical Description,Payment Typology 1,Payment Typology 2,Payment Typology 3,Birth Weight,Abortion Edit Indicator,Emergency Department Indicator,Total Charges,Total Costs
New York City,Kings,7002053,001304,NYU Langone Hospital-Brooklyn,30 to 49,112,F,Other Race,Not Span/Hispanic,4,Emergency,Home w/ Home Health Services,2019,NEO015,GASTROINTESTINAL CANCERS - COLORECTAL,GIS009,COLECTOMY,231,MAJOR LARGE BOWEL PROCEDURES,06,DISEASES AND DISORDERS OF THE DIGESTIVE SYSTEM,2,Moderate,Moderate,Surgical,Medicaid,,,,,true,110199.32,24880.44
New York City,Kings,7002053,001304,NYU Langone Hospital-Brooklyn,50 to 69,112,F,White,Not Span/Hispanic,5,Elective,Home w/ Home Health Services,2019,NEO015,GASTROINTESTINAL CANCERS - COLORECTAL,FRS001,HYSTERECTOMY,231,MAJOR LARGE BOWEL PROCEDURES,06,DISEASES AND DISORDERS OF THE DIGESTIVE SYSTEM,2,Moderate,Moderate,Surgical,Medicare,Medicare,,,,false,131771.95,27602.68
New York City,Kings,7002053,001304,NYU Langone Hospital-Brooklyn,70 or Older,113,F,White,Not Span/Hispanic,4,Elective,Home w/ Home Health Services,2019,FAC010,OTHER AFTERCARE ENCOUNTER,GIS022,GI SYSTEM LYSIS OF ADHESIONS,231,MAJOR LARGE BOWEL PROCEDURES,06,DISEASES AND DISORDERS OF THE DIGESTIVE SYSTEM,1,Minor,Minor,Surgical,Medicare,Medicaid,,,,false,180586.5,32597.56
New York City,Kings,7002053,001304,NYU Langone Hospital-Brooklyn,30 to 49,112,M,Other Race,Spanish/Hispanic,25,Emergency,Home w/ Home Health Services,2019,NEO015,GASTROINTESTINAL CANCERS - COLORECTAL,GIS009,COLECTOMY,231,MAJOR LARGE BOWEL PROCEDURES,06,DISEASES AND DISORDERS OF THE DIGESTIVE SYSTEM,4,Extreme,Extreme,Surgical,Medicaid,,,,,true,673272.83,189891.05
New York City,Kings,7002053,001304,NYU Langone Hospital-Brooklyn,50 to 69,112,F,Other Race,Spanish/Hispanic,3,Elective,Home w/ Home Health Services,2019,NEO015,GASTROINTESTINAL CANCERS - COLORECTAL,GIS009,COLECTOMY,231,MAJOR LARGE BOWEL PROCEDURES,06,DISEASES AND DISORDERS OF THE DIGESTIVE SYSTEM,2,Moderate,Minor,Surgical,Blue Cross/Blue Shield,Medicaid,,,,false,171382.55,30879.93
New York City,Kings,7002053,001304,NYU Langone Hospital-Brooklyn,70 or Older,112,F,Other Race,Spanish/Hispanic,1,Elective,Home or Self Care,2019,DIG015,ANAL AND RECTAL CONDITIONS,GIS013,PROCTECTOMY OR ANAL RESECTION,231,MAJOR LARGE BOWEL PROCEDURES,06,DISEASES AND DISORDERS OF THE DIGESTIVE SYSTEM,1,Minor,Minor,Surgical,Medicare,Medicaid,,,,false,50855.13,8971.59
New York City,Kings,7002053,001304,NYU Langone Hospital-Brooklyn,50 to 69,112,F,Other Race,Spanish/Hispanic,11,Emergency,Home or Self Care,2019,NEO015,GASTROINTESTINAL CANCERS - COLORECTAL,OTR001,ROBOTIC-ASSISTED PROCEDURES,231,MAJOR LARGE BOWEL PROCEDURES,06,DISEASES AND DISORDERS OF THE DIGESTIVE SYSTEM,2,Moderate,Minor,Surgical,Medicaid,,,,,true,279697.39,64744.96
New York City,Kings,7002053,001304,NYU Langone Hospital-Brooklyn,70 or Older,112,F,Other Race,Not Span/Hispanic,3,Elective,Home w/ Home Health Services,2019,NEO070,SECONDARY MALIGNANCIES,GIS022,GI SYSTEM LYSIS OF ADHESIONS,231,MAJOR LARGE BOWEL PROCEDURES,06,DISEASES AND DISORDERS OF THE DIGESTIVE SYSTEM,2,Moderate,Moderate,Surgical,Medicare,Medicaid,,,,false,86777.42,18079.54
New York City,Kings,7002053,001304,NYU Langone Hospital-Brooklyn,70 or Older,112,F,Black/African American,Not Span/Hispanic,3,Elective,Home or Self Care,2019,NEO015,GASTROINTESTINAL CANCERS - COLORECTAL,GIS009,COLECTOMY,231,MAJOR LARGE BOWEL PROCEDURES,06,DISEASES AND DISORDERS OF THE DIGESTIVE SYSTEM,2,Moderate,Moderate,Surgical,Medicare,,,,,false,99868.4,19436.8
New York City,Kings,7002053,001304,NYU Langone Hospital-Brooklyn,50 to 69,112,M,Other Race,Not Span/Hispanic,10,Emergency,Skilled Nursing Home,2019,DIG012,INTESTINAL OBSTRUCTION AND ILEUS,GIS009,COLECTOMY,231,MAJOR LARGE BOWEL PROCEDURES,06,DISEASES AND DISORDERS OF THE DIGESTIVE SYSTEM,3,Major,Moderate,Surgical,Private Health Insurance,,,,,true,357408.62,69405.51
New York City,Kings,7002053,001304,NYU Langone Hospital-Brooklyn,70 or Older,103,F,Other Race,Spanish/Hispanic,22,Emergency,Skilled Nursing Home,2019,DIG024,POSTPROCEDURAL OR POSTOPERATIVE DIGESTIVE SYSTEM COMPLICATION,GIS018,ILEOSTOMY AND COLOSTOMY,231,MAJOR LARGE BOWEL PROCEDURES,06,DISEASES AND DISORDERS OF THE DIGESTIVE SYSTEM,3,Major,Major,Surgical,Medicare,,,,,true,429755.64,119350.49
New York City,Kings,7002053,001304,NYU Langone Hospital-Brooklyn,70 or Older,112,M,White,Not Span/Hispanic,3,Elective,Home w/ Home Health Services,2019,NEO015,GASTROINTESTINAL CANCERS - COLORECTAL,GIS009,COLECTOMY,231,MAJOR LARGE BOWEL PROCEDURES,06,DISEASES AND DISORDERS OF THE DIGESTIVE SYSTEM,1,Minor,Moderate,Surgical,Medicare,,,,,false,221472.04,41111.64
New York City,Kings,7002053,001304,NYU Langone Hospital-Brooklyn,70 or Older,103,F,Other Race,Spanish/Hispanic,5,Emergency,Home w/ Home Health Services,2019,DIG024,POSTPROCEDURAL OR POSTOPERATIVE DIGESTIVE SYSTEM COMPLICATION,GIS009,COLECTOMY,231,MAJOR LARGE BOWEL PROCEDURES,06,DISEASES AND DISORDERS OF THE DIGESTIVE SYSTEM,3,Major,Moderate,Surgical,Medicare,,,,,true,87054.1,23610.29
New York City,Kings,7002053,001304,NYU Langone Hospital-Brooklyn,50 to 69,112,F,White,Spanish/Hispanic,1,Emergency,Home or Self Care,2019,DIG015,ANAL AND RECTAL CONDITIONS,GIS028,"LOWER GI THERAPEUTIC PROCEDURES, NEC (OPEN AND LAPAROSCOPIC)",231,MAJOR LARGE BOWEL PROCEDURES,06,DISEASES AND DISORDERS OF THE DIGESTIVE SYSTEM,1,Minor,Minor,Surgical,Medicaid,,,,,false,135777.23,21375.62
New York City,Kings,7002053,001304,NYU Langone Hospital-Brooklyn,50 to 69,112,F,Black/African American,Unknown,2,Emergency,Home w/ Home Health Services,2019,NEO015,GASTROINTESTINAL CANCERS - COLORECTAL,GIS009,COLECTOMY,231,MAJOR LARGE BOWEL PROCEDURES,06,DISEASES AND DISORDERS OF THE DIGESTIVE SYSTEM,2,Moderate,Moderate,Surgical,Medicaid,,,,,false,109841.18,17887.54
New York City,Kings,7002053,001304,NYU Langone Hospital-Brooklyn,50 to 69,112,F,Black/African American,Not Span/Hispanic,3,Elective,Home or Self Care,2019,NEO014,GASTROINTESTINAL CANCERS - SMALL INTESTINE,GIS009,COLECTOMY,231,MAJOR LARGE BOWEL PROCEDURES,06,DISEASES AND DISORDERS OF THE DIGESTIVE SYSTEM,2,Moderate,Moderate,Surgical,Blue Cross/Blue Shield,,,,,false,117673.71,22161.08
New York City,Kings,7002053,001304,NYU Langone Hospital-Brooklyn,50 to 69,112,F,White,Not Span/Hispanic,9,Elective,Home w/ Home Health Services,2019,DIG010,ABDOMINAL HERNIA,GIS009,COLECTOMY,231,MAJOR LARGE BOWEL PROCEDURES,06,DISEASES AND DISORDERS OF THE DIGESTIVE SYSTEM,3,Major,Moderate,Surgical,Medicaid,,,,,false,438530.04,74644.28
New York City,Kings,7002053,001304,NYU Langone Hospital-Brooklyn,70 or Older,112,F,White,Not Span/Hispanic,4,Elective,Home w/ Home Health Services,2019,DIG024,POSTPROCEDURAL OR POSTOPERATIVE DIGESTIVE SYSTEM COMPLICATION,GIS018,ILEOSTOMY AND COLOSTOMY,231,MAJOR LARGE BOWEL PROCEDURES,06,DISEASES AND DISORDERS OF THE DIGESTIVE SYSTEM,3,Major,Major,Surgical,Medicare,Medicaid,,,,false,67087.71,17802.17
New York City,Kings,7002053,001304,NYU Langone Hospital-Brooklyn,50 to 69,112,F,White,Not Span/Hispanic,14,Elective,Home w/ Home Health Services,2019,DIG010,ABDOMINAL HERNIA,GIS009,COLECTOMY,231,MAJOR LARGE BOWEL PROCEDURES,06,DISEASES AND DISORDERS OF THE DIGESTIVE SYSTEM,4,Extreme,Major,Surgical,Medicaid,,,,,false,319141.95,84856.74
New York City,Kings,7002053,001304,NYU Langone Hospital-Brooklyn,50 to 69,112,M,Other Race,Not Span/Hispanic,3,Elective,Home w/ Home Health Services,2019,DIG013,DIVERTICULOSIS AND DIVERTICULITIS,GIS009,COLECTOMY,231,MAJOR LARGE BOWEL PROCEDURES,06,DISEASES AND DISORDERS OF THE DIGESTIVE SYSTEM,1,Minor,Minor,Surgical,Medicare,,,,,false,140566.97,26380.75
New York City,Kings,7002053,001304,NYU Langone Hospital-Brooklyn,50 to 69,112,F,Black/African American,Not Span/Hispanic,7,Elective,Skilled Nursing Home,2019,DIG013,DIVERTICULOSIS AND DIVERTICULITIS,GIS009,COLECTOMY,231,MAJOR LARGE BOWEL PROCEDURES,06,DISEASES AND DISORDERS OF THE DIGESTIVE SYSTEM,2,Moderate,Minor,Surgical,Medicare,Blue Cross/Blue Shield,,,,false,166145.95,41371.73
New York City,Kings,7002053,001304,NYU Langone Hospital-Brooklyn,30 to 49,112,M,White,Not Span/Hispanic,16,Elective,Home w/ Home Health Services,2019,DIG013,DIVERTICULOSIS AND DIVERTICULITIS,GIS009,COLECTOMY,231,MAJOR LARGE BOWEL PROCEDURES,06,DISEASES AND DISORDERS OF THE DIGESTIVE SYSTEM,4,Extreme,Major,Surgical,Private Health Insurance,,,,,false,354614.69,101840.24
New York City,Kings,7002053,001304,NYU Langone Hospital-Brooklyn,70 or Older,112,M,Other Race,Spanish/Hispanic,5,Elective,Home w/ Home Health Services,2019,NEO015,GASTROINTESTINAL CANCERS - COLORECTAL,GIS009,COLECTOMY,231,MAJOR LARGE BOWEL PROCEDURES,06,DISEASES AND DISORDERS OF THE DIGESTIVE SYSTEM,3,Major,Major,Surgical,Private Health Insurance,Medicaid,,,,false,223925.85,47887.54
New York City,Kings,7002053,001304,NYU Langone Hospital-Brooklyn,50 to 69,100,F,White,Not Span/Hispanic,1,Elective,Home or Self Care,2019,NEO015,GASTROINTESTINAL CANCERS - COLORECTAL,GIS009,COLECTOMY,231,MAJOR LARGE BOWEL PROCEDURES,06,DISEASES AND DISORDERS OF THE DIGESTIVE SYSTEM,2,Moderate,Minor,Surgical,Medicare,Private Health Insurance,,,,false,162460.84,25555.36
New York City,Kings,7002053,001304,NYU Langone Hospital-Brooklyn,70 or Older,112,F,White,Not Span/Hispanic,1,Elective,Home or Self Care,2019,NEO073,BENIGN NEOPLASMS,GIS009,COLECTOMY,231,MAJOR LARGE BOWEL PROCEDURES,06,DISEASES AND DISORDERS OF THE DIGESTIVE SYSTEM,3,Major,Moderate,Surgical,Medicare,,,,,false,85453.03,14409.62
New York City,Kings,7002053,001304,NYU Langone Hospital-Brooklyn,50 to 69,112,F,White,Not Span/Hispanic,19,Emergency,Home w/ Home Health Services,2019,DIG024,POSTPROCEDURAL OR POSTOPERATIVE DIGESTIVE SYSTEM COMPLICATION,GIS009,COLECTOMY,231,MAJOR LARGE BOWEL PROCEDURES,06,DISEASES AND DISORDERS OF THE DIGESTIVE SYSTEM,4,Extreme,Extreme,Surgical,Blue Cross/Blue Shield,,,,,true,441247.94,125294.48
New York City,Kings,7002053,001304,NYU Langone Hospital-Brooklyn,70 or Older,112,F,Other Race,Spanish/Hispanic,2,Elective,Home or Self Care,2019,DIG013,DIVERTICULOSIS AND DIVERTICULITIS,GIS022,GI SYSTEM LYSIS OF ADHESIONS,231,MAJOR LARGE BOWEL PROCEDURES,06,DISEASES AND DISORDERS OF THE DIGESTIVE SYSTEM,1,Minor,Minor,Surgical,Blue Cross/Blue Shield,Medicaid,,,,false,101814.44,18435.68
New York City,Kings,7002053,001304,NYU Langone Hospital-Brooklyn,70 or Older,112,F,Other Race,Spanish/Hispanic,2,Elective,Home or Self Care,2019,NEO073,BENIGN NEOPLASMS,GIS009,COLECTOMY,231,MAJOR LARGE BOWEL PROCEDURES,06,DISEASES AND DISORDERS OF THE DIGESTIVE SYSTEM,2,Moderate,Moderate,Surgical,Medicare,Medicaid,,,,false,97016.03,17330.15
New York City,Kings,7002053,001304,NYU Langone Hospital-Brooklyn,70 or Older,112,M,Black/African American,Not Span/Hispanic,5,Elective,Home w/ Home Health Services,2019,NEO015,GASTROINTESTINAL CANCERS - COLORECTAL,GIS009,COLECTOMY,231,MAJOR LARGE BOWEL PROCEDURES,06,DISEASES AND DISORDERS OF THE DIGESTIVE SYSTEM,2,Moderate,Minor,Surgical,Medicare,Private Health Insurance,,,,false,184586.08,49403.02
New York City,Kings,7002053,001304,NYU Langone Hospital-Brooklyn,30 to 49,112,M,White,Not Span/Hispanic,1,Elective,Home or Self Care,2019,DIG015,ANAL AND RECTAL CONDITIONS,GIS009,COLECTOMY,231,MAJOR LARGE BOWEL PROCEDURES,06,DISEASES AND DISORDERS OF THE DIGESTIVE SYSTEM,2,Moderate,Moderate,Surgical,Blue Cross/Blue Shield,,,,,false,39390.15,7722.64
New York City,Kings,7002053,001304,NYU Langone Hospital-Brooklyn,50 to 69,112,M,Other Race,Not Span/Hispanic,3,Elective,Home w/ Home Health Services,2019,FAC010,OTHER AFTERCARE ENCOUNTER,GIS009,COLECTOMY,231,MAJOR LARGE BOWEL PROCEDURES,06,DISEASES AND DISORDERS OF THE DIGESTIVE SYSTEM,1,Minor,Moderate,Surgical,Medicare,,,,,false,101435.9,20554.28
New York City,Kings,7002053,001304,NYU Langone Hospital-Brooklyn,70 or Older,112,F,Other Race,Not Span/Hispanic,5,Emergency,Skilled Nursing Home,2019,NEO015,GASTROINTESTINAL CANCERS - COLORECTAL,GIS018,ILEOSTOMY AND COLOSTOMY,231,MAJOR LARGE BOWEL PROCEDURES,06,DISEASES AND DISORDERS OF THE DIGESTIVE SYSTEM,3,Major,Major,Surgical,Medicare,Medicaid,,,,true,100024.23,25125.06
New York City,Kings,7002053,001304,NYU Langone Hospital-Brooklyn,30 to 49,112,M,Other Race,Spanish/Hispanic,11,Emergency,Home w/ Home Health Services,2019,NEO015,GASTROINTESTINAL CANCERS - COLORECTAL,GIS009,COLECTOMY,231,MAJOR LARGE BOWEL PROCEDURES,06,DISEASES AND DISORDERS OF THE DIGESTIVE SYSTEM,2,Moderate,Moderate,Surgical,Private Health Insurance,,,,,true,289699.74,65523.64
New York City,Kings,7002053,001304,NYU Langone Hospital-Brooklyn,70 or Older,112,M,White,Not Span/Hispanic,12,Elective,Home or Self Care,2019,NEO015,GASTROINTESTINAL CANCERS - COLORECTAL,GIS009,COLECTOMY,231,MAJOR LARGE BOWEL PROCEDURES,06,DISEASES AND DISORDERS OF THE DIGESTIVE SYSTEM,3,Major,Major,Surgical,Private Health Insurance,,,,,false,327524.28,80796.1
New York City,Kings,7002053,001304,NYU Langone Hospital-Brooklyn,50 to 69,112,F,Black/African American,Spanish/Hispanic,3,Elective,Home or Self Care,2019,NEO073,BENIGN NEOPLASMS,GIS009,COLECTOMY,231,MAJOR LARGE BOWEL PROCEDURES,06,DISEASES AND DISORDERS OF THE DIGESTIVE SYSTEM,2,Moderate,Moderate,Surgical,Private Health Insurance,,,,,false,119631.31,21889.96
New York City,Kings,7002053,001304,NYU Langone Hospital-Brooklyn,50 to 69,112,M,Other Race,Spanish/Hispanic,4,Elective,Home or Self Care,2019,NEO015,GASTROINTESTINAL CANCERS - COLORECTAL,GIS009,COLECTOMY,231,MAJOR LARGE BOWEL PROCEDURES,06,DISEASES AND DISORDERS OF THE DIGESTIVE SYSTEM,3,Major,Moderate,Surgical,Blue Cross/Blue Shield,,,,,false,137177.81,26550.57
New York City,Kings,7002053,001304,NYU Langone Hospital-Brooklyn,30 to 49,112,M,White,Not Span/Hispanic,4,Emergency,Home or Self Care,2019,DIG012,INTESTINAL OBSTRUCTION AND ILEUS,GIS009,COLECTOMY,231,MAJOR LARGE BOWEL PROCEDURES,06,DISEASES AND DISORDERS OF THE DIGESTIVE SYSTEM,2,Moderate,Minor,Surgical,Blue Cross/Blue Shield,,,,,true,104141.93,23790.92
New York City,Kings,7002053,001304,NYU Langone Hospital-Brooklyn,30 to 49,112,M,Other Race,Not Span/Hispanic,2,Elective,Home or Self Care,2019,DIG013,DIVERTICULOSIS AND DIVERTICULITIS,GIS009,COLECTOMY,231,MAJOR LARGE BOWEL PROCEDURES,06,DISEASES AND DISORDERS OF THE DIGESTIVE SYSTEM,1,Minor,Minor,Surgical,Medicaid,,,,,false,105940.39,18915.08
New York City,Kings,7002053,001304,NYU Langone Hospital-Brooklyn,50 to 69,112,F,Other Race,Spanish/Hispanic,3,Elective,Home or Self Care,2019,NEO015,GASTROINTESTINAL CANCERS - COLORECTAL,GIS009,COLECTOMY,231,MAJOR LARGE BOWEL PROCEDURES,06,DISEASES AND DISORDERS OF THE DIGESTIVE SYSTEM,2,Moderate,Moderate,Surgical,Private Health Insurance,,,,,false,170842.88,30966.93
New York City,Kings,7002053,001304,NYU Langone Hospital-Brooklyn,50 to 69,112,F,White,Not Span/Hispanic,5,Elective,Home w/ Home Health Services,2019,FAC010,OTHER AFTERCARE ENCOUNTER,GIS009,COLECTOMY,231,MAJOR LARGE BOWEL PROCEDURES,06,DISEASES AND DISORDERS OF THE DIGESTIVE SYSTEM,1,Minor,Minor,Surgical,Private Health Insurance,,,,,false,155227.22,32092.02
New York City,Kings,7002053,001304,NYU Langone Hospital-Brooklyn,50 to 69,112,F,Other Race,Spanish/Hispanic,4,Elective,Home or Self Care,2019,DIG013,DIVERTICULOSIS AND DIVERTICULITIS,GIS009,COLECTOMY,231,MAJOR LARGE BOWEL PROCEDURES,06,DISEASES AND DISORDERS OF THE DIGESTIVE SYSTEM,1,Minor,Minor,Surgical,Medicaid,,,,,false,118242.07,25126.73
New York City,Kings,7002053,001304,NYU Langone Hospital-Brooklyn,50 to 69,112,M,White,Unknown,8,Emergency,Home or Self Care,2019,NEO015,GASTROINTESTINAL CANCERS - COLORECTAL,GIS009,COLECTOMY,231,MAJOR LARGE BOWEL PROCEDURES,06,DISEASES AND DISORDERS OF THE DIGESTIVE SYSTEM,2,Moderate,Minor,Surgical,Medicaid,,,,,true,269903.89,53644.21
New York City,Kings,7002053,001304,NYU Langone Hospital-Brooklyn,70 or Older,112,F,Other Race,Spanish/Hispanic,5,Elective,Home w/ Home Health Services,2019,DIG013,DIVERTICULOSIS AND DIVERTICULITIS,GIS009,COLECTOMY,231,MAJOR LARGE BOWEL PROCEDURES,06,DISEASES AND DISORDERS OF THE DIGESTIVE SYSTEM,2,Moderate,Minor,Surgical,Medicare,,,,,false,146241.42,29907.73
New York City,Kings,7002053,001304,NYU Langone Hospital-Brooklyn,30 to 49,112,F,Other Race,Spanish/Hispanic,4,Elective,Home or Self Care,2019,DIG013,DIVERTICULOSIS AND DIVERTICULITIS,GIS009,COLECTOMY,231,MAJOR LARGE BOWEL PROCEDURES,06,DISEASES AND DISORDERS OF THE DIGESTIVE SYSTEM,1,Minor,Minor,Surgical,Private Health Insurance,,,,,false,133757.68,27189.1
New York City,Kings,7002053,001304,NYU Langone Hospital-Brooklyn,70 or Older,112,F,Black/African American,Not Span/Hispanic,3,Elective,Home w/ Home Health Services,2019,NEO015,GASTROINTESTINAL CANCERS - COLORECTAL,GIS009,COLECTOMY,231,MAJOR LARGE BOWEL PROCEDURES,06,DISEASES AND DISORDERS OF THE DIGESTIVE SYSTEM,2,Moderate,Minor,Surgical,Medicare,Blue Cross/Blue Shield,,,,false,90473.09,18806.36
New York City,Kings,7002053,001304,NYU Langone Hospital-Brooklyn,50 to 69,116,M,White,Not Span/Hispanic,6,Elective,Home or Self Care,2019,DIG024,POSTPROCEDURAL OR POSTOPERATIVE DIGESTIVE SYSTEM COMPLICATION,GIS022,GI SYSTEM LYSIS OF ADHESIONS,231,MAJOR LARGE BOWEL PROCEDURES,06,DISEASES AND DISORDERS OF THE DIGESTIVE SYSTEM,2,Moderate,Moderate,Surgical,Medicaid,,,,,false,155817.91,32544.19
New York City,Kings,7002053,001304,NYU Langone Hospital-Brooklyn,70 or Older,112,F,White,Spanish/Hispanic,10,Emergency,Skilled Nursing Home,2019,DIG025,OTHER SPECIFIED AND UNSPECIFIED GASTROINTESTINAL DISORDERS,GIS009,COLECTOMY,231,MAJOR LARGE BOWEL PROCEDURES,06,DISEASES AND DISORDERS OF THE DIGESTIVE SYSTEM,3,Major,Extreme,Surgical,Medicare,Medicaid,,,,true,293634.99,71972.79
New York City,Kings,7002053,001304,NYU Langone Hospital-Brooklyn,70 or Older,112,F,Other Race,Spanish/Hispanic,9,Emergency,Home w/ Home Health Services,2019,DIG013,DIVERTICULOSIS AND DIVERTICULITIS,GIS009,COLECTOMY,231,MAJOR LARGE BOWEL PROCEDURES,06,DISEASES AND DISORDERS OF THE DIGESTIVE SYSTEM,4,Extreme,Major,Surgical,Medicare,Medicaid,,,,true,201187.68,47701.92
New York City,Kings,7002053,001304,NYU Langone Hospital-Brooklyn,50 to 69,112,M,White,Not Span/Hispanic,2,Elective,Home or Self Care,2019,NEO073,BENIGN NEOPLASMS,GIS009,COLECTOMY,231,MAJOR LARGE BOWEL PROCEDURES,06,DISEASES AND DISORDERS OF THE DIGESTIVE SYSTEM,1,Minor,Minor,Surgical,Private Health Insurance,,,,,false,102867.54,17772.7
New York City,Kings,7002053,001304,NYU Langone Hospital-Brooklyn,70 or Older,112,M,Black/African American,Not Span/Hispanic,2,Elective,Home or Self Care,2019,NEO015,GASTROINTESTINAL CANCERS - COLORECTAL,GIS013,PROCTECTOMY OR ANAL RESECTION,231,MAJOR LARGE BOWEL PROCEDURES,06,DISEASES AND DISORDERS OF THE DIGESTIVE SYSTEM,2,Moderate,Minor,Surgical,Medicare,Blue Cross/Blue Shield,,,,false,173801.65,28892.59
New York City,Kings,7002053,001304,NYU Langone Hospital-Brooklyn,70 or Older,103,F,Other Race,Spanish/Hispanic,9,Elective,Skilled Nursing Home,2019,FAC010,OTHER AFTERCARE ENCOUNTER,GIS009,COLECTOMY,231,MAJOR LARGE BOWEL PROCEDURES,06,DISEASES AND DISORDERS OF THE DIGESTIVE SYSTEM,3,Major,Major,Surgical,Medicare,Medicaid,,,,false,170561.97,46987.96
New York City,Kings,7002053,001304,NYU Langone Hospital-Brooklyn,70 or Older,112,F,White,Not Span/Hispanic,4,Elective,Home w/ Home Health Services,2019,DIG013,DIVERTICULOSIS AND DIVERTICULITIS,GIS009,COLECTOMY,231,MAJOR LARGE BOWEL PROCEDURES,06,DISEASES AND DISORDERS OF THE DIGESTIVE SYSTEM,2,Moderate,Minor,Surgical,Medicare,Blue Cross/Blue Shield,,,,false,154363.07,28859.2
New York City,Kings,7002053,001304,NYU Langone Hospital-Brooklyn,70 or Older,112,M,White,Not Span/Hispanic,7,Elective,Home w/ Home Health Services,2019,NEO015,GASTROINTESTINAL CANCERS - COLORECTAL,GIS009,COLECTOMY,231,MAJOR LARGE BOWEL PROCEDURES,06,DISEASES AND DISORDERS OF THE DIGESTIVE SYSTEM,2,Moderate,Moderate,Surgical,Medicaid,,,,,false,225373.38,44280.69
New York City,Kings,7002053,001304,NYU Langone Hospital-Brooklyn,30 to 49,112,F,Other Race,Unknown,2,Elective,Home or Self Care,2019,NEO073,BENIGN NEOPLASMS,GIS009,COLECTOMY,231,MAJOR LARGE BOWEL PROCEDURES,06,DISEASES AND DISORDERS OF THE DIGESTIVE SYSTEM,1,Minor,Minor,Surgical,Private Health Insurance,,,,,false,176258.84,28868.26
New York City,Kings,7002053,001304,NYU Langone Hospital-Brooklyn,30 to 49,112,F,Black/African American,Not Span/Hispanic,2,Elective,Home or Self Care,2019,NEO015,GASTROINTESTINAL CANCERS - COLORECTAL,GIS009,COLECTOMY,231,MAJOR LARGE BOWEL PROCEDURES,06,DISEASES AND DISORDERS OF THE DIGESTIVE SYSTEM,2,Moderate,Moderate,Surgical,Private Health Insurance,,,,,false,164671.08,27489.64
New York City,Kings,7002053,001304,NYU Langone Hospital-Brooklyn,70 or Older,103,F,White,Spanish/Hispanic,9,Elective,Skilled Nursing Home,2019,DIG010,ABDOMINAL HERNIA,GNR002,ABDOMINAL WALL REPAIR (INCLUDING HERNIA),231,MAJOR LARGE BOWEL PROCEDURES,06,DISEASES AND DISORDERS OF THE DIGESTIVE SYSTEM,2,Moderate,Moderate,Surgical,Medicare,,,,,false,187873.67,46315.47
New York City,Kings,7002053,001304,NYU Langone Hospital-Brooklyn,70 or Older,112,M,Other Race,Not Span/Hispanic,9,Emergency,Home w/ Home Health Services,2019,NEO015,GASTROINTESTINAL CANCERS - COLORECTAL,GIS018,ILEOSTOMY AND COLOSTOMY,231,MAJOR LARGE BOWEL PROCEDURES,06,DISEASES AND DISORDERS OF THE DIGESTIVE SYSTEM,3,Major,Major,Surgical,Medicaid,,,,,true,185983.8,50371.66
New York City,Kings,7002053,001304,NYU Langone Hospital-Brooklyn,30 to 49,112,M,Multi-racial,Not Span/Hispanic,5,Elective,Home or Self Care,2019,NEO015,GASTROINTESTINAL CANCERS - COLORECTAL,GIS009,COLECTOMY,231,MAJOR LARGE BOWEL PROCEDURES,06,DISEASES AND DISORDERS OF THE DIGESTIVE SYSTEM,2,Moderate,Moderate,Surgical,Private Health Insurance,,,,,false,226266,48189.04
New York City,Kings,7002053,001304,NYU Langone Hospital-Brooklyn,70 or Older,112,F,Black/African American,Not Span/Hispanic,7,Elective,Skilled Nursing Home,2019,NEO015,GASTROINTESTINAL CANCERS - COLORECTAL,GIS009,COLECTOMY,231,MAJOR LARGE BOWEL PROCEDURES,06,DISEASES AND DISORDERS OF THE DIGESTIVE SYSTEM,1,Minor,Moderate,Surgical,Medicare,Medicaid,,,,false,184862.26,40308.19
New York City,Kings,7002053,001304,NYU Langone Hospital-Brooklyn,50 to 69,112,F,White,Spanish/Hispanic,16,Emergency,Home w/ Home Health Services,2019,DIG025,OTHER SPECIFIED AND UNSPECIFIED GASTROINTESTINAL DISORDERS,GIS024,OTHER PERITONEAL CAVITY PROCEDURES,231,MAJOR LARGE BOWEL PROCEDURES,06,DISEASES AND DISORDERS OF THE DIGESTIVE SYSTEM,4,Extreme,Extreme,Surgical,Private Health Insurance,Medicaid,,,,true,881169.7,186239.99
New York City,Kings,7002053,001304,NYU Langone Hospital-Brooklyn,50 to 69,112,M,Other Race,Not Span/Hispanic,3,Elective,Home or Self Care,2019,NEO015,GASTROINTESTINAL CANCERS - COLORECTAL,GIS009,COLECTOMY,231,MAJOR LARGE BOWEL PROCEDURES,06,DISEASES AND DISORDERS OF THE DIGESTIVE SYSTEM,2,Moderate,Minor,Surgical,Medicare,,,,,false,192175.11,32588.3
New York City,Kings,7002053,001304,NYU Langone Hospital-Brooklyn,50 to 69,OOS,F,White,Not Span/Hispanic,7,Emergency,Home w/ Home Health Services,2019,DIG013,DIVERTICULOSIS AND DIVERTICULITIS,GIS009,COLECTOMY,231,MAJOR LARGE BOWEL PROCEDURES,06,DISEASES AND DISORDERS OF THE DIGESTIVE SYSTEM,4,Extreme,Major,Surgical,Medicare,Blue Cross/Blue Shield,,,,true,188720.67,41923.13
New York City,Kings,7002053,001304,NYU Langone Hospital-Brooklyn,50 to 69,112,F,Other Race,Not Span/Hispanic,6,Elective,Home w/ Home Health Services,2019,NEO015,GASTROINTESTINAL CANCERS - COLORECTAL,GIS009,COLECTOMY,231,MAJOR LARGE BOWEL PROCEDURES,06,DISEASES AND DISORDERS OF THE DIGESTIVE SYSTEM,2,Moderate,Moderate,Surgical,Medicare,,,,,false,153111.53,36640.63