Hospital Service Area,Hospital County,Operating Certificate Number,Permanent Facility Id,Facility Name,Age Group,Zip Code - 3 digits,Gender,Race,Ethnicity,Length of Stay,Type of Admission,Patient Disposition,Discharge Year,CCS Diagnosis Code,CCS Diagnosis Description,CCS Procedure Code,CCS Procedure Description,APR DRG Code,APR DRG Description,APR MDC Code,APR MDC Description,APR Severity of Illness Code,APR Severity of Illness Description,APR Risk of Mortality,APR Medical Surgical Description,Payment Typology 1,Payment Typology 2,Payment Typology 3,Birth Weight,Abortion Edit Indicator,Emergency Department Indicator,Total Charges,Total Costs
New York City,Manhattan,7002001,001438,Bellevue Hospital Center,50 to 69,104,M,Black/African American,Not Span/Hispanic,3,Emergency,Home w/ Home Health Services,2019,DIG025,OTHER SPECIFIED AND UNSPECIFIED GASTROINTESTINAL DISORDERS,GIS018,ILEOSTOMY AND COLOSTOMY,231,MAJOR LARGE BOWEL PROCEDURES,06,DISEASES AND DISORDERS OF THE DIGESTIVE SYSTEM,2,Moderate,Minor,Surgical,Private Health Insurance,,,,,true,27344.79,18173.35
New York City,Manhattan,7002001,001438,Bellevue Hospital Center,30 to 49,101,M,Other Race,Spanish/Hispanic,7,Emergency,Home w/ Home Health Services,2019,DIG006,GASTROINTESTINAL AND BILIARY PERFORATION,GIS018,ILEOSTOMY AND COLOSTOMY,231,MAJOR LARGE BOWEL PROCEDURES,06,DISEASES AND DISORDERS OF THE DIGESTIVE SYSTEM,4,Extreme,Extreme,Surgical,Medicaid,,,,,true,46698.2,31035.62
New York City,Manhattan,7002001,001438,Bellevue Hospital Center,50 to 69,104,M,Black/African American,Not Span/Hispanic,15,Emergency,Home or Self Care,2019,NEO015,GASTROINTESTINAL CANCERS - COLORECTAL,GIS018,ILEOSTOMY AND COLOSTOMY,231,MAJOR LARGE BOWEL PROCEDURES,06,DISEASES AND DISORDERS OF THE DIGESTIVE SYSTEM,4,Extreme,Major,Surgical,Medicaid,Medicaid,,,,true,86900.68,57754.19
New York City,Manhattan,7002001,001438,Bellevue Hospital Center,50 to 69,104,F,Other Race,Not Span/Hispanic,8,Emergency,Home or Self Care,2019,NEO073,BENIGN NEOPLASMS,GIS009,COLECTOMY,231,MAJOR LARGE BOWEL PROCEDURES,06,DISEASES AND DISORDERS OF THE DIGESTIVE SYSTEM,2,Moderate,Moderate,Surgical,Medicaid,,,,,false,48793.56,32428.2
New York City,Manhattan,7002001,001438,Bellevue Hospital Center,30 to 49,112,F,Black/African American,Not Span/Hispanic,5,Emergency,Home or Self Care,2019,NEO015,GASTROINTESTINAL CANCERS - COLORECTAL,GIS009,COLECTOMY,231,MAJOR LARGE BOWEL PROCEDURES,06,DISEASES AND DISORDERS OF THE DIGESTIVE SYSTEM,1,Minor,Minor,Surgical,Medicaid,,,,,true,29827.86,19823.6
New York City,Manhattan,7002001,001438,Bellevue Hospital Center,70 or Older,100,F,White,Not Span/Hispanic,50,Emergency,Home w/ Home Health Services,2019,NEO015,GASTROINTESTINAL CANCERS - COLORECTAL,GIS009,COLECTOMY,231,MAJOR LARGE BOWEL PROCEDURES,06,DISEASES AND DISORDERS OF THE DIGESTIVE SYSTEM,3,Major,Major,Surgical,Medicare,,,,,true,249044.05,165514.68
New York City,Manhattan,7002001,001438,Bellevue Hospital Center,50 to 69,104,M,Black/African American,Not Span/Hispanic,3,Elective,Home or Self Care,2019,DIG025,OTHER SPECIFIED AND UNSPECIFIED GASTROINTESTINAL DISORDERS,GIS009,COLECTOMY,231,MAJOR LARGE BOWEL PROCEDURES,06,DISEASES AND DISORDERS OF THE DIGESTIVE SYSTEM,1,Minor,Minor,Surgical,Private Health Insurance,,,,,false,10106.29,6716.64
New York City,Manhattan,7002001,001438,Bellevue Hospital Center,50 to 69,112,M,Black/African American,Spanish/Hispanic,16,Emergency,Skilled Nursing Home,2019,DIG012,INTESTINAL OBSTRUCTION AND ILEUS,GIS018,ILEOSTOMY AND COLOSTOMY,231,MAJOR LARGE BOWEL PROCEDURES,06,DISEASES AND DISORDERS OF THE DIGESTIVE SYSTEM,3,Major,Major,Surgical,Medicare,Medicaid,,,,true,90352.33,60048.16
New York City,Manhattan,7002001,001438,Bellevue Hospital Center,50 to 69,113,F,Other Race,Not Span/Hispanic,3,Emergency,Home or Self Care,2019,NEO015,GASTROINTESTINAL CANCERS - COLORECTAL,GIS018,ILEOSTOMY AND COLOSTOMY,231,MAJOR LARGE BOWEL PROCEDURES,06,DISEASES AND DISORDERS OF THE DIGESTIVE SYSTEM,2,Moderate,Moderate,Surgical,Medicaid,,,,,true,21753.61,14457.45
New York City,Manhattan,7002001,001438,Bellevue Hospital Center,50 to 69,112,M,Black/African American,Not Span/Hispanic,7,Emergency,Home or Self Care,2019,NEO015,GASTROINTESTINAL CANCERS - COLORECTAL,GIS009,COLECTOMY,231,MAJOR LARGE BOWEL PROCEDURES,06,DISEASES AND DISORDERS OF THE DIGESTIVE SYSTEM,2,Moderate,Minor,Surgical,Medicaid,,,,,false,43745.26,29073.1
New York City,Manhattan,7002001,001438,Bellevue Hospital Center,50 to 69,112,F,Other Race,Spanish/Hispanic,9,Emergency,Home or Self Care,2019,DIG024,POSTPROCEDURAL OR POSTOPERATIVE DIGESTIVE SYSTEM COMPLICATION,GIS009,COLECTOMY,231,MAJOR LARGE BOWEL PROCEDURES,06,DISEASES AND DISORDERS OF THE DIGESTIVE SYSTEM,2,Moderate,Moderate,Surgical,Medicaid,,,,,true,108846.45,72339.35
New York City,Manhattan,7002001,001438,Bellevue Hospital Center,50 to 69,,M,White,Unknown,1,Elective,Skilled Nursing Home,2019,NEO015,GASTROINTESTINAL CANCERS - COLORECTAL,GIS009,COLECTOMY,231,MAJOR LARGE BOWEL PROCEDURES,06,DISEASES AND DISORDERS OF THE DIGESTIVE SYSTEM,2,Moderate,Moderate,Surgical,Medicare,Medicaid,,,,false,65017.76,43210.8
New York City,Manhattan,7002001,001438,Bellevue Hospital Center,70 or Older,100,F,Other Race,Not Span/Hispanic,4,Elective,Home or Self Care,2019,NEO015,GASTROINTESTINAL CANCERS - COLORECTAL,GIS009,COLECTOMY,231,MAJOR LARGE BOWEL PROCEDURES,06,DISEASES AND DISORDERS OF THE DIGESTIVE SYSTEM,2,Moderate,Moderate,Surgical,Medicaid,,,,,false,65881.11,43784.59
New York City,Manhattan,7002001,001438,Bellevue Hospital Center,50 to 69,113,M,Other Race,Spanish/Hispanic,2,Elective,Home or Self Care,2019,NEO015,GASTROINTESTINAL CANCERS - COLORECTAL,GIS009,COLECTOMY,231,MAJOR LARGE BOWEL PROCEDURES,06,DISEASES AND DISORDERS OF THE DIGESTIVE SYSTEM,1,Minor,Minor,Surgical,Private Health Insurance,,,,,false,64203.26,42669.49
New York City,Manhattan,7002001,001438,Bellevue Hospital Center,50 to 69,113,F,Other Race,Not Span/Hispanic,2,Elective,Home or Self Care,2019,NEO015,GASTROINTESTINAL CANCERS - COLORECTAL,GIS018,ILEOSTOMY AND COLOSTOMY,231,MAJOR LARGE BOWEL PROCEDURES,06,DISEASES AND DISORDERS OF THE DIGESTIVE SYSTEM,2,Moderate,Moderate,Surgical,Self-Pay,,,,,false,33030.44,21952.03
New York City,Manhattan,7002001,001438,Bellevue Hospital Center,50 to 69,113,M,Other Race,Unknown,16,Emergency,Home or Self Care,2019,DIG025,OTHER SPECIFIED AND UNSPECIFIED GASTROINTESTINAL DISORDERS,GIS009,COLECTOMY,231,MAJOR LARGE BOWEL PROCEDURES,06,DISEASES AND DISORDERS OF THE DIGESTIVE SYSTEM,4,Extreme,Major,Surgical,Medicare,Medicaid,,,,true,163428.54,108614.61
New York City,Manhattan,7002001,001438,Bellevue Hospital Center,30 to 49,113,F,Other Race,Not Span/Hispanic,63,Emergency,Home or Self Care,2019,NEO016,GASTROINTESTINAL CANCERS - ANUS,GIS018,ILEOSTOMY AND COLOSTOMY,231,MAJOR LARGE BOWEL PROCEDURES,06,DISEASES AND DISORDERS OF THE DIGESTIVE SYSTEM,3,Major,Major,Surgical,Medicaid,,,,,true,463361.53,307950.07
New York City,Manhattan,7002001,001438,Bellevue Hospital Center,30 to 49,104,M,White,Not Span/Hispanic,4,Elective,Home or Self Care,2019,DIG013,DIVERTICULOSIS AND DIVERTICULITIS,GIS018,ILEOSTOMY AND COLOSTOMY,231,MAJOR LARGE BOWEL PROCEDURES,06,DISEASES AND DISORDERS OF THE DIGESTIVE SYSTEM,2,Moderate,Minor,Surgical,Medicaid,,,,,false,49275.83,32748.72
New York City,Manhattan,7002001,001438,Bellevue Hospital Center,30 to 49,100,M,Black/African American,Not Span/Hispanic,21,Emergency,Home w/ Home Health Services,2019,NEO015,GASTROINTESTINAL CANCERS - COLORECTAL,GIS018,ILEOSTOMY AND COLOSTOMY,231,MAJOR LARGE BOWEL PROCEDURES,06,DISEASES AND DISORDERS OF THE DIGESTIVE SYSTEM,4,Extreme,Major,Surgical,Medicaid,,,,,true,251443.99,167109.68
New York City,Manhattan,7002001,001438,Bellevue Hospital Center,50 to 69,112,M,Other Race,Spanish/Hispanic,7,Elective,Home or Self Care,2019,NEO015,GASTROINTESTINAL CANCERS - COLORECTAL,GIS009,COLECTOMY,231,MAJOR LARGE BOWEL PROCEDURES,06,DISEASES AND DISORDERS OF THE DIGESTIVE SYSTEM,3,Major,Moderate,Surgical,Medicare,Medicaid,,,,false,82487.18,54820.98
New York City,Manhattan,7002001,001438,Bellevue Hospital Center,50 to 69,100,F,Other Race,Spanish/Hispanic,17,Emergency,Home or Self Care,2019,NEO015,GASTROINTESTINAL CANCERS - COLORECTAL,GIS009,COLECTOMY,231,MAJOR LARGE BOWEL PROCEDURES,06,DISEASES AND DISORDERS OF THE DIGESTIVE SYSTEM,3,Major,Moderate,Surgical,Medicaid,,,,,true,169016.93,112328.65
New York City,Manhattan,7002001,001438,Bellevue Hospital Center,50 to 69,104,M,Black/African American,Not Span/Hispanic,12,Emergency,Home or Self Care,2019,DIG012,INTESTINAL OBSTRUCTION AND ILEUS,GIS018,ILEOSTOMY AND COLOSTOMY,231,MAJOR LARGE BOWEL PROCEDURES,06,DISEASES AND DISORDERS OF THE DIGESTIVE SYSTEM,2,Moderate,Minor,Surgical,Private Health Insurance,Medicaid,,,,true,94843,63032.66
New York City,Manhattan,7002001,001438,Bellevue Hospital Center,50 to 69,104,M,Black/African American,Not Span/Hispanic,13,Elective,Home or Self Care,2019,NEO015,GASTROINTESTINAL CANCERS - COLORECTAL,GIS009,COLECTOMY,231,MAJOR LARGE BOWEL PROCEDURES,06,DISEASES AND DISORDERS OF THE DIGESTIVE SYSTEM,3,Major,Major,Surgical,Private Health Insurance,Medicaid,,,,false,173814.67,115517.23
New York City,Manhattan,7002001,001438,Bellevue Hospital Center,70 or Older,100,F,Other Race,Spanish/Hispanic,11,Emergency,Home or Self Care,2019,DIG013,DIVERTICULOSIS AND DIVERTICULITIS,GIS009,COLECTOMY,231,MAJOR LARGE BOWEL PROCEDURES,06,DISEASES AND DISORDERS OF THE DIGESTIVE SYSTEM,3,Major,Major,Surgical,Medicare,Medicaid,,,,true,142308.92,94578.51
New York City,Manhattan,7002001,001438,Bellevue Hospital Center,30 to 49,113,M,Other Race,Spanish/Hispanic,12,Elective,Home w/ Home Health Services,2019,DIG013,DIVERTICULOSIS AND DIVERTICULITIS,GIS009,COLECTOMY,231,MAJOR LARGE BOWEL PROCEDURES,06,DISEASES AND DISORDERS OF THE DIGESTIVE SYSTEM,3,Major,Major,Surgical,Medicaid,,,,,false,145356.47,96603.91
New York City,Manhattan,7002001,001438,Bellevue Hospital Center,50 to 69,100,F,Other Race,Spanish/Hispanic,1,Elective,Home or Self Care,2019,NEO073,BENIGN NEOPLASMS,GIS009,COLECTOMY,231,MAJOR LARGE BOWEL PROCEDURES,06,DISEASES AND DISORDERS OF THE DIGESTIVE SYSTEM,2,Moderate,Minor,Surgical,Medicare,Medicaid,,,,false,50477.75,33547.51
New York City,Manhattan,7002001,001438,Bellevue Hospital Center,70 or Older,100,F,Black/African American,Not Span/Hispanic,5,Elective,Home or Self Care,2019,NEO015,GASTROINTESTINAL CANCERS - COLORECTAL,GIS009,COLECTOMY,231,MAJOR LARGE BOWEL PROCEDURES,06,DISEASES AND DISORDERS OF THE DIGESTIVE SYSTEM,2,Moderate,Moderate,Surgical,Private Health Insurance,Medicare,,,,false,87902.15,58419.77
New York City,Manhattan,7002001,001438,Bellevue Hospital Center,70 or Older,100,F,Other Race,Spanish/Hispanic,4,Elective,Home or Self Care,2019,NEO016,GASTROINTESTINAL CANCERS - ANUS,GIS018,ILEOSTOMY AND COLOSTOMY,231,MAJOR LARGE BOWEL PROCEDURES,06,DISEASES AND DISORDERS OF THE DIGESTIVE SYSTEM,1,Minor,Minor,Surgical,Medicare,,,,,false,86053.71,57191.3
New York City,Manhattan,7002001,001438,Bellevue Hospital Center,50 to 69,103,M,Other Race,Spanish/Hispanic,5,Elective,Home or Self Care,2019,DIG013,DIVERTICULOSIS AND DIVERTICULITIS,GIS009,COLECTOMY,231,MAJOR LARGE BOWEL PROCEDURES,06,DISEASES AND DISORDERS OF THE DIGESTIVE SYSTEM,2,Moderate,Minor,Surgical,Private Health Insurance,,,,,false,84103.02,55894.87
