Hospital Service Area,Hospital County,Operating Certificate Number,Permanent Facility Id,Facility Name,Age Group,Zip Code - 3 digits,Gender,Race,Ethnicity,Length of Stay,Type of Admission,Patient Disposition,Discharge Year,CCS Diagnosis Code,CCS Diagnosis Description,CCS Procedure Code,CCS Procedure Description,APR DRG Code,APR DRG Description,APR MDC Code,APR MDC Description,APR Severity of Illness Code,APR Severity of Illness Description,APR Risk of Mortality,APR Medical Surgical Description,Payment Typology 1,Payment Typology 2,Payment Typology 3,Birth Weight,Abortion Edit Indicator,Emergency Department Indicator,Total Charges,Total Costs
New York City,Manhattan,7002053,001463,NYU Langone Hospitals,30 to 49,OOS,F,White,Not Span/Hispanic,5,Elective,Home w/ Home Health Services,2019,NEO015,GASTROINTESTINAL CANCERS - COLORECTAL,GIS009,COLECTOMY,231,MAJOR LARGE BOWEL PROCEDURES,06,DISEASES AND DISORDERS OF THE DIGESTIVE SYSTEM,2,Moderate,Moderate,Surgical,Private Health Insurance,,,,,false,158833.35,32840.87
New York City,Manhattan,7002053,001463,NYU Langone Hospitals,70 or Older,100,F,White,Not Span/Hispanic,4,Elective,Home w/ Home Health Services,2019,FAC010,OTHER AFTERCARE ENCOUNTER,GIS009,COLECTOMY,231,MAJOR LARGE BOWEL PROCEDURES,06,DISEASES AND DISORDERS OF THE DIGESTIVE SYSTEM,3,Major,Moderate,Surgical,Medicare,,,,,false,133258.47,25358.7
New York City,Manhattan,7002053,001463,NYU Langone Hospitals,70 or Older,100,F,Other Race,Not Span/Hispanic,2,Elective,Home or Self Care,2019,NEO015,GASTROINTESTINAL CANCERS - COLORECTAL,GIS009,COLECTOMY,231,MAJOR LARGE BOWEL PROCEDURES,06,DISEASES AND DISORDERS OF THE DIGESTIVE SYSTEM,2,Moderate,Moderate,Surgical,Medicare,,,,,false,145048.36,24948.87
New York City,Manhattan,7002053,001463,NYU Langone Hospitals,30 to 49,103,F,White,Not Span/Hispanic,7,Elective,Home or Self Care,2019,DIG013,DIVERTICULOSIS AND DIVERTICULITIS,GIS009,COLECTOMY,231,MAJOR LARGE BOWEL PROCEDURES,06,DISEASES AND DISORDERS OF THE DIGESTIVE SYSTEM,2,Moderate,Minor,Surgical,Private Health Insurance,,,,,false,154406.19,37653.01
New York City,Manhattan,7002053,001463,NYU Langone Hospitals,50 to 69,112,M,White,Not Span/Hispanic,7,Elective,Home or Self Care,2019,NEO015,GASTROINTESTINAL CANCERS - COLORECTAL,OTR001,ROBOTIC-ASSISTED PROCEDURES,231,MAJOR LARGE BOWEL PROCEDURES,06,DISEASES AND DISORDERS OF THE DIGESTIVE SYSTEM,3,Major,Moderate,Surgical,Medicare,Blue Cross/Blue Shield,,,,false,266756.43,52527.52
New York City,Manhattan,7002053,001463,NYU Langone Hospitals,50 to 69,115,M,White,Not Span/Hispanic,6,Elective,Home or Self Care,2019,DIG013,DIVERTICULOSIS AND DIVERTICULITIS,GIS009,COLECTOMY,231,MAJOR LARGE BOWEL PROCEDURES,06,DISEASES AND DISORDERS OF THE DIGESTIVE SYSTEM,2,Moderate,Moderate,Surgical,Blue Cross/Blue Shield,,,,,false,224386.07,49704.2
New York City,Manhattan,7002053,001463,NYU Langone Hospitals,50 to 69,104,M,Other Race,Spanish/Hispanic,5,Elective,Home w/ Home Health Services,2019,NEO015,GASTROINTESTINAL CANCERS - COLORECTAL,GIS018,ILEOSTOMY AND COLOSTOMY,231,MAJOR LARGE BOWEL PROCEDURES,06,DISEASES AND DISORDERS OF THE DIGESTIVE SYSTEM,3,Major,Major,Surgical,Blue Cross/Blue Shield,,,,,false,145659.97,30920.35
New York City,Manhattan,7002053,001463,NYU Langone Hospitals,30 to 49,113,F,White,Not Span/Hispanic,6,Elective,Home or Self Care,2019,NEO073,BENIGN NEOPLASMS,GIS009,COLECTOMY,231,MAJOR LARGE BOWEL PROCEDURES,06,DISEASES AND DISORDERS OF THE DIGESTIVE SYSTEM,2,Moderate,Minor,Surgical,Private Health Insurance,,,,,false,143750.6,33521.33
New York City,Manhattan,7002053,001463,NYU Langone Hospitals,50 to 69,111,M,Other Race,Spanish/Hispanic,2,Elective,Home or Self Care,2019,NEO073,BENIGN NEOPLASMS,GIS009,COLECTOMY,231,MAJOR LARGE BOWEL PROCEDURES,06,DISEASES AND DISORDERS OF THE DIGESTIVE SYSTEM,2,Moderate,Minor,Surgical,Private Health Insurance,,,,,false,116758.82,23461.24
New York City,Manhattan,7002053,001463,NYU Langone Hospitals,0 to 17,100,F,Other Race,Unknown,6,Emergency,Home or Self Care,2019,MAL002,DIGESTIVE CONGENITAL ANOMALIES,GIS028,"LOWER GI THERAPEUTIC PROCEDURES, NEC (OPEN AND LAPAROSCOPIC)",231,MAJOR LARGE BOWEL PROCEDURES,06,DISEASES AND DISORDERS OF THE DIGESTIVE SYSTEM,1,Minor,Minor,Surgical,Private Health Insurance,Private Health Insurance,,,,true,95681.19,26239.85
New York City,Manhattan,7002053,001463,NYU Langone Hospitals,50 to 69,100,F,White,Not Span/Hispanic,5,Emergency,Home w/ Home Health Services,2019,NEO070,SECONDARY MALIGNANCIES,GIS003,GI SYSTEM BIOPSY (NON-ENDOSCOPIC),231,MAJOR LARGE BOWEL PROCEDURES,06,DISEASES AND DISORDERS OF THE DIGESTIVE SYSTEM,3,Major,Major,Surgical,Private Health Insurance,,,,,false,95316.91,23182.57
New York City,Manhattan,7002053,001463,NYU Langone Hospitals,70 or Older,103,M,White,Not Span/Hispanic,8,Elective,Home w/ Home Health Services,2019,NEO015,GASTROINTESTINAL CANCERS - COLORECTAL,URN003,URETER AND OTHER URINARY TRACT DILATION,231,MAJOR LARGE BOWEL PROCEDURES,06,DISEASES AND DISORDERS OF THE DIGESTIVE SYSTEM,3,Major,Major,Surgical,Private Health Insurance,,,,,false,298509.64,61122.49
New York City,Manhattan,7002053,001463,NYU Langone Hospitals,70 or Older,100,F,White,Not Span/Hispanic,6,Elective,Home or Self Care,2019,NEO015,GASTROINTESTINAL CANCERS - COLORECTAL,GIS009,COLECTOMY,231,MAJOR LARGE BOWEL PROCEDURES,06,DISEASES AND DISORDERS OF THE DIGESTIVE SYSTEM,3,Major,Moderate,Surgical,Medicare,,,,,false,138479.72,31478.13
New York City,Manhattan,7002053,001463,NYU Langone Hospitals,50 to 69,111,M,White,Not Span/Hispanic,3,Elective,Home or Self Care,2019,NEO015,GASTROINTESTINAL CANCERS - COLORECTAL,GIS009,COLECTOMY,231,MAJOR LARGE BOWEL PROCEDURES,06,DISEASES AND DISORDERS OF THE DIGESTIVE SYSTEM,1,Minor,Minor,Surgical,Private Health Insurance,,,,,false,116490.68,21731.42
New York City,Manhattan,7002053,001463,NYU Langone Hospitals,50 to 69,112,F,White,Not Span/Hispanic,6,Elective,Home or Self Care,2019,NEO015,GASTROINTESTINAL CANCERS - COLORECTAL,GIS009,COLECTOMY,231,MAJOR LARGE BOWEL PROCEDURES,06,DISEASES AND DISORDERS OF THE DIGESTIVE SYSTEM,3,Major,Moderate,Surgical,Private Health Insurance,,,,,false,107847.05,27611.45
New York City,Manhattan,7002053,001463,NYU Langone Hospitals,70 or Older,114,F,White,Not Span/Hispanic,7,Elective,Home or Self Care,2019,NEO015,GASTROINTESTINAL CANCERS - COLORECTAL,GIS009,COLECTOMY,231,MAJOR LARGE BOWEL PROCEDURES,06,DISEASES AND DISORDERS OF THE DIGESTIVE SYSTEM,2,Moderate,Minor,Surgical,Medicare,Blue Cross/Blue Shield,,,,false,202944.48,44010.37
New York City,Manhattan,7002053,001463,NYU Langone Hospitals,70 or Older,100,M,White,Not Span/Hispanic,7,Emergency,Home or Self Care,2019,NEO015,GASTROINTESTINAL CANCERS - COLORECTAL,GIS009,COLECTOMY,231,MAJOR LARGE BOWEL PROCEDURES,06,DISEASES AND DISORDERS OF THE DIGESTIVE SYSTEM,2,Moderate,Minor,Surgical,Medicare,Medicare,,,,true,241073.24,49413.97
New York City,Manhattan,7002053,001463,NYU Langone Hospitals,70 or Older,113,F,White,Not Span/Hispanic,6,Elective,Inpatient Rehabilitation Facility,2019,DIG013,DIVERTICULOSIS AND DIVERTICULITIS,GIS009,COLECTOMY,231,MAJOR LARGE BOWEL PROCEDURES,06,DISEASES AND DISORDERS OF THE DIGESTIVE SYSTEM,2,Moderate,Moderate,Surgical,Medicare,Medicare,,,,false,219336.42,42533.38
New York City,Manhattan,7002053,001463,NYU Langone Hospitals,50 to 69,112,F,White,Not Span/Hispanic,4,Elective,Home or Self Care,2019,DIG013,DIVERTICULOSIS AND DIVERTICULITIS,GIS009,COLECTOMY,231,MAJOR LARGE BOWEL PROCEDURES,06,DISEASES AND DISORDERS OF THE DIGESTIVE SYSTEM,2,Moderate,Minor,Surgical,Private Health Insurance,,,,,false,173974.86,33954.59
New York City,Manhattan,7002053,001463,NYU Langone Hospitals,50 to 69,OOS,M,Other Race,Not Span/Hispanic,2,Elective,Home or Self Care,2019,NEO015,GASTROINTESTINAL CANCERS - COLORECTAL,GIS009,COLECTOMY,231,MAJOR LARGE BOWEL PROCEDURES,06,DISEASES AND DISORDERS OF THE DIGESTIVE SYSTEM,2,Moderate,Moderate,Surgical,Private Health Insurance,,,,,false,150896.58,26025.52
New York City,Manhattan,7002053,001463,NYU Langone Hospitals,30 to 49,100,M,White,Not Span/Hispanic,5,Elective,Home or Self Care,2019,DIG013,DIVERTICULOSIS AND DIVERTICULITIS,GIS009,COLECTOMY,231,MAJOR LARGE BOWEL PROCEDURES,06,DISEASES AND DISORDERS OF THE DIGESTIVE SYSTEM,2,Moderate,Minor,Surgical,Blue Cross/Blue Shield,,,,,false,123673.16,28540.69
New York City,Manhattan,7002053,001463,NYU Langone Hospitals,70 or Older,100,F,White,Not Span/Hispanic,6,Elective,Home w/ Home Health Services,2019,NEO015,GASTROINTESTINAL CANCERS - COLORECTAL,GIS009,COLECTOMY,231,MAJOR LARGE BOWEL PROCEDURES,06,DISEASES AND DISORDERS OF THE DIGESTIVE SYSTEM,3,Major,Major,Surgical,Medicare,Medicare,,,,false,161728.34,35548.83
New York City,Manhattan,7002053,001463,NYU Langone Hospitals,50 to 69,117,F,Other Race,Not Span/Hispanic,6,Elective,Home w/ Home Health Services,2019,FAC010,OTHER AFTERCARE ENCOUNTER,GIS009,COLECTOMY,231,MAJOR LARGE BOWEL PROCEDURES,06,DISEASES AND DISORDERS OF THE DIGESTIVE SYSTEM,2,Moderate,Minor,Surgical,Blue Cross/Blue Shield,,,,,false,139795.11,33050.87
New York City,Manhattan,7002053,001463,NYU Langone Hospitals,50 to 69,OOS,F,White,Not Span/Hispanic,2,Elective,Home or Self Care,2019,DIG013,DIVERTICULOSIS AND DIVERTICULITIS,GIS009,COLECTOMY,231,MAJOR LARGE BOWEL PROCEDURES,06,DISEASES AND DISORDERS OF THE DIGESTIVE SYSTEM,1,Minor,Minor,Surgical,Private Health Insurance,,,,,false,122538.67,21904.18
New York City,Manhattan,7002053,001463,NYU Langone Hospitals,50 to 69,112,M,White,Not Span/Hispanic,4,Elective,Home w/ Home Health Services,2019,DIG015,ANAL AND RECTAL CONDITIONS,GIS018,ILEOSTOMY AND COLOSTOMY,231,MAJOR LARGE BOWEL PROCEDURES,06,DISEASES AND DISORDERS OF THE DIGESTIVE SYSTEM,3,Major,Moderate,Surgical,Private Health Insurance,,,,,false,85002.63,20972.63
New York City,Manhattan,7002053,001463,NYU Langone Hospitals,50 to 69,100,M,White,Not Span/Hispanic,7,Elective,Home or Self Care,2019,NEO015,GASTROINTESTINAL CANCERS - COLORECTAL,GIS013,PROCTECTOMY OR ANAL RESECTION,231,MAJOR LARGE BOWEL PROCEDURES,06,DISEASES AND DISORDERS OF THE DIGESTIVE SYSTEM,2,Moderate,Moderate,Surgical,Medicaid,,,,,false,160625.96,38644.61
New York City,Manhattan,7002053,001463,NYU Langone Hospitals,50 to 69,100,F,White,Not Span/Hispanic,7,Elective,Home w/ Home Health Services,2019,FAC010,OTHER AFTERCARE ENCOUNTER,GIS009,COLECTOMY,231,MAJOR LARGE BOWEL PROCEDURES,06,DISEASES AND DISORDERS OF THE DIGESTIVE SYSTEM,2,Moderate,Moderate,Surgical,Medicare,Medicaid,,,,false,294516.33,57212.41
New York City,Manhattan,7002053,001463,NYU Langone Hospitals,50 to 69,100,F,Black/African American,Not Span/Hispanic,2,Elective,Home or Self Care,2019,NEO015,GASTROINTESTINAL CANCERS - COLORECTAL,GIS009,COLECTOMY,231,MAJOR LARGE BOWEL PROCEDURES,06,DISEASES AND DISORDERS OF THE DIGESTIVE SYSTEM,2,Moderate,Moderate,Surgical,Blue Cross/Blue Shield,,,,,false,159015.89,27443.41
New York City,Manhattan,7002053,001463,NYU Langone Hospitals,50 to 69,116,F,White,Not Span/Hispanic,2,Elective,Home or Self Care,2019,DIG013,DIVERTICULOSIS AND DIVERTICULITIS,GIS009,COLECTOMY,231,MAJOR LARGE BOWEL PROCEDURES,06,DISEASES AND DISORDERS OF THE DIGESTIVE SYSTEM,1,Minor,Minor,Surgical,Medicare,Medicare,,,,false,180566.43,29938.08
New York City,Manhattan,7002053,001463,NYU Langone Hospitals,30 to 49,112,F,Other Race,Spanish/Hispanic,4,Elective,Home or Self Care,2019,DIG013,DIVERTICULOSIS AND DIVERTICULITIS,GIS009,COLECTOMY,231,MAJOR LARGE BOWEL PROCEDURES,06,DISEASES AND DISORDERS OF THE DIGESTIVE SYSTEM,2,Moderate,Minor,Surgical,Private Health Insurance,,,,,false,115999.65,25706.07
New York City,Manhattan,7002053,001463,NYU Langone Hospitals,70 or Older,112,M,Black/African American,Not Span/Hispanic,8,Elective,Home w/ Home Health Services,2019,NEO015,GASTROINTESTINAL CANCERS - COLORECTAL,URN001,CYSTOSCOPY AND URETEROSCOPY (INCLUDING BIOPSY),231,MAJOR LARGE BOWEL PROCEDURES,06,DISEASES AND DISORDERS OF THE DIGESTIVE SYSTEM,3,Major,Moderate,Surgical,Medicare,Blue Cross/Blue Shield,,,,false,274344.05,57587.84
New York City,Manhattan,7002053,001463,NYU Langone Hospitals,50 to 69,104,M,Other Race,Spanish/Hispanic,4,Elective,Home or Self Care,2019,NEO015,GASTROINTESTINAL CANCERS - COLORECTAL,GIS009,COLECTOMY,231,MAJOR LARGE BOWEL PROCEDURES,06,DISEASES AND DISORDERS OF THE DIGESTIVE SYSTEM,2,Moderate,Minor,Surgical,Private Health Insurance,,,,,false,193133.31,36658.38
New York City,Manhattan,7002053,001463,NYU Langone Hospitals,50 to 69,OOS,F,White,Not Span/Hispanic,8,Elective,Home or Self Care,2019,DIG011,REGIONAL ENTERITIS AND ULCERATIVE COLITIS,GIS013,PROCTECTOMY OR ANAL RESECTION,231,MAJOR LARGE BOWEL PROCEDURES,06,DISEASES AND DISORDERS OF THE DIGESTIVE SYSTEM,2,Moderate,Minor,Surgical,Blue Cross/Blue Shield,,,,,false,142199.98,38123.9
New York City,Manhattan,7002053,001463,NYU Langone Hospitals,50 to 69,112,M,Other Race,Not Span/Hispanic,11,Elective,Home or Self Care,2019,DIG013,DIVERTICULOSIS AND DIVERTICULITIS,GIS009,COLECTOMY,231,MAJOR LARGE BOWEL PROCEDURES,06,DISEASES AND DISORDERS OF THE DIGESTIVE SYSTEM,2,Moderate,Minor,Surgical,Federal/State/Local/VA,,,,,false,195937.47,53829.66
New York City,Manhattan,7002053,001463,NYU Langone Hospitals,70 or Older,112,F,White,Not Span/Hispanic,3,Elective,Home or Self Care,2019,DIG013,DIVERTICULOSIS AND DIVERTICULITIS,GIS009,COLECTOMY,231,MAJOR LARGE BOWEL PROCEDURES,06,DISEASES AND DISORDERS OF THE DIGESTIVE SYSTEM,1,Minor,Minor,Surgical,Blue Cross/Blue Shield,Medicare,,,,false,174053.12,31072.66
New York City,Manhattan,7002053,001463,NYU Langone Hospitals,50 to 69,100,F,White,Not Span/Hispanic,5,Elective,Home or Self Care,2019,DIG013,DIVERTICULOSIS AND DIVERTICULITIS,GIS009,COLECTOMY,231,MAJOR LARGE BOWEL PROCEDURES,06,DISEASES AND DISORDERS OF THE DIGESTIVE SYSTEM,2,Moderate,Minor,Surgical,Private Health Insurance,,,,,false,240409.56,44256.5
New York City,Manhattan,7002053,001463,NYU Langone Hospitals,50 to 69,113,M,Other Race,Not Span/Hispanic,3,Elective,Home or Self Care,2019,NEO015,GASTROINTESTINAL CANCERS - COLORECTAL,GIS009,COLECTOMY,231,MAJOR LARGE BOWEL PROCEDURES,06,DISEASES AND DISORDERS OF THE DIGESTIVE SYSTEM,2,Moderate,Minor,Surgical,Private Health Insurance,,,,,false,145194,27139.39
New York City,Manhattan,7002053,001463,NYU Langone Hospitals,50 to 69,113,M,Other Race,Not Span/Hispanic,6,Elective,Home or Self Care,2019,DIG013,DIVERTICULOSIS AND DIVERTICULITIS,GIS009,COLECTOMY,231,MAJOR LARGE BOWEL PROCEDURES,06,DISEASES AND DISORDERS OF THE DIGESTIVE SYSTEM,3,Major,Minor,Surgical,Blue Cross/Blue Shield,,,,,false,210918.29,43351.35
New York City,Manhattan,7002053,001463,NYU Langone Hospitals,30 to 49,100,M,Other Race,Not Span/Hispanic,3,Elective,Home or Self Care,2019,NEO015,GASTROINTESTINAL CANCERS - COLORECTAL,GIS009,COLECTOMY,231,MAJOR LARGE BOWEL PROCEDURES,06,DISEASES AND DISORDERS OF THE DIGESTIVE SYSTEM,2,Moderate,Minor,Surgical,Private Health Insurance,,,,,false,175330.14,31561.63
New York City,Manhattan,7002053,001463,NYU Langone Hospitals,30 to 49,112,M,White,Not Span/Hispanic,2,Elective,Home or Self Care,2019,DIG013,DIVERTICULOSIS AND DIVERTICULITIS,GIS009,COLECTOMY,231,MAJOR LARGE BOWEL PROCEDURES,06,DISEASES AND DISORDERS OF THE DIGESTIVE SYSTEM,1,Minor,Minor,Surgical,Private Health Insurance,,,,,false,139864.04,24439.8
New York City,Manhattan,7002053,001463,NYU Langone Hospitals,70 or Older,113,F,White,Not Span/Hispanic,5,Elective,Home or Self Care,2019,NEO073,BENIGN NEOPLASMS,GIS009,COLECTOMY,231,MAJOR LARGE BOWEL PROCEDURES,06,DISEASES AND DISORDERS OF THE DIGESTIVE SYSTEM,1,Minor,Minor,Surgical,Medicare,,,,,false,101751.3,25471.81
New York City,Manhattan,7002053,001463,NYU Langone Hospitals,30 to 49,112,M,White,Not Span/Hispanic,2,Elective,Home or Self Care,2019,NEO073,BENIGN NEOPLASMS,GIS009,COLECTOMY,231,MAJOR LARGE BOWEL PROCEDURES,06,DISEASES AND DISORDERS OF THE DIGESTIVE SYSTEM,2,Moderate,Moderate,Surgical,Private Health Insurance,,,,,false,111649.99,20425.31
New York City,Manhattan,7002053,001463,NYU Langone Hospitals,70 or Older,100,F,Other Race,Spanish/Hispanic,8,Emergency,Skilled Nursing Home,2019,DIG013,DIVERTICULOSIS AND DIVERTICULITIS,GIS009,COLECTOMY,231,MAJOR LARGE BOWEL PROCEDURES,06,DISEASES AND DISORDERS OF THE DIGESTIVE SYSTEM,3,Major,Major,Surgical,Medicare,Blue Cross/Blue Shield,,,,true,233996.38,75980.54
New York City,Manhattan,7002053,001463,NYU Langone Hospitals,50 to 69,112,M,White,Not Span/Hispanic,14,Elective,Home or Self Care,2019,DIG013,DIVERTICULOSIS AND DIVERTICULITIS,GIS009,COLECTOMY,231,MAJOR LARGE BOWEL PROCEDURES,06,DISEASES AND DISORDERS OF THE DIGESTIVE SYSTEM,3,Major,Major,Surgical,Private Health Insurance,,,,,false,287711.28,71471.21
New York City,Manhattan,7002053,001463,NYU Langone Hospitals,50 to 69,103,M,White,Not Span/Hispanic,4,Elective,Home or Self Care,2019,NEO015,GASTROINTESTINAL CANCERS - COLORECTAL,GIS009,COLECTOMY,231,MAJOR LARGE BOWEL PROCEDURES,06,DISEASES AND DISORDERS OF THE DIGESTIVE SYSTEM,1,Minor,Minor,Surgical,Private Health Insurance,,,,,false,208048.03,38576.35
New York City,Manhattan,7002053,001463,NYU Langone Hospitals,18 to 29,,F,Other Race,Not Span/Hispanic,12,Elective,Home or Self Care,2019,DIG024,POSTPROCEDURAL OR POSTOPERATIVE DIGESTIVE SYSTEM COMPLICATION,GIS026,"UPPER GI THERAPEUTIC PROCEDURES, NEC (OPEN AND LAPAROSCOPIC)",231,MAJOR LARGE BOWEL PROCEDURES,06,DISEASES AND DISORDERS OF THE DIGESTIVE SYSTEM,3,Major,Moderate,Surgical,Blue Cross/Blue Shield,,,,,false,202949.95,60189.87
New York City,Manhattan,7002053,001463,NYU Langone Hospitals,30 to 49,112,F,White,Not Span/Hispanic,4,Emergency,Home or Self Care,2019,DIG012,INTESTINAL OBSTRUCTION AND ILEUS,GIS009,COLECTOMY,231,MAJOR LARGE BOWEL PROCEDURES,06,DISEASES AND DISORDERS OF THE DIGESTIVE SYSTEM,3,Major,Moderate,Surgical,Private Health Insurance,Medicaid,Medicaid,,,true,115244.94,26046.62
New York City,Manhattan,7002053,001463,NYU Langone Hospitals,70 or Older,112,M,Black/African American,Not Span/Hispanic,13,Emergency,Home w/ Home Health Services,2019,NEO015,GASTROINTESTINAL CANCERS - COLORECTAL,GIS009,COLECTOMY,231,MAJOR LARGE BOWEL PROCEDURES,06,DISEASES AND DISORDERS OF THE DIGESTIVE SYSTEM,3,Major,Major,Surgical,Medicare,Blue Cross/Blue Shield,,,,true,324396.5,76512.5
New York City,Manhattan,7002053,001463,NYU Langone Hospitals,30 to 49,100,M,White,Not Span/Hispanic,3,Elective,Home or Self Care,2019,DIG013,DIVERTICULOSIS AND DIVERTICULITIS,GIS009,COLECTOMY,231,MAJOR LARGE BOWEL PROCEDURES,06,DISEASES AND DISORDERS OF THE DIGESTIVE SYSTEM,1,Minor,Minor,Surgical,Medicaid,,,,,false,180892.87,31275.91
New York City,Manhattan,7002053,001463,NYU Langone Hospitals,50 to 69,100,F,White,Not Span/Hispanic,3,Elective,Home or Self Care,2019,NEO015,GASTROINTESTINAL CANCERS - COLORECTAL,GIS009,COLECTOMY,231,MAJOR LARGE BOWEL PROCEDURES,06,DISEASES AND DISORDERS OF THE DIGESTIVE SYSTEM,1,Minor,Minor,Surgical,Blue Cross/Blue Shield,,,,,false,172367.8,31352.68
New York City,Manhattan,7002053,001463,NYU Langone Hospitals,50 to 69,119,F,White,Not Span/Hispanic,6,Elective,Home or Self Care,2019,DIG011,REGIONAL ENTERITIS AND ULCERATIVE COLITIS,GIS026,"UPPER GI THERAPEUTIC PROCEDURES, NEC (OPEN AND LAPAROSCOPIC)",231,MAJOR LARGE BOWEL PROCEDURES,06,DISEASES AND DISORDERS OF THE DIGESTIVE SYSTEM,3,Major,Moderate,Surgical,Private Health Insurance,Medicare,,,,false,122955.43,30524.16
New York City,Manhattan,7002053,001463,NYU Langone Hospitals,50 to 69,112,M,Other Race,Spanish/Hispanic,3,Elective,Home or Self Care,2019,NEO015,GASTROINTESTINAL CANCERS - COLORECTAL,GIS013,PROCTECTOMY OR ANAL RESECTION,231,MAJOR LARGE BOWEL PROCEDURES,06,DISEASES AND DISORDERS OF THE DIGESTIVE SYSTEM,2,Moderate,Moderate,Surgical,Private Health Insurance,Medicaid,,,,false,193199.56,34072.43
New York City,Manhattan,7002053,001463,NYU Langone Hospitals,30 to 49,112,F,Black/African American,Not Span/Hispanic,3,Elective,Home or Self Care,2019,GEN019,ENDOMETRIOSIS,GIS013,PROCTECTOMY OR ANAL RESECTION,231,MAJOR LARGE BOWEL PROCEDURES,06,DISEASES AND DISORDERS OF THE DIGESTIVE SYSTEM,2,Moderate,Minor,Surgical,Private Health Insurance,,,,,false,181571.7,32480.64
New York City,Manhattan,7002053,001463,NYU Langone Hospitals,50 to 69,112,F,Black/African American,Not Span/Hispanic,2,Elective,Home or Self Care,2019,NEO073,BENIGN NEOPLASMS,GIS009,COLECTOMY,231,MAJOR LARGE BOWEL PROCEDURES,06,DISEASES AND DISORDERS OF THE DIGESTIVE SYSTEM,1,Minor,Minor,Surgical,Private Health Insurance,,,,,false,138537.4,24260.75
New York City,Manhattan,7002053,001463,NYU Langone Hospitals,50 to 69,112,F,Black/African American,Not Span/Hispanic,3,Elective,Home or Self Care,2019,NEO015,GASTROINTESTINAL CANCERS - COLORECTAL,GIS009,COLECTOMY,231,MAJOR LARGE BOWEL PROCEDURES,06,DISEASES AND DISORDERS OF THE DIGESTIVE SYSTEM,3,Major,Major,Surgical,Blue Cross/Blue Shield,,,,,false,207617.33,35235.14
New York City,Manhattan,7002053,001463,NYU Langone Hospitals,30 to 49,121,F,White,Not Span/Hispanic,4,Elective,Home or Self Care,2019,DIG011,REGIONAL ENTERITIS AND ULCERATIVE COLITIS,GIS009,COLECTOMY,231,MAJOR LARGE BOWEL PROCEDURES,06,DISEASES AND DISORDERS OF THE DIGESTIVE SYSTEM,2,Moderate,Minor,Surgical,Blue Cross/Blue Shield,,,,,false,116526.49,24503.02
New York City,Manhattan,7002053,001463,NYU Langone Hospitals,30 to 49,112,F,White,Not Span/Hispanic,3,Elective,Home or Self Care,2019,NEO015,GASTROINTESTINAL CANCERS - COLORECTAL,GIS009,COLECTOMY,231,MAJOR LARGE BOWEL PROCEDURES,06,DISEASES AND DISORDERS OF THE DIGESTIVE SYSTEM,1,Minor,Minor,Surgical,Private Health Insurance,,,,,false,108818.8,21390.93
New York City,Manhattan,7002053,001463,NYU Langone Hospitals,50 to 69,104,F,Black/African American,Not Span/Hispanic,3,Elective,Home or Self Care,2019,DIG013,DIVERTICULOSIS AND DIVERTICULITIS,URN003,URETER AND OTHER URINARY TRACT DILATION,231,MAJOR LARGE BOWEL PROCEDURES,06,DISEASES AND DISORDERS OF THE DIGESTIVE SYSTEM,2,Moderate,Minor,Surgical,Private Health Insurance,,,,,false,235027.65,39683.11
New York City,Manhattan,7002053,001463,NYU Langone Hospitals,30 to 49,103,M,White,Not Span/Hispanic,4,Elective,Home or Self Care,2019,DIG013,DIVERTICULOSIS AND DIVERTICULITIS,GIS009,COLECTOMY,231,MAJOR LARGE BOWEL PROCEDURES,06,DISEASES AND DISORDERS OF THE DIGESTIVE SYSTEM,3,Major,Moderate,Surgical,Blue Cross/Blue Shield,,,,,false,209028.71,37585.65
New York City,Manhattan,7002053,001463,NYU Langone Hospitals,50 to 69,100,F,White,Not Span/Hispanic,4,Emergency,Home or Self Care,2019,DIG009,APPENDICITIS AND OTHER APPENDICEAL CONDITIONS,GIS009,COLECTOMY,231,MAJOR LARGE BOWEL PROCEDURES,06,DISEASES AND DISORDERS OF THE DIGESTIVE SYSTEM,2,Moderate,Minor,Surgical,Private Health Insurance,,,,,true,138139.08,27504.49
New York City,Manhattan,7002053,001463,NYU Langone Hospitals,70 or Older,104,F,White,Not Span/Hispanic,2,Elective,Home w/ Home Health Services,2019,SYM006,ABDOMINAL PAIN AND OTHER DIGESTIVE/ABDOMEN SIGNS AND SYMPTOMS,GIS018,ILEOSTOMY AND COLOSTOMY,231,MAJOR LARGE BOWEL PROCEDURES,06,DISEASES AND DISORDERS OF THE DIGESTIVE SYSTEM,2,Moderate,Minor,Surgical,Medicare,,,,,false,60616.59,12161.56
New York City,Manhattan,7002053,001463,NYU Langone Hospitals,30 to 49,OOS,M,Black/African American,Not Span/Hispanic,1,Elective,Home or Self Care,2019,DIG013,DIVERTICULOSIS AND DIVERTICULITIS,GIS009,COLECTOMY,231,MAJOR LARGE BOWEL PROCEDURES,06,DISEASES AND DISORDERS OF THE DIGESTIVE SYSTEM,2,Moderate,Minor,Surgical,Private Health Insurance,,,,,false,95500.11,15732.88
New York City,Manhattan,7002053,001463,NYU Langone Hospitals,50 to 69,115,F,White,Not Span/Hispanic,2,Elective,Home or Self Care,2019,DIG013,DIVERTICULOSIS AND DIVERTICULITIS,GIS009,COLECTOMY,231,MAJOR LARGE BOWEL PROCEDURES,06,DISEASES AND DISORDERS OF THE DIGESTIVE SYSTEM,1,Minor,Minor,Surgical,Blue Cross/Blue Shield,,,,,false,76184.96,15399.04