Hospital Service Area,Hospital County,Operating Certificate Number,Permanent Facility Id,Facility Name,Age Group,Zip Code - 3 digits,Gender,Race,Ethnicity,Length of Stay,Type of Admission,Patient Disposition,Discharge Year,CCS Diagnosis Code,CCS Diagnosis Description,CCS Procedure Code,CCS Procedure Description,APR DRG Code,APR DRG Description,APR MDC Code,APR MDC Description,APR Severity of Illness Code,APR Severity of Illness Description,APR Risk of Mortality,APR Medical Surgical Description,Payment Typology 1,Payment Typology 2,Payment Typology 3,Birth Weight,Abortion Edit Indicator,Emergency Department Indicator,Total Charges,Total Costs
New York City,Manhattan,7002053,001463,NYU Langone Hospitals,70 or Older,100,F,White,Not Span/Hispanic,3,Elective,Home w/ Home Health Services,2020,NEO015,GASTROINTESTINAL CANCERS - COLORECTAL,GIS009,COLECTOMY,231,MAJOR LARGE BOWEL PROCEDURES,06,DISEASES AND DISORDERS OF THE DIGESTIVE SYSTEM,1,Minor,Minor,Surgical,Medicare,Medicare,,,,N,166782.78,28696.61
New York City,Manhattan,7002053,001463,NYU Langone Hospitals,50 to 69,100,F,White,Not Span/Hispanic,13,Emergency,Home w/ Home Health Services,2020,DIG013,DIVERTICULOSIS AND DIVERTICULITIS,GIS009,COLECTOMY,231,MAJOR LARGE BOWEL PROCEDURES,06,DISEASES AND DISORDERS OF THE DIGESTIVE SYSTEM,3,Major,Moderate,Surgical,Medicare,Blue Cross/Blue Shield,,,,Y,266545.75,56805.95
New York City,Manhattan,7002053,001463,NYU Langone Hospitals,50 to 69,112,M,Black/African American,Not Span/Hispanic,2,Elective,Home or Self Care,2020,NEO015,GASTROINTESTINAL CANCERS - COLORECTAL,GIS009,COLECTOMY,231,MAJOR LARGE BOWEL PROCEDURES,06,DISEASES AND DISORDERS OF THE DIGESTIVE SYSTEM,1,Minor,Minor,Surgical,Medicare,Private Health Insurance,,,,N,85326.79,15222.09
New York City,Manhattan,7002053,001463,NYU Langone Hospitals,50 to 69,117,M,White,Not Span/Hispanic,3,Elective,Home or Self Care,2020,NEO015,GASTROINTESTINAL CANCERS - COLORECTAL,GIS009,COLECTOMY,231,MAJOR LARGE BOWEL PROCEDURES,06,DISEASES AND DISORDERS OF THE DIGESTIVE SYSTEM,2,Moderate,Moderate,Surgical,Private Health Insurance,,,,,N,104532.11,18991.03
New York City,Manhattan,7002053,001463,NYU Langone Hospitals,50 to 69,103,F,White,Not Span/Hispanic,11,Emergency,Home w/ Home Health Services,2020,NEO015,GASTROINTESTINAL CANCERS - COLORECTAL,GIS009,COLECTOMY,231,MAJOR LARGE BOWEL PROCEDURES,06,DISEASES AND DISORDERS OF THE DIGESTIVE SYSTEM,4,Extreme,Major,Surgical,Medicaid,,,,,Y,219044.74,51363.7
New York City,Manhattan,7002053,001463,NYU Langone Hospitals,50 to 69,112,M,White,Not Span/Hispanic,5,Elective,Home or Self Care,2020,DIG013,DIVERTICULOSIS AND DIVERTICULITIS,GIS009,COLECTOMY,231,MAJOR LARGE BOWEL PROCEDURES,06,DISEASES AND DISORDERS OF THE DIGESTIVE SYSTEM,2,Moderate,Minor,Surgical,Private Health Insurance,,,,,N,141248.57,29030.38
New York City,Manhattan,7002053,001463,NYU Langone Hospitals,50 to 69,103,M,White,Not Span/Hispanic,2,Elective,Home or Self Care,2020,DIG013,DIVERTICULOSIS AND DIVERTICULITIS,GIS013,PROCTECTOMY OR ANAL RESECTION,231,MAJOR LARGE BOWEL PROCEDURES,06,DISEASES AND DISORDERS OF THE DIGESTIVE SYSTEM,2,Moderate,Minor,Surgical,Blue Cross/Blue Shield,,,,,N,130127.93,21370.9
New York City,Manhattan,7002053,001463,NYU Langone Hospitals,30 to 49,113,M,White,Unknown,2,Elective,Home or Self Care,2020,DIG013,DIVERTICULOSIS AND DIVERTICULITIS,GIS009,COLECTOMY,231,MAJOR LARGE BOWEL PROCEDURES,06,DISEASES AND DISORDERS OF THE DIGESTIVE SYSTEM,1,Minor,Minor,Surgical,Medicaid,,,,,N,123694.64,20574.23
New York City,Manhattan,7002053,001463,NYU Langone Hospitals,50 to 69,OOS,F,White,Not Span/Hispanic,2,Elective,Home or Self Care,2020,NEO015,GASTROINTESTINAL CANCERS - COLORECTAL,GIS009,COLECTOMY,231,MAJOR LARGE BOWEL PROCEDURES,06,DISEASES AND DISORDERS OF THE DIGESTIVE SYSTEM,1,Minor,Minor,Surgical,Private Health Insurance,,,,,N,145317.97,23894.93
New York City,Manhattan,7002053,001463,NYU Langone Hospitals,50 to 69,103,M,White,Not Span/Hispanic,1,Elective,Home or Self Care,2020,DIG013,DIVERTICULOSIS AND DIVERTICULITIS,GIS009,COLECTOMY,231,MAJOR LARGE BOWEL PROCEDURES,06,DISEASES AND DISORDERS OF THE DIGESTIVE SYSTEM,1,Minor,Minor,Surgical,Blue Cross/Blue Shield,,,,,N,186971.54,27449.85
New York City,Manhattan,7002053,001463,NYU Langone Hospitals,50 to 69,100,M,Other Race,Not Span/Hispanic,2,Elective,Home or Self Care,2020,NEO073,BENIGN NEOPLASMS,GIS009,COLECTOMY,231,MAJOR LARGE BOWEL PROCEDURES,06,DISEASES AND DISORDERS OF THE DIGESTIVE SYSTEM,1,Minor,Minor,Surgical,Private Health Insurance,,,,,N,154899.57,24858.07
New York City,Manhattan,7002053,001463,NYU Langone Hospitals,50 to 69,104,F,Other Race,Spanish/Hispanic,5,Elective,Home or Self Care,2020,DIG013,DIVERTICULOSIS AND DIVERTICULITIS,GIS009,COLECTOMY,231,MAJOR LARGE BOWEL PROCEDURES,06,DISEASES AND DISORDERS OF THE DIGESTIVE SYSTEM,2,Moderate,Moderate,Surgical,Private Health Insurance,,,,,N,183126.22,32984.46
New York City,Manhattan,7002053,001463,NYU Langone Hospitals,50 to 69,117,M,White,Not Span/Hispanic,6,Emergency,Home w/ Home Health Services,2020,DIG024,POSTPROCEDURAL OR POSTOPERATIVE DIGESTIVE SYSTEM COMPLICATION,GIS018,ILEOSTOMY AND COLOSTOMY,231,MAJOR LARGE BOWEL PROCEDURES,06,DISEASES AND DISORDERS OF THE DIGESTIVE SYSTEM,2,Moderate,Minor,Surgical,Private Health Insurance,,,,,Y,134780.28,29288.76
New York City,Manhattan,7002053,001463,NYU Langone Hospitals,50 to 69,104,M,Other Race,Spanish/Hispanic,3,Elective,Home or Self Care,2020,NEO015,GASTROINTESTINAL CANCERS - COLORECTAL,GIS009,COLECTOMY,231,MAJOR LARGE BOWEL PROCEDURES,06,DISEASES AND DISORDERS OF THE DIGESTIVE SYSTEM,1,Minor,Minor,Surgical,Private Health Insurance,,,,,N,98925.81,18947.19
New York City,Manhattan,7002053,001463,NYU Langone Hospitals,50 to 69,110,M,White,Not Span/Hispanic,2,Elective,Home or Self Care,2020,NEO073,BENIGN NEOPLASMS,GIS009,COLECTOMY,231,MAJOR LARGE BOWEL PROCEDURES,06,DISEASES AND DISORDERS OF THE DIGESTIVE SYSTEM,1,Minor,Minor,Surgical,Blue Cross/Blue Shield,,,,,N,168078.5,26949.06
New York City,Manhattan,7002053,001463,NYU Langone Hospitals,50 to 69,100,M,White,Not Span/Hispanic,1,Elective,Home or Self Care,2020,NEO073,BENIGN NEOPLASMS,GIS009,COLECTOMY,231,MAJOR LARGE BOWEL PROCEDURES,06,DISEASES AND DISORDERS OF THE DIGESTIVE SYSTEM,1,Minor,Minor,Surgical,Private Health Insurance,,,,,N,85804.17,14045.38
New York City,Manhattan,7002053,001463,NYU Langone Hospitals,50 to 69,100,F,White,Not Span/Hispanic,6,Elective,Home w/ Home Health Services,2020,NEO015,GASTROINTESTINAL CANCERS - COLORECTAL,GIS009,COLECTOMY,231,MAJOR LARGE BOWEL PROCEDURES,06,DISEASES AND DISORDERS OF THE DIGESTIVE SYSTEM,3,Major,Moderate,Surgical,Medicaid,,,,,N,253224.09,45538.47
New York City,Manhattan,7002053,001463,NYU Langone Hospitals,50 to 69,104,F,Other Race,Spanish/Hispanic,5,Emergency,Home w/ Home Health Services,2020,DIG025,OTHER SPECIFIED AND UNSPECIFIED GASTROINTESTINAL DISORDERS,GIS009,COLECTOMY,231,MAJOR LARGE BOWEL PROCEDURES,06,DISEASES AND DISORDERS OF THE DIGESTIVE SYSTEM,2,Moderate,Minor,Surgical,Medicaid,Medicaid,,,,N,128527.85,29742.61
New York City,Manhattan,7002053,001463,NYU Langone Hospitals,50 to 69,104,F,Black/African American,Not Span/Hispanic,8,Elective,Skilled Nursing Home,2020,NEO015,GASTROINTESTINAL CANCERS - COLORECTAL,GIS018,ILEOSTOMY AND COLOSTOMY,231,MAJOR LARGE BOWEL PROCEDURES,06,DISEASES AND DISORDERS OF THE DIGESTIVE SYSTEM,2,Moderate,Minor,Surgical,Medicaid,,,,,N,124773.64,33273.57
New York City,Manhattan,7002053,001463,NYU Langone Hospitals,50 to 69,113,F,Other Race,Spanish/Hispanic,6,Elective,Home or Self Care,2020,DIG013,DIVERTICULOSIS AND DIVERTICULITIS,GIS009,COLECTOMY,231,MAJOR LARGE BOWEL PROCEDURES,06,DISEASES AND DISORDERS OF THE DIGESTIVE SYSTEM,1,Minor,Minor,Surgical,Private Health Insurance,,,,,N,151549.96,32510.75
New York City,Manhattan,7002053,001463,NYU Langone Hospitals,30 to 49,109,F,White,Unknown,9,Elective,Home w/ Home Health Services,2020,DIG012,INTESTINAL OBSTRUCTION AND ILEUS,GIS009,COLECTOMY,231,MAJOR LARGE BOWEL PROCEDURES,06,DISEASES AND DISORDERS OF THE DIGESTIVE SYSTEM,3,Major,Moderate,Surgical,Medicaid,,,,,N,219573.91,48408.86
New York City,Manhattan,7002053,001463,NYU Langone Hospitals,70 or Older,OOS,M,White,Not Span/Hispanic,3,Elective,Home w/ Home Health Services,2020,NEO015,GASTROINTESTINAL CANCERS - COLORECTAL,GIS013,PROCTECTOMY OR ANAL RESECTION,231,MAJOR LARGE BOWEL PROCEDURES,06,DISEASES AND DISORDERS OF THE DIGESTIVE SYSTEM,1,Minor,Minor,Surgical,Medicaid,,,,,N,211474.29,34283.09
New York City,Manhattan,7002053,001463,NYU Langone Hospitals,50 to 69,100,F,Other Race,Spanish/Hispanic,22,Elective,Home w/ Home Health Services,2020,DIG013,DIVERTICULOSIS AND DIVERTICULITIS,GIS009,COLECTOMY,231,MAJOR LARGE BOWEL PROCEDURES,06,DISEASES AND DISORDERS OF THE DIGESTIVE SYSTEM,4,Extreme,Extreme,Surgical,Medicare,Blue Cross/Blue Shield,,,,N,631134.8,127686.14
New York City,Manhattan,7002053,001463,NYU Langone Hospitals,70 or Older,100,F,White,Unknown,4,Elective,Home or Self Care,2020,NEO015,GASTROINTESTINAL CANCERS - COLORECTAL,GIS009,COLECTOMY,231,MAJOR LARGE BOWEL PROCEDURES,06,DISEASES AND DISORDERS OF THE DIGESTIVE SYSTEM,2,Moderate,Moderate,Surgical,Medicare,Medicare,,,,N,144106.39,27635.15
New York City,Manhattan,7002053,001463,NYU Langone Hospitals,0 to 17,112,F,Other Race,Spanish/Hispanic,2,Elective,Home or Self Care,2020,MAL002,DIGESTIVE CONGENITAL ANOMALIES,GIS018,ILEOSTOMY AND COLOSTOMY,231,MAJOR LARGE BOWEL PROCEDURES,06,DISEASES AND DISORDERS OF THE DIGESTIVE SYSTEM,1,Minor,Minor,Surgical,Medicaid,,,,,N,82972.7,15761.86
New York City,Manhattan,7002053,001463,NYU Langone Hospitals,70 or Older,104,F,White,Not Span/Hispanic,6,Elective,Home or Self Care,2020,NEO070,SECONDARY MALIGNANCIES,GIS009,COLECTOMY,231,MAJOR LARGE BOWEL PROCEDURES,06,DISEASES AND DISORDERS OF THE DIGESTIVE SYSTEM,2,Moderate,Moderate,Surgical,Medicare,Blue Cross/Blue Shield,,,,N,231879.68,43496.08
New York City,Manhattan,7002053,001463,NYU Langone Hospitals,50 to 69,103,M,White,Not Span/Hispanic,3,Elective,Home or Self Care,2020,NEO015,GASTROINTESTINAL CANCERS - COLORECTAL,GIS009,COLECTOMY,231,MAJOR LARGE BOWEL PROCEDURES,06,DISEASES AND DISORDERS OF THE DIGESTIVE SYSTEM,1,Minor,Minor,Surgical,Private Health Insurance,,,,,N,154171.21,26751.42
New York City,Manhattan,7002053,001463,NYU Langone Hospitals,70 or Older,100,M,White,Not Span/Hispanic,5,Elective,Home or Self Care,2020,NEO015,GASTROINTESTINAL CANCERS - COLORECTAL,GIS009,COLECTOMY,231,MAJOR LARGE BOWEL PROCEDURES,06,DISEASES AND DISORDERS OF THE DIGESTIVE SYSTEM,2,Moderate,Minor,Surgical,Medicare,Medicare,,,,N,224840.39,38311.54
New York City,Manhattan,7002053,001463,NYU Langone Hospitals,30 to 49,OOS,F,Other Race,Not Span/Hispanic,3,Elective,Home or Self Care,2020,NEO015,GASTROINTESTINAL CANCERS - COLORECTAL,GIS009,COLECTOMY,231,MAJOR LARGE BOWEL PROCEDURES,06,DISEASES AND DISORDERS OF THE DIGESTIVE SYSTEM,1,Minor,Minor,Surgical,Private Health Insurance,,,,,N,145214.76,24686.51
New York City,Manhattan,7002053,001463,NYU Langone Hospitals,50 to 69,112,M,Other Race,Not Span/Hispanic,4,Elective,Home or Self Care,2020,NEO015,GASTROINTESTINAL CANCERS - COLORECTAL,GIS009,COLECTOMY,231,MAJOR LARGE BOWEL PROCEDURES,06,DISEASES AND DISORDERS OF THE DIGESTIVE SYSTEM,1,Minor,Minor,Surgical,Medicare,Medicare,,,,N,184164.12,32618.71
New York City,Manhattan,7002053,001463,NYU Langone Hospitals,18 to 29,112,M,White,Spanish/Hispanic,11,Emergency,Home w/ Home Health Services,2020,DIG011,REGIONAL ENTERITIS AND ULCERATIVE COLITIS,GIS009,COLECTOMY,231,MAJOR LARGE BOWEL PROCEDURES,06,DISEASES AND DISORDERS OF THE DIGESTIVE SYSTEM,4,Extreme,Moderate,Surgical,Private Health Insurance,,,,,Y,238351.29,54391.1
New York City,Manhattan,7002053,001463,NYU Langone Hospitals,70 or Older,113,F,White,Not Span/Hispanic,4,Elective,Home or Self Care,2020,NEO015,GASTROINTESTINAL CANCERS - COLORECTAL,GIS009,COLECTOMY,231,MAJOR LARGE BOWEL PROCEDURES,06,DISEASES AND DISORDERS OF THE DIGESTIVE SYSTEM,1,Minor,Minor,Surgical,Medicare,Private Health Insurance,,,,N,127400.02,25340.03
New York City,Manhattan,7002053,001463,NYU Langone Hospitals,50 to 69,113,F,White,Unknown,4,Elective,Home or Self Care,2020,NEO015,GASTROINTESTINAL CANCERS - COLORECTAL,GIS009,COLECTOMY,231,MAJOR LARGE BOWEL PROCEDURES,06,DISEASES AND DISORDERS OF THE DIGESTIVE SYSTEM,1,Minor,Minor,Surgical,Private Health Insurance,,,,,N,116892.31,23236.51
New York City,Manhattan,7002053,001463,NYU Langone Hospitals,70 or Older,113,F,White,Not Span/Hispanic,5,Elective,Home w/ Home Health Services,2020,NEO015,GASTROINTESTINAL CANCERS - COLORECTAL,GIS009,COLECTOMY,231,MAJOR LARGE BOWEL PROCEDURES,06,DISEASES AND DISORDERS OF THE DIGESTIVE SYSTEM,2,Moderate,Moderate,Surgical,Medicare,Medicaid,,,,N,247751.5,44346.53
New York City,Manhattan,7002053,001463,NYU Langone Hospitals,50 to 69,104,F,Black/African American,Not Span/Hispanic,14,Emergency,Home w/ Home Health Services,2020,DIG010,ABDOMINAL HERNIA,GIS009,COLECTOMY,231,MAJOR LARGE BOWEL PROCEDURES,06,DISEASES AND DISORDERS OF THE DIGESTIVE SYSTEM,2,Moderate,Minor,Surgical,Private Health Insurance,,,,,Y,341023.4,75820.21
New York City,Manhattan,7002053,001463,NYU Langone Hospitals,70 or Older,100,F,White,Not Span/Hispanic,7,Emergency,Home w/ Home Health Services,2020,DIG012,INTESTINAL OBSTRUCTION AND ILEUS,GIS009,COLECTOMY,231,MAJOR LARGE BOWEL PROCEDURES,06,DISEASES AND DISORDERS OF THE DIGESTIVE SYSTEM,4,Extreme,Major,Surgical,Medicare,Blue Cross/Blue Shield,,,,Y,167680.4,36636.06
New York City,Manhattan,7002053,001463,NYU Langone Hospitals,50 to 69,105,F,Other Race,Spanish/Hispanic,2,Elective,Home or Self Care,2020,DIG013,DIVERTICULOSIS AND DIVERTICULITIS,GIS013,PROCTECTOMY OR ANAL RESECTION,231,MAJOR LARGE BOWEL PROCEDURES,06,DISEASES AND DISORDERS OF THE DIGESTIVE SYSTEM,1,Minor,Minor,Surgical,Private Health Insurance,,,,,N,178673.71,28538.88
New York City,Manhattan,7002053,001463,NYU Langone Hospitals,70 or Older,112,F,White,Not Span/Hispanic,1,Elective,Home or Self Care,2020,DIG015,ANAL AND RECTAL CONDITIONS,GIS028,"LOWER GI THERAPEUTIC PROCEDURES, NEC (OPEN AND LAPAROSCOPIC)",231,MAJOR LARGE BOWEL PROCEDURES,06,DISEASES AND DISORDERS OF THE DIGESTIVE SYSTEM,2,Moderate,Minor,Surgical,Medicare,Medicare,,,,N,85661.02,13605.7
New York City,Manhattan,7002053,001463,NYU Langone Hospitals,50 to 69,109,M,Other Race,Unknown,3,Elective,Home or Self Care,2020,DIG013,DIVERTICULOSIS AND DIVERTICULITIS,GIS009,COLECTOMY,231,MAJOR LARGE BOWEL PROCEDURES,06,DISEASES AND DISORDERS OF THE DIGESTIVE SYSTEM,1,Minor,Minor,Surgical,Blue Cross/Blue Shield,,,,,N,184273.78,31272.29
New York City,Manhattan,7002053,001463,NYU Langone Hospitals,50 to 69,112,M,Other Race,Not Span/Hispanic,2,Elective,Home or Self Care,2020,DIG013,DIVERTICULOSIS AND DIVERTICULITIS,GIS009,COLECTOMY,231,MAJOR LARGE BOWEL PROCEDURES,06,DISEASES AND DISORDERS OF THE DIGESTIVE SYSTEM,1,Minor,Minor,Surgical,Private Health Insurance,,,,,N,110297.63,18683.43
New York City,Manhattan,7002053,001463,NYU Langone Hospitals,50 to 69,112,F,White,Not Span/Hispanic,4,Emergency,Home or Self Care,2020,DIG012,INTESTINAL OBSTRUCTION AND ILEUS,GIS009,COLECTOMY,231,MAJOR LARGE BOWEL PROCEDURES,06,DISEASES AND DISORDERS OF THE DIGESTIVE SYSTEM,1,Minor,Minor,Surgical,Medicare,Medicaid,,,,Y,132702.44,25609.44
New York City,Manhattan,7002053,001463,NYU Langone Hospitals,50 to 69,OOS,M,Other Race,Spanish/Hispanic,4,Elective,Home or Self Care,2020,NEO015,GASTROINTESTINAL CANCERS - COLORECTAL,GIS009,COLECTOMY,231,MAJOR LARGE BOWEL PROCEDURES,06,DISEASES AND DISORDERS OF THE DIGESTIVE SYSTEM,2,Moderate,Moderate,Surgical,Blue Cross/Blue Shield,,,,,N,178167.78,31577.51
New York City,Manhattan,7002053,001463,NYU Langone Hospitals,50 to 69,113,M,Other Race,Spanish/Hispanic,3,Elective,Home or Self Care,2020,NEO015,GASTROINTESTINAL CANCERS - COLORECTAL,GIS013,PROCTECTOMY OR ANAL RESECTION,231,MAJOR LARGE BOWEL PROCEDURES,06,DISEASES AND DISORDERS OF THE DIGESTIVE SYSTEM,1,Minor,Minor,Surgical,Blue Cross/Blue Shield,,,,,N,132970.25,23275.04
New York City,Manhattan,7002053,001463,NYU Langone Hospitals,50 to 69,,F,White,Spanish/Hispanic,6,Elective,Home w/ Home Health Services,2020,FAC010,OTHER AFTERCARE ENCOUNTER,GIS009,COLECTOMY,231,MAJOR LARGE BOWEL PROCEDURES,06,DISEASES AND DISORDERS OF THE DIGESTIVE SYSTEM,2,Moderate,Minor,Surgical,Blue Cross/Blue Shield,,,,,N,174808.13,34878.1
New York City,Manhattan,7002053,001463,NYU Langone Hospitals,50 to 69,114,F,White,Not Span/Hispanic,9,Elective,Home or Self Care,2020,FAC010,OTHER AFTERCARE ENCOUNTER,GIS009,COLECTOMY,231,MAJOR LARGE BOWEL PROCEDURES,06,DISEASES AND DISORDERS OF THE DIGESTIVE SYSTEM,2,Moderate,Moderate,Surgical,Medicare,Medicaid,,,,N,183438.9,43234.12
New York City,Manhattan,7002053,001463,NYU Langone Hospitals,70 or Older,103,M,White,Not Span/Hispanic,5,Elective,Home w/ Home Health Services,2020,NEO015,GASTROINTESTINAL CANCERS - COLORECTAL,GIS009,COLECTOMY,231,MAJOR LARGE BOWEL PROCEDURES,06,DISEASES AND DISORDERS OF THE DIGESTIVE SYSTEM,2,Moderate,Moderate,Surgical,Medicare,Blue Cross/Blue Shield,,,,N,164949.55,30721.78
New York City,Manhattan,7002053,001463,NYU Langone Hospitals,50 to 69,104,M,Other Race,Spanish/Hispanic,5,Elective,Home or Self Care,2020,DIG013,DIVERTICULOSIS AND DIVERTICULITIS,GIS009,COLECTOMY,231,MAJOR LARGE BOWEL PROCEDURES,06,DISEASES AND DISORDERS OF THE DIGESTIVE SYSTEM,1,Minor,Minor,Surgical,Medicaid,,,,,N,159983.65,31726.11
New York City,Manhattan,7002053,001463,NYU Langone Hospitals,30 to 49,100,M,Other Race,Not Span/Hispanic,5,Elective,Home or Self Care,2020,DIG025,OTHER SPECIFIED AND UNSPECIFIED GASTROINTESTINAL DISORDERS,GIS009,COLECTOMY,231,MAJOR LARGE BOWEL PROCEDURES,06,DISEASES AND DISORDERS OF THE DIGESTIVE SYSTEM,2,Moderate,Minor,Surgical,Medicaid,,,,,N,197869.92,36280.63
New York City,Manhattan,7002053,001463,NYU Langone Hospitals,50 to 69,103,F,Other Race,Not Span/Hispanic,2,Elective,Home w/ Home Health Services,2020,DIG024,POSTPROCEDURAL OR POSTOPERATIVE DIGESTIVE SYSTEM COMPLICATION,GIS018,ILEOSTOMY AND COLOSTOMY,231,MAJOR LARGE BOWEL PROCEDURES,06,DISEASES AND DISORDERS OF THE DIGESTIVE SYSTEM,1,Minor,Minor,Surgical,Medicaid,,,,,N,92407.16,15890.56
New York City,Manhattan,7002053,001463,NYU Langone Hospitals,50 to 69,OOS,F,White,Not Span/Hispanic,16,Emergency,Hospice - Home,2020,NEO070,SECONDARY MALIGNANCIES,GIS018,ILEOSTOMY AND COLOSTOMY,231,MAJOR LARGE BOWEL PROCEDURES,06,DISEASES AND DISORDERS OF THE DIGESTIVE SYSTEM,3,Major,Major,Surgical,Private Health Insurance,,,,,Y,352461.49,63179.96
New York City,Manhattan,7002053,001463,NYU Langone Hospitals,70 or Older,100,F,White,Not Span/Hispanic,3,Elective,Home or Self Care,2020,NEO015,GASTROINTESTINAL CANCERS - COLORECTAL,GIS009,COLECTOMY,231,MAJOR LARGE BOWEL PROCEDURES,06,DISEASES AND DISORDERS OF THE DIGESTIVE SYSTEM,1,Minor,Minor,Surgical,Medicare,Medicare,,,,N,147836.84,25264.69
New York City,Manhattan,7002053,001463,NYU Langone Hospitals,50 to 69,111,F,White,Not Span/Hispanic,13,Elective,Home w/ Home Health Services,2020,DIG024,POSTPROCEDURAL OR POSTOPERATIVE DIGESTIVE SYSTEM COMPLICATION,GIS022,GI SYSTEM LYSIS OF ADHESIONS,231,MAJOR LARGE BOWEL PROCEDURES,06,DISEASES AND DISORDERS OF THE DIGESTIVE SYSTEM,4,Extreme,Extreme,Surgical,Medicare,,,,,N,325325.7,96046.14
New York City,Manhattan,7002053,001463,NYU Langone Hospitals,18 to 29,112,M,White,Not Span/Hispanic,4,Elective,Home or Self Care,2020,DIG011,REGIONAL ENTERITIS AND ULCERATIVE COLITIS,GIS003,GI SYSTEM BIOPSY (NON-ENDOSCOPIC),231,MAJOR LARGE BOWEL PROCEDURES,06,DISEASES AND DISORDERS OF THE DIGESTIVE SYSTEM,1,Minor,Minor,Surgical,Medicaid,,,,,N,106208.45,22433.34
New York City,Manhattan,7002053,001463,NYU Langone Hospitals,0 to 17,104,F,Other Race,Spanish/Hispanic,4,Elective,Home or Self Care,2020,MAL002,DIGESTIVE CONGENITAL ANOMALIES,GIS028,"LOWER GI THERAPEUTIC PROCEDURES, NEC (OPEN AND LAPAROSCOPIC)",231,MAJOR LARGE BOWEL PROCEDURES,06,DISEASES AND DISORDERS OF THE DIGESTIVE SYSTEM,3,Major,Moderate,Surgical,Medicaid,,,,,N,73545.54,19426.87
New York City,Manhattan,7002053,001463,NYU Langone Hospitals,30 to 49,112,M,White,Not Span/Hispanic,2,Elective,Home or Self Care,2020,NEO073,BENIGN NEOPLASMS,GIS009,COLECTOMY,231,MAJOR LARGE BOWEL PROCEDURES,06,DISEASES AND DISORDERS OF THE DIGESTIVE SYSTEM,1,Minor,Minor,Surgical,Medicaid,,,,,N,160504.46,25716.26
New York City,Manhattan,7002053,001463,NYU Langone Hospitals,70 or Older,100,F,White,Not Span/Hispanic,3,Elective,Home w/ Home Health Services,2020,NEO015,GASTROINTESTINAL CANCERS - COLORECTAL,GIS009,COLECTOMY,231,MAJOR LARGE BOWEL PROCEDURES,06,DISEASES AND DISORDERS OF THE DIGESTIVE SYSTEM,1,Minor,Minor,Surgical,Medicare,Blue Cross/Blue Shield,,,,N,141656.22,24691.99
New York City,Manhattan,7002053,001463,NYU Langone Hospitals,70 or Older,112,F,White,Not Span/Hispanic,7,Elective,Skilled Nursing Home,2020,NEO015,GASTROINTESTINAL CANCERS - COLORECTAL,GIS009,COLECTOMY,231,MAJOR LARGE BOWEL PROCEDURES,06,DISEASES AND DISORDERS OF THE DIGESTIVE SYSTEM,2,Moderate,Minor,Surgical,Medicare,Medicaid,,,,N,256154.33,47490.6
New York City,Manhattan,7002053,001463,NYU Langone Hospitals,30 to 49,100,M,White,Not Span/Hispanic,3,Emergency,Home or Self Care,2020,NEO073,BENIGN NEOPLASMS,GIS009,COLECTOMY,231,MAJOR LARGE BOWEL PROCEDURES,06,DISEASES AND DISORDERS OF THE DIGESTIVE SYSTEM,2,Moderate,Minor,Surgical,Blue Cross/Blue Shield,,,,,Y,187441.28,31759.6
New York City,Manhattan,7002053,001463,NYU Langone Hospitals,50 to 69,113,F,Other Race,Not Span/Hispanic,2,Elective,Home or Self Care,2020,NEO015,GASTROINTESTINAL CANCERS - COLORECTAL,GIS009,COLECTOMY,231,MAJOR LARGE BOWEL PROCEDURES,06,DISEASES AND DISORDERS OF THE DIGESTIVE SYSTEM,1,Minor,Minor,Surgical,Medicaid,,,,,N,195588.69,30871.73
New York City,Manhattan,7002053,001463,NYU Langone Hospitals,70 or Older,112,F,White,Not Span/Hispanic,3,Elective,Home or Self Care,2020,NEO015,GASTROINTESTINAL CANCERS - COLORECTAL,GIS009,COLECTOMY,231,MAJOR LARGE BOWEL PROCEDURES,06,DISEASES AND DISORDERS OF THE DIGESTIVE SYSTEM,1,Minor,Minor,Surgical,Medicare,Medicare,,,,N,139563.86,24966.95
New York City,Manhattan,7002053,001463,NYU Langone Hospitals,70 or Older,112,F,White,Not Span/Hispanic,5,Emergency,Home w/ Home Health Services,2020,DIG010,ABDOMINAL HERNIA,GIS009,COLECTOMY,231,MAJOR LARGE BOWEL PROCEDURES,06,DISEASES AND DISORDERS OF THE DIGESTIVE SYSTEM,2,Moderate,Moderate,Surgical,Blue Cross/Blue Shield,Medicare,,,,Y,141346.53,29312.72
New York City,Manhattan,7002053,001463,NYU Langone Hospitals,30 to 49,111,F,Other Race,Not Span/Hispanic,4,Elective,Home or Self Care,2020,NEO015,GASTROINTESTINAL CANCERS - COLORECTAL,GIS009,COLECTOMY,231,MAJOR LARGE BOWEL PROCEDURES,06,DISEASES AND DISORDERS OF THE DIGESTIVE SYSTEM,1,Minor,Moderate,Surgical,Blue Cross/Blue Shield,,,,,N,118472.17,23335.83
New York City,Manhattan,7002053,001463,NYU Langone Hospitals,50 to 69,115,F,White,Not Span/Hispanic,3,Elective,Home or Self Care,2020,DIG013,DIVERTICULOSIS AND DIVERTICULITIS,GIS009,COLECTOMY,231,MAJOR LARGE BOWEL PROCEDURES,06,DISEASES AND DISORDERS OF THE DIGESTIVE SYSTEM,2,Moderate,Minor,Surgical,Private Health Insurance,,,,,N,163724.28,28023.33
New York City,Manhattan,7002053,001463,NYU Langone Hospitals,50 to 69,104,F,Other Race,Spanish/Hispanic,3,Elective,Home w/ Home Health Services,2020,DIG013,DIVERTICULOSIS AND DIVERTICULITIS,GIS009,COLECTOMY,231,MAJOR LARGE BOWEL PROCEDURES,06,DISEASES AND DISORDERS OF THE DIGESTIVE SYSTEM,3,Major,Moderate,Surgical,Private Health Insurance,,,,,N,198954.62,33024.46
New York City,Manhattan,7002053,001463,NYU Langone Hospitals,50 to 69,112,M,White,Not Span/Hispanic,3,Elective,Home or Self Care,2020,FAC010,OTHER AFTERCARE ENCOUNTER,GIS013,PROCTECTOMY OR ANAL RESECTION,231,MAJOR LARGE BOWEL PROCEDURES,06,DISEASES AND DISORDERS OF THE DIGESTIVE SYSTEM,2,Moderate,Minor,Surgical,Medicaid,,,,,N,161635.54,27858.56