Hospital Service Area,Hospital County,Operating Certificate Number,Permanent Facility Id,Facility Name,Age Group,Zip Code - 3 digits,Gender,Race,Ethnicity,Length of Stay,Type of Admission,Patient Disposition,Discharge Year,CCS Diagnosis Code,CCS Diagnosis Description,CCS Procedure Code,CCS Procedure Description,APR DRG Code,APR DRG Description,APR MDC Code,APR MDC Description,APR Severity of Illness Code,APR Severity of Illness Description,APR Risk of Mortality,APR Medical Surgical Description,Payment Typology 1,Payment Typology 2,Payment Typology 3,Birth Weight,Abortion Edit Indicator,Emergency Department Indicator,Total Charges,Total Costs
New York City,Manhattan,7002001,001438,Bellevue Hospital Center,18 to 29,100,M,Other Race,Not Span/Hispanic,1,Emergency,Home or Self Care,2020,DIG009,APPENDICITIS AND OTHER APPENDICEAL CONDITIONS,GIS008,APPENDECTOMY,233,APPENDECTOMY WITH COMPLEX PRINCIPAL DIAGNOSIS,06,DISEASES AND DISORDERS OF THE DIGESTIVE SYSTEM,1,Minor,Minor,Surgical,Medicaid,,,,,Y,22484.99,12930.76
New York City,Manhattan,7002001,001438,Bellevue Hospital Center,50 to 69,100,F,Other Race,Not Span/Hispanic,1,Emergency,Home or Self Care,2020,DIG009,APPENDICITIS AND OTHER APPENDICEAL CONDITIONS,GIS008,APPENDECTOMY,233,APPENDECTOMY WITH COMPLEX PRINCIPAL DIAGNOSIS,06,DISEASES AND DISORDERS OF THE DIGESTIVE SYSTEM,1,Minor,Minor,Surgical,Medicaid,,,,,Y,24125.9,13874.42
New York City,Manhattan,7002001,001438,Bellevue Hospital Center,18 to 29,112,M,Other Race,Spanish/Hispanic,3,Emergency,Home or Self Care,2020,DIG009,APPENDICITIS AND OTHER APPENDICEAL CONDITIONS,GIS008,APPENDECTOMY,233,APPENDECTOMY WITH COMPLEX PRINCIPAL DIAGNOSIS,06,DISEASES AND DISORDERS OF THE DIGESTIVE SYSTEM,4,Extreme,Major,Surgical,Medicaid,,,,,Y,55479.43,31905.33
New York City,Manhattan,7002001,001438,Bellevue Hospital Center,0 to 17,100,M,Other Race,Spanish/Hispanic,8,Emergency,Home or Self Care,2020,DIG009,APPENDICITIS AND OTHER APPENDICEAL CONDITIONS,GIS008,APPENDECTOMY,233,APPENDECTOMY WITH COMPLEX PRINCIPAL DIAGNOSIS,06,DISEASES AND DISORDERS OF THE DIGESTIVE SYSTEM,2,Moderate,Minor,Surgical,Medicaid,,,,,Y,74474.99,42829.38
New York City,Manhattan,7002001,001438,Bellevue Hospital Center,0 to 17,112,F,Other Race,Spanish/Hispanic,13,Emergency,Home or Self Care,2020,DIG009,APPENDICITIS AND OTHER APPENDICEAL CONDITIONS,GIS008,APPENDECTOMY,233,APPENDECTOMY WITH COMPLEX PRINCIPAL DIAGNOSIS,06,DISEASES AND DISORDERS OF THE DIGESTIVE SYSTEM,2,Moderate,Moderate,Surgical,Medicaid,,,,,Y,110322.24,63444.56
New York City,Manhattan,7002001,001438,Bellevue Hospital Center,0 to 17,113,M,Other Race,Not Span/Hispanic,9,Elective,Home or Self Care,2020,DIG009,APPENDICITIS AND OTHER APPENDICEAL CONDITIONS,GIS008,APPENDECTOMY,233,APPENDECTOMY WITH COMPLEX PRINCIPAL DIAGNOSIS,06,DISEASES AND DISORDERS OF THE DIGESTIVE SYSTEM,1,Minor,Minor,Surgical,Self-Pay,,,,,Y,63999.74,36805.23
New York City,Manhattan,7002001,001438,Bellevue Hospital Center,0 to 17,112,M,Other Race,Unknown,13,Emergency,Home or Self Care,2020,DIG009,APPENDICITIS AND OTHER APPENDICEAL CONDITIONS,GIS008,APPENDECTOMY,233,APPENDECTOMY WITH COMPLEX PRINCIPAL DIAGNOSIS,06,DISEASES AND DISORDERS OF THE DIGESTIVE SYSTEM,3,Major,Major,Surgical,Medicaid,,,,,Y,93065.19,53520.3
New York City,Manhattan,7002001,001438,Bellevue Hospital Center,30 to 49,100,F,White,Spanish/Hispanic,4,Emergency,Home or Self Care,2020,DIG009,APPENDICITIS AND OTHER APPENDICEAL CONDITIONS,GIS008,APPENDECTOMY,233,APPENDECTOMY WITH COMPLEX PRINCIPAL DIAGNOSIS,06,DISEASES AND DISORDERS OF THE DIGESTIVE SYSTEM,1,Minor,Minor,Surgical,Medicaid,,,,,Y,46175.39,26554.73
New York City,Manhattan,7002001,001438,Bellevue Hospital Center,50 to 69,113,M,Other Race,Spanish/Hispanic,2,Emergency,Home or Self Care,2020,DIG009,APPENDICITIS AND OTHER APPENDICEAL CONDITIONS,GIS008,APPENDECTOMY,233,APPENDECTOMY WITH COMPLEX PRINCIPAL DIAGNOSIS,06,DISEASES AND DISORDERS OF THE DIGESTIVE SYSTEM,1,Minor,Minor,Surgical,Medicaid,,,,,Y,34665.38,19935.51
New York City,Manhattan,7002001,001438,Bellevue Hospital Center,18 to 29,111,F,Other Race,Unknown,2,Emergency,Home or Self Care,2020,DIG009,APPENDICITIS AND OTHER APPENDICEAL CONDITIONS,GIS008,APPENDECTOMY,233,APPENDECTOMY WITH COMPLEX PRINCIPAL DIAGNOSIS,06,DISEASES AND DISORDERS OF THE DIGESTIVE SYSTEM,3,Major,Moderate,Surgical,Private Health Insurance,,,,,Y,34435.36,19803.22
New York City,Manhattan,7002001,001438,Bellevue Hospital Center,30 to 49,113,M,Other Race,Spanish/Hispanic,1,Emergency,Home or Self Care,2020,DIG009,APPENDICITIS AND OTHER APPENDICEAL CONDITIONS,GIS008,APPENDECTOMY,233,APPENDECTOMY WITH COMPLEX PRINCIPAL DIAGNOSIS,06,DISEASES AND DISORDERS OF THE DIGESTIVE SYSTEM,2,Moderate,Moderate,Surgical,Private Health Insurance,,,,,Y,24810.39,14268.06
New York City,Manhattan,7002001,001438,Bellevue Hospital Center,70 or Older,100,F,Other Race,Not Span/Hispanic,2,Emergency,Home or Self Care,2020,DIG009,APPENDICITIS AND OTHER APPENDICEAL CONDITIONS,GIS008,APPENDECTOMY,233,APPENDECTOMY WITH COMPLEX PRINCIPAL DIAGNOSIS,06,DISEASES AND DISORDERS OF THE DIGESTIVE SYSTEM,1,Minor,Minor,Surgical,Medicaid,,,,,Y,31347.64,18027.53
New York City,Manhattan,7002001,001438,Bellevue Hospital Center,50 to 69,100,F,Other Race,Unknown,9,Emergency,Home or Self Care,2020,DIG009,APPENDICITIS AND OTHER APPENDICEAL CONDITIONS,GIS008,APPENDECTOMY,233,APPENDECTOMY WITH COMPLEX PRINCIPAL DIAGNOSIS,06,DISEASES AND DISORDERS OF THE DIGESTIVE SYSTEM,2,Moderate,Minor,Surgical,Medicare,Medicaid,,,,Y,83518.86,48030.36
New York City,Manhattan,7002001,001438,Bellevue Hospital Center,0 to 17,100,M,Other Race,Spanish/Hispanic,6,Emergency,Home or Self Care,2020,DIG009,APPENDICITIS AND OTHER APPENDICEAL CONDITIONS,GIS008,APPENDECTOMY,233,APPENDECTOMY WITH COMPLEX PRINCIPAL DIAGNOSIS,06,DISEASES AND DISORDERS OF THE DIGESTIVE SYSTEM,2,Moderate,Moderate,Surgical,Medicaid,,,,,Y,63891.78,36743.14
New York City,Manhattan,7002001,001438,Bellevue Hospital Center,0 to 17,112,M,Other Race,Spanish/Hispanic,1,Emergency,Home or Self Care,2020,DIG009,APPENDICITIS AND OTHER APPENDICEAL CONDITIONS,GIS008,APPENDECTOMY,233,APPENDECTOMY WITH COMPLEX PRINCIPAL DIAGNOSIS,06,DISEASES AND DISORDERS OF THE DIGESTIVE SYSTEM,1,Minor,Minor,Surgical,Private Health Insurance,,,,,Y,25767.35,14818.39
New York City,Manhattan,7002001,001438,Bellevue Hospital Center,0 to 17,114,F,Other Race,Spanish/Hispanic,1,Emergency,Home or Self Care,2020,DIG009,APPENDICITIS AND OTHER APPENDICEAL CONDITIONS,GIS008,APPENDECTOMY,233,APPENDECTOMY WITH COMPLEX PRINCIPAL DIAGNOSIS,06,DISEASES AND DISORDERS OF THE DIGESTIVE SYSTEM,2,Moderate,Minor,Surgical,Medicaid,,,,,Y,22940.76,13192.86
New York City,Manhattan,7002001,001438,Bellevue Hospital Center,50 to 69,100,F,Other Race,Unknown,1,Elective,Home or Self Care,2020,DIG009,APPENDICITIS AND OTHER APPENDICEAL CONDITIONS,GIS008,APPENDECTOMY,233,APPENDECTOMY WITH COMPLEX PRINCIPAL DIAGNOSIS,06,DISEASES AND DISORDERS OF THE DIGESTIVE SYSTEM,1,Minor,Minor,Surgical,Medicare,Medicaid,,,,N,26782.81,15402.37
New York City,Manhattan,7002001,001438,Bellevue Hospital Center,0 to 17,,F,Other Race,Unknown,4,Emergency,Home or Self Care,2020,DIG009,APPENDICITIS AND OTHER APPENDICEAL CONDITIONS,GIS008,APPENDECTOMY,233,APPENDECTOMY WITH COMPLEX PRINCIPAL DIAGNOSIS,06,DISEASES AND DISORDERS OF THE DIGESTIVE SYSTEM,1,Minor,Minor,Surgical,Private Health Insurance,,,,,Y,44008.85,25308.79
New York City,Manhattan,7002001,001438,Bellevue Hospital Center,0 to 17,112,M,White,Not Span/Hispanic,2,Emergency,Home or Self Care,2020,DIG009,APPENDICITIS AND OTHER APPENDICEAL CONDITIONS,GIS008,APPENDECTOMY,233,APPENDECTOMY WITH COMPLEX PRINCIPAL DIAGNOSIS,06,DISEASES AND DISORDERS OF THE DIGESTIVE SYSTEM,2,Moderate,Moderate,Surgical,Private Health Insurance,,,,,Y,24532.72,14108.37
New York City,Manhattan,7002001,001438,Bellevue Hospital Center,30 to 49,112,F,Other Race,Not Span/Hispanic,1,Emergency,Home or Self Care,2020,DIG009,APPENDICITIS AND OTHER APPENDICEAL CONDITIONS,GIS008,APPENDECTOMY,233,APPENDECTOMY WITH COMPLEX PRINCIPAL DIAGNOSIS,06,DISEASES AND DISORDERS OF THE DIGESTIVE SYSTEM,1,Minor,Minor,Surgical,Private Health Insurance,,,,,Y,27477.5,15801.87
New York City,Manhattan,7002001,001438,Bellevue Hospital Center,0 to 17,112,F,Other Race,Not Span/Hispanic,3,Emergency,Home or Self Care,2020,DIG009,APPENDICITIS AND OTHER APPENDICEAL CONDITIONS,GIS008,APPENDECTOMY,233,APPENDECTOMY WITH COMPLEX PRINCIPAL DIAGNOSIS,06,DISEASES AND DISORDERS OF THE DIGESTIVE SYSTEM,1,Minor,Minor,Surgical,Medicaid,,,,,Y,32387.72,18625.66
New York City,Manhattan,7002001,001438,Bellevue Hospital Center,18 to 29,113,M,Other Race,Spanish/Hispanic,1,Emergency,Home or Self Care,2020,DIG009,APPENDICITIS AND OTHER APPENDICEAL CONDITIONS,GIS008,APPENDECTOMY,233,APPENDECTOMY WITH COMPLEX PRINCIPAL DIAGNOSIS,06,DISEASES AND DISORDERS OF THE DIGESTIVE SYSTEM,1,Minor,Minor,Surgical,Medicaid,,,,,Y,24119.99,13871.02
New York City,Manhattan,7002001,001438,Bellevue Hospital Center,70 or Older,114,M,White,Unknown,6,Emergency,Home or Self Care,2020,DIG009,APPENDICITIS AND OTHER APPENDICEAL CONDITIONS,GIS008,APPENDECTOMY,233,APPENDECTOMY WITH COMPLEX PRINCIPAL DIAGNOSIS,06,DISEASES AND DISORDERS OF THE DIGESTIVE SYSTEM,3,Major,Moderate,Surgical,Medicaid,,,,,Y,62806.13,36118.8
