Hospital Service Area,Hospital County,Operating Certificate Number,Permanent Facility Id,Facility Name,Age Group,Zip Code - 3 digits,Gender,Race,Ethnicity,Length of Stay,Type of Admission,Patient Disposition,Discharge Year,CCS Diagnosis Code,CCS Diagnosis Description,CCS Procedure Code,CCS Procedure Description,APR DRG Code,APR DRG Description,APR MDC Code,APR MDC Description,APR Severity of Illness Code,APR Severity of Illness Description,APR Risk of Mortality,APR Medical Surgical Description,Payment Typology 1,Payment Typology 2,Payment Typology 3,Birth Weight,Abortion Edit Indicator,Emergency Department Indicator,Total Charges,Total Costs
Hudson Valley,Westchester,5902001,001045,White Plains Hospital Center,0 to 17,106,M,Other Race,Not Span/Hispanic,4,Emergency,Home or Self Care,2019,DIG009,APPENDICITIS AND OTHER APPENDICEAL CONDITIONS,GIS008,APPENDECTOMY,234,APPENDECTOMY WITHOUT COMPLEX PRINCIPAL DIAGNOSIS,06,DISEASES AND DISORDERS OF THE DIGESTIVE SYSTEM,1,Minor,Minor,Surgical,Medicaid,,,,,true,52276,7224.46
New York City,Manhattan,7002001,001438,Bellevue Hospital Center,18 to 29,104,M,Other Race,Spanish/Hispanic,1,Emergency,Home or Self Care,2019,DIG009,APPENDICITIS AND OTHER APPENDICEAL CONDITIONS,GIS008,APPENDECTOMY,234,APPENDECTOMY WITHOUT COMPLEX PRINCIPAL DIAGNOSIS,06,DISEASES AND DISORDERS OF THE DIGESTIVE SYSTEM,1,Minor,Minor,Surgical,Medicaid,,,,,true,5207.76,3461.08
New York City,Kings,7001016,001301,Kings County Hospital Center,30 to 49,112,F,Other Race,Spanish/Hispanic,1,Emergency,Home or Self Care,2019,DIG009,APPENDICITIS AND OTHER APPENDICEAL CONDITIONS,GIS008,APPENDECTOMY,234,APPENDECTOMY WITHOUT COMPLEX PRINCIPAL DIAGNOSIS,06,DISEASES AND DISORDERS OF THE DIGESTIVE SYSTEM,1,Minor,Minor,Surgical,Private Health Insurance,,,,,true,9213.53,6544.93
New York City,Kings,7001016,001301,Kings County Hospital Center,50 to 69,112,F,Black/African American,Not Span/Hispanic,1,Emergency,Home or Self Care,2019,DIG009,APPENDICITIS AND OTHER APPENDICEAL CONDITIONS,GIS008,APPENDECTOMY,234,APPENDECTOMY WITHOUT COMPLEX PRINCIPAL DIAGNOSIS,06,DISEASES AND DISORDERS OF THE DIGESTIVE SYSTEM,1,Minor,Minor,Surgical,Private Health Insurance,,,,,true,28752.33,20424.53
New York City,Manhattan,7002017,001450,Lenox Hill Hospital,18 to 29,100,F,White,Not Span/Hispanic,1,Emergency,Home or Self Care,2019,DIG009,APPENDICITIS AND OTHER APPENDICEAL CONDITIONS,GIS008,APPENDECTOMY,234,APPENDECTOMY WITHOUT COMPLEX PRINCIPAL DIAGNOSIS,06,DISEASES AND DISORDERS OF THE DIGESTIVE SYSTEM,1,Minor,Minor,Surgical,Blue Cross/Blue Shield,,,,,true,44269.19,10711.95
Central NY,Tompkins,5401001,000977,Cayuga Medical Center at Ithaca,18 to 29,,M,Black/African American,Not Span/Hispanic,1,Emergency,Home or Self Care,2019,DIG009,APPENDICITIS AND OTHER APPENDICEAL CONDITIONS,GIS008,APPENDECTOMY,234,APPENDECTOMY WITHOUT COMPLEX PRINCIPAL DIAGNOSIS,06,DISEASES AND DISORDERS OF THE DIGESTIVE SYSTEM,1,Minor,Minor,Surgical,Private Health Insurance,Medicaid,Self-Pay,,,true,10377.21,5670.49
New York City,Bronx,7000008,001172,Lincoln Medical & Mental Health Center,30 to 49,104,M,Other Race,Spanish/Hispanic,2,Emergency,Home or Self Care,2019,DIG009,APPENDICITIS AND OTHER APPENDICEAL CONDITIONS,GIS008,APPENDECTOMY,234,APPENDECTOMY WITHOUT COMPLEX PRINCIPAL DIAGNOSIS,06,DISEASES AND DISORDERS OF THE DIGESTIVE SYSTEM,1,Minor,Minor,Surgical,Blue Cross/Blue Shield,,,,,true,15896.8,9387.97
New York City,Manhattan,7002001,001438,Bellevue Hospital Center,18 to 29,100,F,Other Race,Not Span/Hispanic,1,Emergency,Home or Self Care,2019,DIG009,APPENDICITIS AND OTHER APPENDICEAL CONDITIONS,GIS008,APPENDECTOMY,234,APPENDECTOMY WITHOUT COMPLEX PRINCIPAL DIAGNOSIS,06,DISEASES AND DISORDERS OF THE DIGESTIVE SYSTEM,1,Minor,Minor,Surgical,Private Health Insurance,,,,,true,8778.34,5834.08
Finger Lakes,Wayne,5820000,001028,Newark-Wayne Community Hospital,30 to 49,145,M,White,Not Span/Hispanic,1,Emergency,Home or Self Care,2019,DIG022,NONINFECTIOUS GASTROENTERITIS,GIS008,APPENDECTOMY,234,APPENDECTOMY WITHOUT COMPLEX PRINCIPAL DIAGNOSIS,06,DISEASES AND DISORDERS OF THE DIGESTIVE SYSTEM,1,Minor,Minor,Surgical,Private Health Insurance,,,,,true,16411.93,5457.95
New York City,Manhattan,7002001,001438,Bellevue Hospital Center,30 to 49,113,M,Other Race,Spanish/Hispanic,1,Emergency,Home or Self Care,2019,DIG009,APPENDICITIS AND OTHER APPENDICEAL CONDITIONS,GIS008,APPENDECTOMY,234,APPENDECTOMY WITHOUT COMPLEX PRINCIPAL DIAGNOSIS,06,DISEASES AND DISORDERS OF THE DIGESTIVE SYSTEM,1,Minor,Minor,Surgical,Medicaid,,,,,true,8674.2,5764.87
Long Island,Suffolk,5151001,000245,Stony Brook University Hospital,0 to 17,119,F,White,Spanish/Hispanic,2,Emergency,Home or Self Care,2019,DIG009,APPENDICITIS AND OTHER APPENDICEAL CONDITIONS,GIS008,APPENDECTOMY,234,APPENDECTOMY WITHOUT COMPLEX PRINCIPAL DIAGNOSIS,06,DISEASES AND DISORDERS OF THE DIGESTIVE SYSTEM,1,Minor,Minor,Surgical,Medicaid,Medicaid,,,,true,33061.74,10981.99
Hudson Valley,Westchester,5902001,001045,White Plains Hospital Center,50 to 69,106,F,Black/African American,Not Span/Hispanic,2,Emergency,Home or Self Care,2019,DIG009,APPENDICITIS AND OTHER APPENDICEAL CONDITIONS,GIS008,APPENDECTOMY,234,APPENDECTOMY WITHOUT COMPLEX PRINCIPAL DIAGNOSIS,06,DISEASES AND DISORDERS OF THE DIGESTIVE SYSTEM,2,Moderate,Minor,Surgical,Blue Cross/Blue Shield,,,,,true,57244,11600.02
Long Island,Nassau,2952005,000552,Plainview Hospital,0 to 17,,F,White,Not Span/Hispanic,1,Emergency,Home or Self Care,2019,DIG009,APPENDICITIS AND OTHER APPENDICEAL CONDITIONS,GIS008,APPENDECTOMY,234,APPENDECTOMY WITHOUT COMPLEX PRINCIPAL DIAGNOSIS,06,DISEASES AND DISORDERS OF THE DIGESTIVE SYSTEM,1,Minor,Minor,Surgical,Medicaid,Medicaid,,,,true,28136.06,9885.59
Capital/Adirond,Albany,0101000,000001,Albany Medical Center Hospital,18 to 29,123,M,White,Not Span/Hispanic,1,Emergency,Home or Self Care,2019,DIG009,APPENDICITIS AND OTHER APPENDICEAL CONDITIONS,GIS008,APPENDECTOMY,234,APPENDECTOMY WITHOUT COMPLEX PRINCIPAL DIAGNOSIS,06,DISEASES AND DISORDERS OF THE DIGESTIVE SYSTEM,1,Minor,Minor,Surgical,"Managed Care, Unspecified",,,,,true,23541.32,7289.04
Hudson Valley,Westchester,5902001,001045,White Plains Hospital Center,0 to 17,105,F,Other Race,Not Span/Hispanic,1,Emergency,Home or Self Care,2019,DIG009,APPENDICITIS AND OTHER APPENDICEAL CONDITIONS,GIS008,APPENDECTOMY,234,APPENDECTOMY WITHOUT COMPLEX PRINCIPAL DIAGNOSIS,06,DISEASES AND DISORDERS OF THE DIGESTIVE SYSTEM,1,Minor,Minor,Surgical,Private Health Insurance,,,,,true,29747,6987.43
New York City,Manhattan,7002017,001450,Lenox Hill Hospital,18 to 29,112,F,White,Not Span/Hispanic,1,Emergency,Home or Self Care,2019,DIG009,APPENDICITIS AND OTHER APPENDICEAL CONDITIONS,GIS008,APPENDECTOMY,234,APPENDECTOMY WITHOUT COMPLEX PRINCIPAL DIAGNOSIS,06,DISEASES AND DISORDERS OF THE DIGESTIVE SYSTEM,1,Minor,Minor,Surgical,Private Health Insurance,,,,,true,40503.78,9580.57
New York City,Manhattan,7002054,001437,New York-Presbyterian/Lower Manhattan Hospital,30 to 49,103,M,White,Not Span/Hispanic,1,Emergency,Home or Self Care,2019,DIG009,APPENDICITIS AND OTHER APPENDICEAL CONDITIONS,GIS008,APPENDECTOMY,234,APPENDECTOMY WITHOUT COMPLEX PRINCIPAL DIAGNOSIS,06,DISEASES AND DISORDERS OF THE DIGESTIVE SYSTEM,1,Minor,Minor,Surgical,Private Health Insurance,Self-Pay,,,,true,37529.64,9329.65
New York City,Manhattan,7002054,001458,New York-Presbyterian Hospital - New York Weill Cornell Center,50 to 69,100,M,White,Not Span/Hispanic,1,Emergency,Home or Self Care,2019,DIG009,APPENDICITIS AND OTHER APPENDICEAL CONDITIONS,GIS008,APPENDECTOMY,234,APPENDECTOMY WITHOUT COMPLEX PRINCIPAL DIAGNOSIS,06,DISEASES AND DISORDERS OF THE DIGESTIVE SYSTEM,2,Moderate,Moderate,Surgical,Medicare,Blue Cross/Blue Shield,Self-Pay,,,true,43390.13,11006.45
New York City,Queens,7003010,001637,New York - Presbyterian/Queens,50 to 69,113,M,Other Race,Spanish/Hispanic,2,Emergency,Home or Self Care,2019,DIG009,APPENDICITIS AND OTHER APPENDICEAL CONDITIONS,GIS008,APPENDECTOMY,234,APPENDECTOMY WITHOUT COMPLEX PRINCIPAL DIAGNOSIS,06,DISEASES AND DISORDERS OF THE DIGESTIVE SYSTEM,1,Minor,Minor,Surgical,"Managed Care, Unspecified",Medicaid,Self-Pay,,,true,33868.29,11808.14
New York City,Bronx,7000001,001178,BronxCare Hospital Center,30 to 49,104,F,Other Race,Spanish/Hispanic,2,Emergency,Home or Self Care,2019,DIG009,APPENDICITIS AND OTHER APPENDICEAL CONDITIONS,GIS008,APPENDECTOMY,234,APPENDECTOMY WITHOUT COMPLEX PRINCIPAL DIAGNOSIS,06,DISEASES AND DISORDERS OF THE DIGESTIVE SYSTEM,2,Moderate,Minor,Surgical,Medicaid,Medicaid,,,,true,13805.75,16309.56
New York City,Queens,7003004,003376,Cohen Children's Medical Center,0 to 17,115,M,Black/African American,Not Span/Hispanic,1,Emergency,Home or Self Care,2019,DIG009,APPENDICITIS AND OTHER APPENDICEAL CONDITIONS,GIS008,APPENDECTOMY,234,APPENDECTOMY WITHOUT COMPLEX PRINCIPAL DIAGNOSIS,06,DISEASES AND DISORDERS OF THE DIGESTIVE SYSTEM,1,Minor,Minor,Surgical,Medicaid,Medicaid,Self-Pay,,,false,24640.6,5435.21
Capital/Adirond,Schenectady,4601001,000829,Ellis Hospital,18 to 29,121,F,White,Not Span/Hispanic,1,Emergency,Home or Self Care,2019,DIG009,APPENDICITIS AND OTHER APPENDICEAL CONDITIONS,GIS008,APPENDECTOMY,234,APPENDECTOMY WITHOUT COMPLEX PRINCIPAL DIAGNOSIS,06,DISEASES AND DISORDERS OF THE DIGESTIVE SYSTEM,1,Minor,Minor,Surgical,Private Health Insurance,,,,,true,19028.75,4690.58
New York City,Queens,7001024,001635,St Johns Episcopal Hospital So Shore,18 to 29,116,M,Other Race,Unknown,1,Emergency,Home or Self Care,2019,DIG009,APPENDICITIS AND OTHER APPENDICEAL CONDITIONS,GIS008,APPENDECTOMY,234,APPENDECTOMY WITHOUT COMPLEX PRINCIPAL DIAGNOSIS,06,DISEASES AND DISORDERS OF THE DIGESTIVE SYSTEM,1,Minor,Minor,Surgical,Medicaid,,,,,true,26344.09,7763.74
New York City,Kings,7002053,001304,NYU Langone Hospital-Brooklyn,50 to 69,112,F,White,Not Span/Hispanic,1,Emergency,Home or Self Care,2019,DIG009,APPENDICITIS AND OTHER APPENDICEAL CONDITIONS,GIS008,APPENDECTOMY,234,APPENDECTOMY WITHOUT COMPLEX PRINCIPAL DIAGNOSIS,06,DISEASES AND DISORDERS OF THE DIGESTIVE SYSTEM,1,Minor,Minor,Surgical,Medicaid,,,,,true,92013.79,15470.4
Capital/Adirond,Albany,0101004,000005,St. Peter's Hospital,18 to 29,121,M,White,Not Span/Hispanic,1,Elective,Home or Self Care,2019,DIG009,APPENDICITIS AND OTHER APPENDICEAL CONDITIONS,GIS008,APPENDECTOMY,234,APPENDECTOMY WITHOUT COMPLEX PRINCIPAL DIAGNOSIS,06,DISEASES AND DISORDERS OF THE DIGESTIVE SYSTEM,1,Minor,Minor,Surgical,Private Health Insurance,,,,,false,10463.3,4620.66
Capital/Adirond,Albany,0101004,000005,St. Peter's Hospital,18 to 29,,F,Other Race,Not Span/Hispanic,1,Elective,Home or Self Care,2019,DIG009,APPENDICITIS AND OTHER APPENDICEAL CONDITIONS,GIS008,APPENDECTOMY,234,APPENDECTOMY WITHOUT COMPLEX PRINCIPAL DIAGNOSIS,06,DISEASES AND DISORDERS OF THE DIGESTIVE SYSTEM,1,Minor,Minor,Surgical,Blue Cross/Blue Shield,Blue Cross/Blue Shield,,,,false,13011.2,5276.53
New York City,Bronx,7000002,001165,Jacobi Medical Center,0 to 17,104,M,Black/African American,Not Span/Hispanic,1,Emergency,Home or Self Care,2019,DIG009,APPENDICITIS AND OTHER APPENDICEAL CONDITIONS,GIS008,APPENDECTOMY,234,APPENDECTOMY WITHOUT COMPLEX PRINCIPAL DIAGNOSIS,06,DISEASES AND DISORDERS OF THE DIGESTIVE SYSTEM,2,Moderate,Minor,Surgical,Medicaid,Medicaid,,,,true,10939.13,6472.14
Capital/Adirond,Albany,0101004,000005,St. Peter's Hospital,30 to 49,122,F,White,Not Span/Hispanic,2,Elective,Home or Self Care,2019,DIG009,APPENDICITIS AND OTHER APPENDICEAL CONDITIONS,GIS008,APPENDECTOMY,234,APPENDECTOMY WITHOUT COMPLEX PRINCIPAL DIAGNOSIS,06,DISEASES AND DISORDERS OF THE DIGESTIVE SYSTEM,2,Moderate,Minor,Surgical,Blue Cross/Blue Shield,Blue Cross/Blue Shield,,,,false,23505.95,9962.68
New York City,Manhattan,7002054,003975,New York Presbyterian Hospital - Allen Hospital,18 to 29,104,M,Other Race,Spanish/Hispanic,2,Emergency,Home or Self Care,2019,DIG009,APPENDICITIS AND OTHER APPENDICEAL CONDITIONS,GIS008,APPENDECTOMY,234,APPENDECTOMY WITHOUT COMPLEX PRINCIPAL DIAGNOSIS,06,DISEASES AND DISORDERS OF THE DIGESTIVE SYSTEM,1,Minor,Minor,Surgical,Medicaid,Medicaid,Self-Pay,,,true,25528.89,5575.02
New York City,Manhattan,7002053,001463,NYU Langone Hospitals,0 to 17,112,F,White,Spanish/Hispanic,1,Emergency,Home or Self Care,2019,DIG009,APPENDICITIS AND OTHER APPENDICEAL CONDITIONS,GIS008,APPENDECTOMY,234,APPENDECTOMY WITHOUT COMPLEX PRINCIPAL DIAGNOSIS,06,DISEASES AND DISORDERS OF THE DIGESTIVE SYSTEM,1,Minor,Minor,Surgical,Medicaid,,,,,true,74170.61,12383.21
New York City,Queens,7003010,001637,New York - Presbyterian/Queens,0 to 17,113,M,Other Race,Spanish/Hispanic,1,Emergency,Home or Self Care,2019,DIG009,APPENDICITIS AND OTHER APPENDICEAL CONDITIONS,GIS008,APPENDECTOMY,234,APPENDECTOMY WITHOUT COMPLEX PRINCIPAL DIAGNOSIS,06,DISEASES AND DISORDERS OF THE DIGESTIVE SYSTEM,1,Minor,Minor,Surgical,Private Health Insurance,,,,,true,23537.39,10019.41
Long Island,Nassau,2953000,000563,St. Francis Hospital & Heart Center,30 to 49,117,F,White,Not Span/Hispanic,10,Emergency,Home w/ Home Health Services,2019,DIG009,APPENDICITIS AND OTHER APPENDICEAL CONDITIONS,GIS008,APPENDECTOMY,234,APPENDECTOMY WITHOUT COMPLEX PRINCIPAL DIAGNOSIS,06,DISEASES AND DISORDERS OF THE DIGESTIVE SYSTEM,2,Moderate,Minor,Surgical,Medicare,Blue Cross/Blue Shield,,,,true,112675.75,24683.4
New York City,Manhattan,7002032,001466,Mount Sinai West,30 to 49,104,F,Black/African American,Not Span/Hispanic,1,Emergency,Home or Self Care,2019,DIG009,APPENDICITIS AND OTHER APPENDICEAL CONDITIONS,GIS008,APPENDECTOMY,234,APPENDECTOMY WITHOUT COMPLEX PRINCIPAL DIAGNOSIS,06,DISEASES AND DISORDERS OF THE DIGESTIVE SYSTEM,1,Minor,Minor,Surgical,Private Health Insurance,Self-Pay,,,,true,41019.64,12737.41
New York City,Manhattan,7002054,001464,New York-Presbyterian Hospital - Columbia Presbyterian Center,0 to 17,104,M,Multi-racial,Not Span/Hispanic,1,Emergency,Home or Self Care,2019,DIG009,APPENDICITIS AND OTHER APPENDICEAL CONDITIONS,GIS008,APPENDECTOMY,234,APPENDECTOMY WITHOUT COMPLEX PRINCIPAL DIAGNOSIS,06,DISEASES AND DISORDERS OF THE DIGESTIVE SYSTEM,4,Extreme,Moderate,Surgical,Medicaid,Self-Pay,,,,true,42418.34,16981.53
Central NY,Oneida,3202003,000599,Faxton-St Lukes Healthcare St Lukes Division,0 to 17,134,M,White,Not Span/Hispanic,2,Emergency,Home or Self Care,2019,DIG009,APPENDICITIS AND OTHER APPENDICEAL CONDITIONS,GIS008,APPENDECTOMY,234,APPENDECTOMY WITHOUT COMPLEX PRINCIPAL DIAGNOSIS,06,DISEASES AND DISORDERS OF THE DIGESTIVE SYSTEM,1,Minor,Minor,Surgical,Blue Cross/Blue Shield,,,,,true,20120.24,9898.43
Western NY,Erie,1401014,003067,Millard Fillmore Suburban Hospital,50 to 69,140,F,White,Not Span/Hispanic,1,Emergency,Home or Self Care,2019,DIG009,APPENDICITIS AND OTHER APPENDICEAL CONDITIONS,GIS008,APPENDECTOMY,234,APPENDECTOMY WITHOUT COMPLEX PRINCIPAL DIAGNOSIS,06,DISEASES AND DISORDERS OF THE DIGESTIVE SYSTEM,2,Moderate,Minor,Surgical,Blue Cross/Blue Shield,Medicare,Self-Pay,,,true,17332.28,5597.49
New York City,Manhattan,7002054,003975,New York Presbyterian Hospital - Allen Hospital,50 to 69,100,F,Other Race,Not Span/Hispanic,4,Emergency,Home or Self Care,2019,DIG009,APPENDICITIS AND OTHER APPENDICEAL CONDITIONS,GIS008,APPENDECTOMY,234,APPENDECTOMY WITHOUT COMPLEX PRINCIPAL DIAGNOSIS,06,DISEASES AND DISORDERS OF THE DIGESTIVE SYSTEM,1,Minor,Minor,Surgical,Private Health Insurance,Self-Pay,,,,true,58488.91,14508.17
New York City,Manhattan,7002021,001454,Metropolitan Hospital Center,0 to 17,104,M,Other Race,Spanish/Hispanic,2,Emergency,Home or Self Care,2019,DIG009,APPENDICITIS AND OTHER APPENDICEAL CONDITIONS,GIS008,APPENDECTOMY,234,APPENDECTOMY WITHOUT COMPLEX PRINCIPAL DIAGNOSIS,06,DISEASES AND DISORDERS OF THE DIGESTIVE SYSTEM,2,Moderate,Minor,Surgical,Medicaid,Medicaid,,,,true,15133.72,12227.29
New York City,Manhattan,7002021,001454,Metropolitan Hospital Center,0 to 17,113,M,Other Race,Not Span/Hispanic,2,Emergency,Home or Self Care,2019,DIG009,APPENDICITIS AND OTHER APPENDICEAL CONDITIONS,GIS008,APPENDECTOMY,234,APPENDECTOMY WITHOUT COMPLEX PRINCIPAL DIAGNOSIS,06,DISEASES AND DISORDERS OF THE DIGESTIVE SYSTEM,1,Minor,Minor,Surgical,Medicaid,Medicaid,,,,true,15447.31,12480.65
New York City,Manhattan,7002054,001464,New York-Presbyterian Hospital - Columbia Presbyterian Center,0 to 17,104,F,Black/African American,Not Span/Hispanic,2,Emergency,Home or Self Care,2019,DIG009,APPENDICITIS AND OTHER APPENDICEAL CONDITIONS,GIS008,APPENDECTOMY,234,APPENDECTOMY WITHOUT COMPLEX PRINCIPAL DIAGNOSIS,06,DISEASES AND DISORDERS OF THE DIGESTIVE SYSTEM,2,Moderate,Minor,Surgical,Medicaid,Medicaid,Self-Pay,,,true,54925.76,14148.52
New York City,Manhattan,7002053,001463,NYU Langone Hospitals,0 to 17,112,M,White,Not Span/Hispanic,1,Emergency,Home or Self Care,2019,DIG009,APPENDICITIS AND OTHER APPENDICEAL CONDITIONS,GIS008,APPENDECTOMY,234,APPENDECTOMY WITHOUT COMPLEX PRINCIPAL DIAGNOSIS,06,DISEASES AND DISORDERS OF THE DIGESTIVE SYSTEM,1,Minor,Minor,Surgical,Medicaid,,,,,true,68062.13,14434.12
New York City,Queens,7001024,001635,St Johns Episcopal Hospital So Shore,50 to 69,116,M,Black/African American,Unknown,1,Emergency,Home or Self Care,2019,DIG009,APPENDICITIS AND OTHER APPENDICEAL CONDITIONS,GIS008,APPENDECTOMY,234,APPENDECTOMY WITHOUT COMPLEX PRINCIPAL DIAGNOSIS,06,DISEASES AND DISORDERS OF THE DIGESTIVE SYSTEM,1,Minor,Minor,Surgical,Blue Cross/Blue Shield,Medicaid,Medicaid,,,true,28359.59,8231.7
New York City,Manhattan,7002054,001437,New York-Presbyterian/Lower Manhattan Hospital,30 to 49,100,M,Multi-racial,Not Span/Hispanic,2,Emergency,Home or Self Care,2019,DIG009,APPENDICITIS AND OTHER APPENDICEAL CONDITIONS,GIS008,APPENDECTOMY,234,APPENDECTOMY WITHOUT COMPLEX PRINCIPAL DIAGNOSIS,06,DISEASES AND DISORDERS OF THE DIGESTIVE SYSTEM,1,Minor,Minor,Surgical,Self-Pay,,,,,true,54495.98,13559.38
New York City,Manhattan,7002020,001453,Memorial Hospital for Cancer and Allied Diseases,70 or Older,OOS,F,White,Not Span/Hispanic,7,Elective,Home or Self Care,2019,NEO015,GASTROINTESTINAL CANCERS - COLORECTAL,GIS008,APPENDECTOMY,234,APPENDECTOMY WITHOUT COMPLEX PRINCIPAL DIAGNOSIS,06,DISEASES AND DISORDERS OF THE DIGESTIVE SYSTEM,3,Major,Major,Surgical,Medicare,,,,,false,109339.16,43470.11
New York City,Manhattan,7002054,001464,New York-Presbyterian Hospital - Columbia Presbyterian Center,18 to 29,100,M,Other Race,Not Span/Hispanic,3,Emergency,Inpatient Rehabilitation Facility,2019,DIG009,APPENDICITIS AND OTHER APPENDICEAL CONDITIONS,GIS008,APPENDECTOMY,234,APPENDECTOMY WITHOUT COMPLEX PRINCIPAL DIAGNOSIS,06,DISEASES AND DISORDERS OF THE DIGESTIVE SYSTEM,2,Moderate,Minor,Surgical,Medicare,Medicare,Medicaid,,,true,62355.28,15967.7
New York City,Manhattan,7002032,001469,Mount Sinai Morningside,30 to 49,100,F,Black/African American,Not Span/Hispanic,3,Emergency,Home or Self Care,2019,DIG009,APPENDICITIS AND OTHER APPENDICEAL CONDITIONS,GIS008,APPENDECTOMY,234,APPENDECTOMY WITHOUT COMPLEX PRINCIPAL DIAGNOSIS,06,DISEASES AND DISORDERS OF THE DIGESTIVE SYSTEM,1,Minor,Minor,Surgical,Medicaid,Medicaid,Self-Pay,,,true,61778.32,17271.07
Long Island,Nassau,2950002,000528,Nassau University Medical Center,0 to 17,115,M,Other Race,Spanish/Hispanic,1,Emergency,Home or Self Care,2019,DIG009,APPENDICITIS AND OTHER APPENDICEAL CONDITIONS,GIS008,APPENDECTOMY,234,APPENDECTOMY WITHOUT COMPLEX PRINCIPAL DIAGNOSIS,06,DISEASES AND DISORDERS OF THE DIGESTIVE SYSTEM,1,Minor,Minor,Surgical,Medicaid,Medicaid,Self-Pay,,,false,16779.88,10786.25
New York City,Manhattan,7002054,001464,New York-Presbyterian Hospital - Columbia Presbyterian Center,50 to 69,104,F,Black/African American,Spanish/Hispanic,3,Emergency,Home or Self Care,2019,DIG009,APPENDICITIS AND OTHER APPENDICEAL CONDITIONS,GIS008,APPENDECTOMY,234,APPENDECTOMY WITHOUT COMPLEX PRINCIPAL DIAGNOSIS,06,DISEASES AND DISORDERS OF THE DIGESTIVE SYSTEM,2,Moderate,Minor,Surgical,Medicaid,Medicaid,Self-Pay,,,true,58440.09,14901.86
New York City,Manhattan,7002054,001464,New York-Presbyterian Hospital - Columbia Presbyterian Center,50 to 69,104,F,White,Multi-ethnic,3,Emergency,Home or Self Care,2019,DIG009,APPENDICITIS AND OTHER APPENDICEAL CONDITIONS,GIS008,APPENDECTOMY,234,APPENDECTOMY WITHOUT COMPLEX PRINCIPAL DIAGNOSIS,06,DISEASES AND DISORDERS OF THE DIGESTIVE SYSTEM,2,Moderate,Moderate,Surgical,Medicare,Medicare,Medicaid,,,true,68309.55,17771.43
New York City,Queens,7003004,001638,Long Island Jewish Forest Hills,30 to 49,113,F,White,Not Span/Hispanic,1,Emergency,Home or Self Care,2019,DIG009,APPENDICITIS AND OTHER APPENDICEAL CONDITIONS,GIS008,APPENDECTOMY,234,APPENDECTOMY WITHOUT COMPLEX PRINCIPAL DIAGNOSIS,06,DISEASES AND DISORDERS OF THE DIGESTIVE SYSTEM,1,Minor,Minor,Surgical,Self-Pay,Self-Pay,,,,true,35551.1,6726.43
New York City,Manhattan,7002021,001454,Metropolitan Hospital Center,30 to 49,113,M,Other Race,Spanish/Hispanic,1,Emergency,Home or Self Care,2019,DIG009,APPENDICITIS AND OTHER APPENDICEAL CONDITIONS,GIS008,APPENDECTOMY,234,APPENDECTOMY WITHOUT COMPLEX PRINCIPAL DIAGNOSIS,06,DISEASES AND DISORDERS OF THE DIGESTIVE SYSTEM,1,Minor,Minor,Surgical,Medicaid,,,,,true,10138.22,8191.17
New York City,Manhattan,7002001,001438,Bellevue Hospital Center,30 to 49,100,F,Other Race,Spanish/Hispanic,1,Emergency,Home or Self Care,2019,DIG009,APPENDICITIS AND OTHER APPENDICEAL CONDITIONS,GIS008,APPENDECTOMY,234,APPENDECTOMY WITHOUT COMPLEX PRINCIPAL DIAGNOSIS,06,DISEASES AND DISORDERS OF THE DIGESTIVE SYSTEM,2,Moderate,Minor,Surgical,Private Health Insurance,,,,,true,8788.27,5840.68
New York City,Manhattan,7002001,001438,Bellevue Hospital Center,30 to 49,112,M,White,Spanish/Hispanic,1,Emergency,Home or Self Care,2019,DIG009,APPENDICITIS AND OTHER APPENDICEAL CONDITIONS,GIS008,APPENDECTOMY,234,APPENDECTOMY WITHOUT COMPLEX PRINCIPAL DIAGNOSIS,06,DISEASES AND DISORDERS OF THE DIGESTIVE SYSTEM,1,Minor,Minor,Surgical,Private Health Insurance,,,,,true,8721.32,5796.19
New York City,Bronx,7000001,001178,BronxCare Hospital Center,18 to 29,104,M,Black/African American,Not Span/Hispanic,4,Emergency,Home or Self Care,2019,DIG009,APPENDICITIS AND OTHER APPENDICEAL CONDITIONS,GIS008,APPENDECTOMY,234,APPENDECTOMY WITHOUT COMPLEX PRINCIPAL DIAGNOSIS,06,DISEASES AND DISORDERS OF THE DIGESTIVE SYSTEM,2,Moderate,Minor,Surgical,Medicaid,Medicaid,,,,true,18489.65,22630.27
New York City,Bronx,7000001,001178,BronxCare Hospital Center,18 to 29,104,M,Other Race,Spanish/Hispanic,2,Emergency,Home or Self Care,2019,DIG009,APPENDICITIS AND OTHER APPENDICEAL CONDITIONS,GIS008,APPENDECTOMY,234,APPENDECTOMY WITHOUT COMPLEX PRINCIPAL DIAGNOSIS,06,DISEASES AND DISORDERS OF THE DIGESTIVE SYSTEM,1,Minor,Minor,Surgical,Medicaid,Medicaid,,,,true,16057.5,19629.89
New York City,Bronx,7000001,001178,BronxCare Hospital Center,0 to 17,104,M,Other Race,Spanish/Hispanic,2,Emergency,Home or Self Care,2019,DIG009,APPENDICITIS AND OTHER APPENDICEAL CONDITIONS,GIS008,APPENDECTOMY,234,APPENDECTOMY WITHOUT COMPLEX PRINCIPAL DIAGNOSIS,06,DISEASES AND DISORDERS OF THE DIGESTIVE SYSTEM,1,Minor,Minor,Surgical,Medicaid,Medicaid,,,,true,14368.72,13807.2
Hudson Valley,Westchester,5902001,001045,White Plains Hospital Center,30 to 49,105,F,Black/African American,Not Span/Hispanic,2,Emergency,Home or Self Care,2019,DIG009,APPENDICITIS AND OTHER APPENDICEAL CONDITIONS,GIS008,APPENDECTOMY,234,APPENDECTOMY WITHOUT COMPLEX PRINCIPAL DIAGNOSIS,06,DISEASES AND DISORDERS OF THE DIGESTIVE SYSTEM,1,Minor,Minor,Surgical,Private Health Insurance,,,,,true,57370,10598.52
Long Island,Nassau,2950002,000528,Nassau University Medical Center,0 to 17,115,M,White,Spanish/Hispanic,1,Emergency,Home or Self Care,2019,DIG009,APPENDICITIS AND OTHER APPENDICEAL CONDITIONS,GIS008,APPENDECTOMY,234,APPENDECTOMY WITHOUT COMPLEX PRINCIPAL DIAGNOSIS,06,DISEASES AND DISORDERS OF THE DIGESTIVE SYSTEM,1,Minor,Minor,Surgical,Medicaid,Medicaid,Self-Pay,,,false,7915.99,3723.96