Hospital Service Area,Hospital County,Operating Certificate Number,Permanent Facility Id,Facility Name,Age Group,Zip Code - 3 digits,Gender,Race,Ethnicity,Length of Stay,Type of Admission,Patient Disposition,Discharge Year,CCS Diagnosis Code,CCS Diagnosis Description,CCS Procedure Code,CCS Procedure Description,APR DRG Code,APR DRG Description,APR MDC Code,APR MDC Description,APR Severity of Illness Code,APR Severity of Illness Description,APR Risk of Mortality,APR Medical Surgical Description,Payment Typology 1,Payment Typology 2,Payment Typology 3,Birth Weight,Abortion Edit Indicator,Emergency Department Indicator,Total Charges,Total Costs
Western NY,Erie,1401014,000207,Buffalo General Medical Center,70 or Older,147,M,White,Not Span/Hispanic,1,Elective,Home or Self Care,2018,CIR023,OCCLUSION OR STENOSIS OF PRECEREBRAL OR CEREBRAL ARTERIES WITHOUT INFARCTION,CAR006,CAROTID ENDARTERECTOMY AND STENTING,024,EXTRACRANIAL VASCULAR PROCEDURES,01,DISEASES AND DISORDERS OF THE NERVOUS SYSTEM,1,Minor,Minor,Surgical,Medicare,Self-Pay,,,,false,17052.12,7673.72
Western NY,Erie,1401014,000207,Buffalo General Medical Center,50 to 69,142,F,White,Not Span/Hispanic,2,Urgent,Home or Self Care,2018,CIR023,OCCLUSION OR STENOSIS OF PRECEREBRAL OR CEREBRAL ARTERIES WITHOUT INFARCTION,CAR006,CAROTID ENDARTERECTOMY AND STENTING,024,EXTRACRANIAL VASCULAR PROCEDURES,01,DISEASES AND DISORDERS OF THE NERVOUS SYSTEM,2,Moderate,Moderate,Surgical,Private Health Insurance,Medicare,Self-Pay,,,false,21866.55,9292.43
Southern Tier,Broome,0303001,000058,United Health Services Hospitals Inc. - Wilson Medical Center,70 or Older,139,F,White,Not Span/Hispanic,1,Elective,Home or Self Care,2018,CIR023,OCCLUSION OR STENOSIS OF PRECEREBRAL OR CEREBRAL ARTERIES WITHOUT INFARCTION,CAR006,CAROTID ENDARTERECTOMY AND STENTING,024,EXTRACRANIAL VASCULAR PROCEDURES,01,DISEASES AND DISORDERS OF THE NERVOUS SYSTEM,2,Moderate,Minor,Surgical,Medicare,Medicare,Blue Cross/Blue Shield,,,false,37028.5,19254.47
Finger Lakes,Monroe,2701003,000411,Rochester General Hospital,70 or Older,146,F,White,Not Span/Hispanic,14,Emergency,Skilled Nursing Home,2018,CIR020,CEREBRAL INFARCTION,CAR008,ANGIOPLASTY AND RELATED VESSEL PROCEDURES (ENDOVASCULAR; EXCLUDING CAROTID),024,EXTRACRANIAL VASCULAR PROCEDURES,01,DISEASES AND DISORDERS OF THE NERVOUS SYSTEM,4,Extreme,Major,Surgical,Medicare,,,,,true,76134.14,32392.53
Capital/Adirond,Albany,0101004,000005,St. Peter's Hospital,50 to 69,122,F,White,Not Span/Hispanic,1,Elective,Home or Self Care,2018,CIR023,OCCLUSION OR STENOSIS OF PRECEREBRAL OR CEREBRAL ARTERIES WITHOUT INFARCTION,CAR006,CAROTID ENDARTERECTOMY AND STENTING,024,EXTRACRANIAL VASCULAR PROCEDURES,01,DISEASES AND DISORDERS OF THE NERVOUS SYSTEM,1,Minor,Minor,Surgical,Private Health Insurance,,,,,false,16867.25,6631.03
Southern Tier,Broome,0303001,000058,United Health Services Hospitals Inc. - Wilson Medical Center,70 or Older,139,F,White,Not Span/Hispanic,1,Elective,Home or Self Care,2018,CIR023,OCCLUSION OR STENOSIS OF PRECEREBRAL OR CEREBRAL ARTERIES WITHOUT INFARCTION,CAR006,CAROTID ENDARTERECTOMY AND STENTING,024,EXTRACRANIAL VASCULAR PROCEDURES,01,DISEASES AND DISORDERS OF THE NERVOUS SYSTEM,1,Minor,Moderate,Surgical,Medicare,Medicare,Private Health Insurance,,,false,19190.1,9109.22
Southern Tier,Broome,0303001,000058,United Health Services Hospitals Inc. - Wilson Medical Center,50 to 69,139,F,White,Not Span/Hispanic,6,Elective,Home w/ Home Health Services,2018,CIR023,OCCLUSION OR STENOSIS OF PRECEREBRAL OR CEREBRAL ARTERIES WITHOUT INFARCTION,CAR006,CAROTID ENDARTERECTOMY AND STENTING,024,EXTRACRANIAL VASCULAR PROCEDURES,01,DISEASES AND DISORDERS OF THE NERVOUS SYSTEM,3,Major,Moderate,Surgical,Medicare,Medicare,,,,false,39678.1,18363.04
New York City,Manhattan,7002002,001439,Mount Sinai Beth Israel,70 or Older,100,F,White,Not Span/Hispanic,6,Emergency,Home or Self Care,2018,CIR020,CEREBRAL INFARCTION,CAR006,CAROTID ENDARTERECTOMY AND STENTING,024,EXTRACRANIAL VASCULAR PROCEDURES,01,DISEASES AND DISORDERS OF THE NERVOUS SYSTEM,3,Major,Moderate,Surgical,Medicare,Private Health Insurance,Self-Pay,,,true,167933.29,36482.8
Finger Lakes,Monroe,2701005,000413,Strong Memorial Hospital,70 or Older,146,M,White,Not Span/Hispanic,3,Emergency,Expired,2018,CIR020,CEREBRAL INFARCTION,CAR006,CAROTID ENDARTERECTOMY AND STENTING,024,EXTRACRANIAL VASCULAR PROCEDURES,01,DISEASES AND DISORDERS OF THE NERVOUS SYSTEM,4,Extreme,Extreme,Surgical,Medicare,Medicare,Self-Pay,,,true,95988.62,45745.5
Western NY,Erie,1401014,000207,Buffalo General Medical Center,70 or Older,142,F,White,Not Span/Hispanic,1,Elective,Home or Self Care,2018,CIR023,OCCLUSION OR STENOSIS OF PRECEREBRAL OR CEREBRAL ARTERIES WITHOUT INFARCTION,CAR006,CAROTID ENDARTERECTOMY AND STENTING,024,EXTRACRANIAL VASCULAR PROCEDURES,01,DISEASES AND DISORDERS OF THE NERVOUS SYSTEM,1,Minor,Minor,Surgical,Medicare,Self-Pay,,,,false,15076.34,6274.54
Long Island,Suffolk,5151001,000245,Stony Brook University Hospital,30 to 49,117,M,White,Not Span/Hispanic,3,Urgent,Home or Self Care,2018,CIR024,OTHER AND ILL-DEFINED CEREBROVASCULAR DISEASE,CAR011,ANEURYSM REPAIR PROCEDURES,024,EXTRACRANIAL VASCULAR PROCEDURES,01,DISEASES AND DISORDERS OF THE NERVOUS SYSTEM,2,Moderate,Minor,Surgical,Medicaid,Medicaid,,,,false,60637.58,29053.96
Western NY,Erie,1401014,000207,Buffalo General Medical Center,50 to 69,142,F,Black/African American,Not Span/Hispanic,1,Elective,Skilled Nursing Home,2018,CIR023,OCCLUSION OR STENOSIS OF PRECEREBRAL OR CEREBRAL ARTERIES WITHOUT INFARCTION,CAR006,CAROTID ENDARTERECTOMY AND STENTING,024,EXTRACRANIAL VASCULAR PROCEDURES,01,DISEASES AND DISORDERS OF THE NERVOUS SYSTEM,2,Moderate,Moderate,Surgical,Medicare,Medicaid,Self-Pay,,,false,16933.58,7583.97
Long Island,Suffolk,5151001,000245,Stony Brook University Hospital,50 to 69,117,F,White,Not Span/Hispanic,1,Elective,Home or Self Care,2018,CIR024,OTHER AND ILL-DEFINED CEREBROVASCULAR DISEASE,CAR011,ANEURYSM REPAIR PROCEDURES,024,EXTRACRANIAL VASCULAR PROCEDURES,01,DISEASES AND DISORDERS OF THE NERVOUS SYSTEM,1,Minor,Minor,Surgical,Medicare,Private Health Insurance,,,,false,57130.04,29679.62
Long Island,Nassau,2951001,000541,North Shore University Hospital,30 to 49,115,M,Other Race,Not Span/Hispanic,10,Emergency,Home or Self Care,2018,CIR021,ACUTE HEMORRHAGIC CEREBROVASCULAR DISEASE,CAR010,LIGATION AND EMBOLIZATION OF VESSELS,024,EXTRACRANIAL VASCULAR PROCEDURES,01,DISEASES AND DISORDERS OF THE NERVOUS SYSTEM,2,Moderate,Minor,Surgical,Private Health Insurance,,,,,true,281069.87,71968.54
New York City,Manhattan,7002053,001463,NYU Langone Hospitals,70 or Older,100,F,White,Not Span/Hispanic,1,Elective,Home w/ Home Health Services,2018,CIR023,OCCLUSION OR STENOSIS OF PRECEREBRAL OR CEREBRAL ARTERIES WITHOUT INFARCTION,CAR006,CAROTID ENDARTERECTOMY AND STENTING,024,EXTRACRANIAL VASCULAR PROCEDURES,01,DISEASES AND DISORDERS OF THE NERVOUS SYSTEM,2,Moderate,Minor,Surgical,Medicare,,,,,false,75690.2,15539.79
Central NY,Onondaga,3301003,000630,St. Joseph's Hospital Health Center,70 or Older,130,M,Multi-racial,Not Span/Hispanic,5,Urgent,Home w/ Home Health Services,2018,CIR023,OCCLUSION OR STENOSIS OF PRECEREBRAL OR CEREBRAL ARTERIES WITHOUT INFARCTION,CAR006,CAROTID ENDARTERECTOMY AND STENTING,024,EXTRACRANIAL VASCULAR PROCEDURES,01,DISEASES AND DISORDERS OF THE NERVOUS SYSTEM,3,Major,Major,Surgical,Medicare,,,,,false,39713.56,16166.31
Central NY,Onondaga,3301007,000635,University Hospital SUNY Health Science Center,70 or Older,130,F,White,Not Span/Hispanic,3,Emergency,Expired,2018,CIR020,CEREBRAL INFARCTION,CAR008,ANGIOPLASTY AND RELATED VESSEL PROCEDURES (ENDOVASCULAR; EXCLUDING CAROTID),024,EXTRACRANIAL VASCULAR PROCEDURES,01,DISEASES AND DISORDERS OF THE NERVOUS SYSTEM,4,Extreme,Extreme,Surgical,Medicare,,,,,true,128591.72,32917.42
Central NY,Onondaga,3301008,000636,Crouse Hospital,50 to 69,130,F,White,Not Span/Hispanic,8,Emergency,Expired,2018,CIR020,CEREBRAL INFARCTION,CAR008,ANGIOPLASTY AND RELATED VESSEL PROCEDURES (ENDOVASCULAR; EXCLUDING CAROTID),024,EXTRACRANIAL VASCULAR PROCEDURES,01,DISEASES AND DISORDERS OF THE NERVOUS SYSTEM,4,Extreme,Extreme,Surgical,Medicare,,,,,true,110144.46,54163.67
Southern Tier,Broome,0303001,000058,United Health Services Hospitals Inc. - Wilson Medical Center,50 to 69,OOS,F,White,Not Span/Hispanic,2,Elective,Home or Self Care,2018,CIR023,OCCLUSION OR STENOSIS OF PRECEREBRAL OR CEREBRAL ARTERIES WITHOUT INFARCTION,CAR006,CAROTID ENDARTERECTOMY AND STENTING,024,EXTRACRANIAL VASCULAR PROCEDURES,01,DISEASES AND DISORDERS OF THE NERVOUS SYSTEM,2,Moderate,Moderate,Surgical,Medicare,Medicare,,,,false,21971.7,10876.92
Long Island,Suffolk,5149000,000895,John T Mather Memorial Hospital of Port Jefferson New York Inc,50 to 69,117,M,White,Not Span/Hispanic,1,Elective,Home or Self Care,2018,CIR023,OCCLUSION OR STENOSIS OF PRECEREBRAL OR CEREBRAL ARTERIES WITHOUT INFARCTION,CAR006,CAROTID ENDARTERECTOMY AND STENTING,024,EXTRACRANIAL VASCULAR PROCEDURES,01,DISEASES AND DISORDERS OF THE NERVOUS SYSTEM,3,Major,Moderate,Surgical,Medicare,Medicare,Private Health Insurance,,,false,33058,6983.4
Capital/Adirond,Albany,0101004,000005,St. Peter's Hospital,50 to 69,121,M,White,Not Span/Hispanic,1,Elective,Home or Self Care,2018,CIR023,OCCLUSION OR STENOSIS OF PRECEREBRAL OR CEREBRAL ARTERIES WITHOUT INFARCTION,CAR006,CAROTID ENDARTERECTOMY AND STENTING,024,EXTRACRANIAL VASCULAR PROCEDURES,01,DISEASES AND DISORDERS OF THE NERVOUS SYSTEM,1,Minor,Minor,Surgical,Medicare,Medicaid,,,,false,18129.1,6962.16
Long Island,Suffolk,5155000,000938,Peconic Bay Medical Center,50 to 69,119,M,White,Spanish/Hispanic,1,Elective,Home or Self Care,2018,CIR023,OCCLUSION OR STENOSIS OF PRECEREBRAL OR CEREBRAL ARTERIES WITHOUT INFARCTION,CAR006,CAROTID ENDARTERECTOMY AND STENTING,024,EXTRACRANIAL VASCULAR PROCEDURES,01,DISEASES AND DISORDERS OF THE NERVOUS SYSTEM,1,Minor,Minor,Surgical,Blue Cross/Blue Shield,,,,,false,21076.52,4099.79
Central NY,Onondaga,3301003,000630,St. Joseph's Hospital Health Center,70 or Older,130,F,White,Not Span/Hispanic,1,Elective,Home or Self Care,2018,CIR023,OCCLUSION OR STENOSIS OF PRECEREBRAL OR CEREBRAL ARTERIES WITHOUT INFARCTION,CAR006,CAROTID ENDARTERECTOMY AND STENTING,024,EXTRACRANIAL VASCULAR PROCEDURES,01,DISEASES AND DISORDERS OF THE NERVOUS SYSTEM,1,Minor,Minor,Surgical,Medicare,Private Health Insurance,,,,false,21222.23,9662.51
Western NY,Erie,1401014,000207,Buffalo General Medical Center,50 to 69,140,M,White,Not Span/Hispanic,1,Elective,Home or Self Care,2018,CIR023,OCCLUSION OR STENOSIS OF PRECEREBRAL OR CEREBRAL ARTERIES WITHOUT INFARCTION,CAR006,CAROTID ENDARTERECTOMY AND STENTING,024,EXTRACRANIAL VASCULAR PROCEDURES,01,DISEASES AND DISORDERS OF THE NERVOUS SYSTEM,2,Moderate,Moderate,Surgical,Medicaid,Self-Pay,,,,false,16215.64,6523.81
New York City,Kings,7001020,001305,Maimonides Medical Center,70 or Older,112,M,White,Unknown,6,Emergency,Home or Self Care,2018,CIR020,CEREBRAL INFARCTION,CAR008,ANGIOPLASTY AND RELATED VESSEL PROCEDURES (ENDOVASCULAR; EXCLUDING CAROTID),024,EXTRACRANIAL VASCULAR PROCEDURES,01,DISEASES AND DISORDERS OF THE NERVOUS SYSTEM,3,Major,Major,Surgical,Medicare,Blue Cross/Blue Shield,Self-Pay,,,true,117122.04,24790.05
Long Island,Suffolk,5151001,000245,Stony Brook University Hospital,50 to 69,117,M,White,Not Span/Hispanic,1,Elective,Home or Self Care,2018,CIR023,OCCLUSION OR STENOSIS OF PRECEREBRAL OR CEREBRAL ARTERIES WITHOUT INFARCTION,CAR006,CAROTID ENDARTERECTOMY AND STENTING,024,EXTRACRANIAL VASCULAR PROCEDURES,01,DISEASES AND DISORDERS OF THE NERVOUS SYSTEM,1,Minor,Moderate,Surgical,Blue Cross/Blue Shield,Medicare,,,,false,33978.83,14148.97
Hudson Valley,Westchester,5957001,001139,Westchester Medical Center,70 or Older,105,M,Black/African American,Not Span/Hispanic,9,Emergency,Inpatient Rehabilitation Facility,2018,CIR020,CEREBRAL INFARCTION,CAR008,ANGIOPLASTY AND RELATED VESSEL PROCEDURES (ENDOVASCULAR; EXCLUDING CAROTID),024,EXTRACRANIAL VASCULAR PROCEDURES,01,DISEASES AND DISORDERS OF THE NERVOUS SYSTEM,3,Major,Major,Surgical,Medicare,Medicare,,,,true,234840.67,41042.23
Hudson Valley,Westchester,5957001,001139,Westchester Medical Center,70 or Older,109,F,White,Not Span/Hispanic,10,Emergency,Skilled Nursing Home,2018,CIR020,CEREBRAL INFARCTION,CAR008,ANGIOPLASTY AND RELATED VESSEL PROCEDURES (ENDOVASCULAR; EXCLUDING CAROTID),024,EXTRACRANIAL VASCULAR PROCEDURES,01,DISEASES AND DISORDERS OF THE NERVOUS SYSTEM,3,Major,Moderate,Surgical,Medicare,Blue Cross/Blue Shield,,,,true,247668.38,42728.64
Hudson Valley,Westchester,5957001,001139,Westchester Medical Center,30 to 49,127,M,White,Not Span/Hispanic,11,Emergency,Inpatient Rehabilitation Facility,2018,CIR020,CEREBRAL INFARCTION,CAR006,CAROTID ENDARTERECTOMY AND STENTING,024,EXTRACRANIAL VASCULAR PROCEDURES,01,DISEASES AND DISORDERS OF THE NERVOUS SYSTEM,3,Major,Moderate,Surgical,Medicaid,,,,,true,333708.33,57474.01
Hudson Valley,Westchester,5957001,001139,Westchester Medical Center,50 to 69,109,M,White,Not Span/Hispanic,10,Emergency,Inpatient Rehabilitation Facility,2018,CIR020,CEREBRAL INFARCTION,CAR008,ANGIOPLASTY AND RELATED VESSEL PROCEDURES (ENDOVASCULAR; EXCLUDING CAROTID),024,EXTRACRANIAL VASCULAR PROCEDURES,01,DISEASES AND DISORDERS OF THE NERVOUS SYSTEM,3,Major,Extreme,Surgical,Medicaid,,,,,true,506526.59,88250.9
Hudson Valley,Westchester,5957001,001139,Westchester Medical Center,50 to 69,105,M,Black/African American,Not Span/Hispanic,7,Emergency,Home or Self Care,2018,CIR020,CEREBRAL INFARCTION,CAR008,ANGIOPLASTY AND RELATED VESSEL PROCEDURES (ENDOVASCULAR; EXCLUDING CAROTID),024,EXTRACRANIAL VASCULAR PROCEDURES,01,DISEASES AND DISORDERS OF THE NERVOUS SYSTEM,3,Major,Major,Surgical,Blue Cross/Blue Shield,,,,,true,243463.26,43070.91
Long Island,Suffolk,5151001,000245,Stony Brook University Hospital,70 or Older,117,F,White,Unknown,4,Emergency,Skilled Nursing Home,2018,CIR020,CEREBRAL INFARCTION,CAR008,ANGIOPLASTY AND RELATED VESSEL PROCEDURES (ENDOVASCULAR; EXCLUDING CAROTID),024,EXTRACRANIAL VASCULAR PROCEDURES,01,DISEASES AND DISORDERS OF THE NERVOUS SYSTEM,3,Major,Major,Surgical,Medicare,Medicaid,,,,false,116222.89,45712.8
New York City,Queens,7003004,001630,Long Island Jewish Medical Center,70 or Older,112,F,Other Race,Not Span/Hispanic,1,Elective,Home or Self Care,2018,CIR023,OCCLUSION OR STENOSIS OF PRECEREBRAL OR CEREBRAL ARTERIES WITHOUT INFARCTION,CAR006,CAROTID ENDARTERECTOMY AND STENTING,024,EXTRACRANIAL VASCULAR PROCEDURES,01,DISEASES AND DISORDERS OF THE NERVOUS SYSTEM,1,Minor,Moderate,Surgical,Medicare,Medicare,Self-Pay,,,false,9707.08,1819.35
Long Island,Nassau,2951001,000541,North Shore University Hospital,18 to 29,115,M,White,Spanish/Hispanic,2,Elective,Home or Self Care,2018,MAL001,CARDIAC AND CIRCULATORY CONGENITAL ANOMALIES,CAR010,LIGATION AND EMBOLIZATION OF VESSELS,024,EXTRACRANIAL VASCULAR PROCEDURES,01,DISEASES AND DISORDERS OF THE NERVOUS SYSTEM,1,Minor,Minor,Surgical,Private Health Insurance,,,,,false,148881.09,42127.39
New York City,Manhattan,7002053,001463,NYU Langone Hospitals,70 or Older,112,F,White,Unknown,1,Elective,Home or Self Care,2018,CIR023,OCCLUSION OR STENOSIS OF PRECEREBRAL OR CEREBRAL ARTERIES WITHOUT INFARCTION,CAR006,CAROTID ENDARTERECTOMY AND STENTING,024,EXTRACRANIAL VASCULAR PROCEDURES,01,DISEASES AND DISORDERS OF THE NERVOUS SYSTEM,1,Minor,Minor,Surgical,Medicare,,,,,false,110794.42,18263.61
Finger Lakes,Monroe,2701005,000413,Strong Memorial Hospital,70 or Older,146,F,White,Not Span/Hispanic,1,Elective,Home or Self Care,2018,CIR024,OTHER AND ILL-DEFINED CEREBROVASCULAR DISEASE,CAR010,LIGATION AND EMBOLIZATION OF VESSELS,024,EXTRACRANIAL VASCULAR PROCEDURES,01,DISEASES AND DISORDERS OF THE NERVOUS SYSTEM,1,Minor,Minor,Surgical,Medicare,,,,,false,32144.31,16737.65
Western NY,Erie,1401014,000207,Buffalo General Medical Center,50 to 69,140,M,White,Not Span/Hispanic,2,Emergency,Expired,2018,CIR020,CEREBRAL INFARCTION,CAR008,ANGIOPLASTY AND RELATED VESSEL PROCEDURES (ENDOVASCULAR; EXCLUDING CAROTID),024,EXTRACRANIAL VASCULAR PROCEDURES,01,DISEASES AND DISORDERS OF THE NERVOUS SYSTEM,4,Extreme,Extreme,Surgical,Medicare,Self-Pay,,,,true,46719.27,14798.2
Long Island,Nassau,2908000,000511,NYU Langone Hospital-Long Island,50 to 69,115,M,White,Not Span/Hispanic,8,Emergency,Home or Self Care,2018,NVS010,HEADACHE; INCLUDING MIGRAINE,CAR021,"ARTERY, VEIN, AND GREAT VESSEL PROCEDURES, NEC",024,EXTRACRANIAL VASCULAR PROCEDURES,01,DISEASES AND DISORDERS OF THE NERVOUS SYSTEM,3,Major,Moderate,Surgical,Medicare,Medicare,Private Health Insurance,,,true,130243.93,23054.91
New York City,Richmond,7004003,001740,Staten Island University Hosp-North,50 to 69,,F,Black/African American,Not Span/Hispanic,1,Elective,Home or Self Care,2018,CIR023,OCCLUSION OR STENOSIS OF PRECEREBRAL OR CEREBRAL ARTERIES WITHOUT INFARCTION,CAR006,CAROTID ENDARTERECTOMY AND STENTING,024,EXTRACRANIAL VASCULAR PROCEDURES,01,DISEASES AND DISORDERS OF THE NERVOUS SYSTEM,1,Minor,Moderate,Surgical,Medicare,Medicaid,,,,false,29321.18,8861.54
Central NY,Onondaga,3301003,000630,St. Joseph's Hospital Health Center,50 to 69,130,M,White,Not Span/Hispanic,3,Elective,Home or Self Care,2018,CIR023,OCCLUSION OR STENOSIS OF PRECEREBRAL OR CEREBRAL ARTERIES WITHOUT INFARCTION,CAR006,CAROTID ENDARTERECTOMY AND STENTING,024,EXTRACRANIAL VASCULAR PROCEDURES,01,DISEASES AND DISORDERS OF THE NERVOUS SYSTEM,1,Minor,Minor,Surgical,Private Health Insurance,,,,,false,47079.91,31122.93
Capital/Adirond,Warren,5601000,001005,Glens Falls Hospital,50 to 69,,F,Other Race,Not Span/Hispanic,1,Elective,Home w/ Home Health Services,2018,CIR023,OCCLUSION OR STENOSIS OF PRECEREBRAL OR CEREBRAL ARTERIES WITHOUT INFARCTION,CAR006,CAROTID ENDARTERECTOMY AND STENTING,024,EXTRACRANIAL VASCULAR PROCEDURES,01,DISEASES AND DISORDERS OF THE NERVOUS SYSTEM,1,Minor,Minor,Surgical,Blue Cross/Blue Shield,,,,,false,12973.7,6000.21
Finger Lakes,Monroe,2701003,000411,Rochester General Hospital,50 to 69,146,M,Black/African American,Not Span/Hispanic,2,Elective,Home or Self Care,2018,CIR023,OCCLUSION OR STENOSIS OF PRECEREBRAL OR CEREBRAL ARTERIES WITHOUT INFARCTION,CAR006,CAROTID ENDARTERECTOMY AND STENTING,024,EXTRACRANIAL VASCULAR PROCEDURES,01,DISEASES AND DISORDERS OF THE NERVOUS SYSTEM,2,Moderate,Moderate,Surgical,Medicaid,,,,,false,10418.95,4311.95
Finger Lakes,Monroe,2701003,000411,Rochester General Hospital,70 or Older,144,F,White,Not Span/Hispanic,4,Emergency,Expired,2018,CIR020,CEREBRAL INFARCTION,CAR008,ANGIOPLASTY AND RELATED VESSEL PROCEDURES (ENDOVASCULAR; EXCLUDING CAROTID),024,EXTRACRANIAL VASCULAR PROCEDURES,01,DISEASES AND DISORDERS OF THE NERVOUS SYSTEM,4,Extreme,Extreme,Surgical,Medicare,Medicare,,,,true,42608.08,15239.65
Central NY,Onondaga,3301007,000635,University Hospital SUNY Health Science Center,70 or Older,130,M,White,Not Span/Hispanic,1,Elective,Home or Self Care,2018,CIR023,OCCLUSION OR STENOSIS OF PRECEREBRAL OR CEREBRAL ARTERIES WITHOUT INFARCTION,CAR006,CAROTID ENDARTERECTOMY AND STENTING,024,EXTRACRANIAL VASCULAR PROCEDURES,01,DISEASES AND DISORDERS OF THE NERVOUS SYSTEM,2,Moderate,Moderate,Surgical,Medicare,Private Health Insurance,,,,false,42444.7,14236.19
Central NY,Onondaga,3301007,000635,University Hospital SUNY Health Science Center,50 to 69,131,F,White,Not Span/Hispanic,2,Elective,Home or Self Care,2018,CIR023,OCCLUSION OR STENOSIS OF PRECEREBRAL OR CEREBRAL ARTERIES WITHOUT INFARCTION,CAR006,CAROTID ENDARTERECTOMY AND STENTING,024,EXTRACRANIAL VASCULAR PROCEDURES,01,DISEASES AND DISORDERS OF THE NERVOUS SYSTEM,2,Moderate,Minor,Surgical,Medicaid,,,,,false,50736.9,13361.55
New York City,Manhattan,7002002,001439,Mount Sinai Beth Israel,50 to 69,110,M,Other Race,Unknown,3,Emergency,Short-term Hospital,2018,CIR020,CEREBRAL INFARCTION,CAR008,ANGIOPLASTY AND RELATED VESSEL PROCEDURES (ENDOVASCULAR; EXCLUDING CAROTID),024,EXTRACRANIAL VASCULAR PROCEDURES,01,DISEASES AND DISORDERS OF THE NERVOUS SYSTEM,4,Extreme,Extreme,Surgical,Private Health Insurance,Self-Pay,,,,true,141479.85,29575.41
Western NY,Erie,1401014,000207,Buffalo General Medical Center,70 or Older,147,F,White,Not Span/Hispanic,1,Elective,Home or Self Care,2018,CIR023,OCCLUSION OR STENOSIS OF PRECEREBRAL OR CEREBRAL ARTERIES WITHOUT INFARCTION,CAR006,CAROTID ENDARTERECTOMY AND STENTING,024,EXTRACRANIAL VASCULAR PROCEDURES,01,DISEASES AND DISORDERS OF THE NERVOUS SYSTEM,2,Moderate,Moderate,Surgical,Medicare,Self-Pay,,,,false,17372.46,6233.98
Capital/Adirond,Albany,0101000,000001,Albany Medical Center Hospital,70 or Older,129,M,White,Not Span/Hispanic,39,Emergency,Medicare Cert Long Term Care Hospital,2018,CIR020,CEREBRAL INFARCTION,CAR008,ANGIOPLASTY AND RELATED VESSEL PROCEDURES (ENDOVASCULAR; EXCLUDING CAROTID),024,EXTRACRANIAL VASCULAR PROCEDURES,01,DISEASES AND DISORDERS OF THE NERVOUS SYSTEM,4,Extreme,Extreme,Surgical,Private Health Insurance,,,,,true,224230.43,70059.17
Long Island,Nassau,2908000,000511,NYU Langone Hospital-Long Island,70 or Older,118,M,White,Not Span/Hispanic,10,Emergency,Home w/ Home Health Services,2018,CIR020,CEREBRAL INFARCTION,CAR021,"ARTERY, VEIN, AND GREAT VESSEL PROCEDURES, NEC",024,EXTRACRANIAL VASCULAR PROCEDURES,01,DISEASES AND DISORDERS OF THE NERVOUS SYSTEM,3,Major,Major,Surgical,Medicare,Medicare,Private Health Insurance,,,true,299540.51,43954.92
Hudson Valley,Westchester,5957001,001139,Westchester Medical Center,70 or Older,105,M,White,Not Span/Hispanic,3,Urgent,Home or Self Care,2018,CIR023,OCCLUSION OR STENOSIS OF PRECEREBRAL OR CEREBRAL ARTERIES WITHOUT INFARCTION,CAR006,CAROTID ENDARTERECTOMY AND STENTING,024,EXTRACRANIAL VASCULAR PROCEDURES,01,DISEASES AND DISORDERS OF THE NERVOUS SYSTEM,1,Minor,Minor,Surgical,Medicare,Blue Cross/Blue Shield,,,,false,118850.73,23174.57
Western NY,Erie,1401014,000207,Buffalo General Medical Center,50 to 69,OOS,M,White,Not Span/Hispanic,13,Emergency,Home or Self Care,2018,CIR021,ACUTE HEMORRHAGIC CEREBROVASCULAR DISEASE,CAR011,ANEURYSM REPAIR PROCEDURES,024,EXTRACRANIAL VASCULAR PROCEDURES,01,DISEASES AND DISORDERS OF THE NERVOUS SYSTEM,2,Moderate,Minor,Surgical,Blue Cross/Blue Shield,Self-Pay,,,,true,133608.39,45523.13
New York City,Kings,7001021,001306,New York - Presbyterian Brooklyn Methodist Hospital,50 to 69,112,F,Black/African American,Not Span/Hispanic,2,Elective,Home or Self Care,2018,CIR024,OTHER AND ILL-DEFINED CEREBROVASCULAR DISEASE,CAR006,CAROTID ENDARTERECTOMY AND STENTING,024,EXTRACRANIAL VASCULAR PROCEDURES,01,DISEASES AND DISORDERS OF THE NERVOUS SYSTEM,1,Minor,Minor,Surgical,"Managed Care, Unspecified",Medicaid,Self-Pay,,,false,45680.75,15261.32
Capital/Adirond,Schenectady,4601001,000829,Ellis Hospital,50 to 69,133,M,White,Not Span/Hispanic,1,Elective,Home or Self Care,2018,CIR023,OCCLUSION OR STENOSIS OF PRECEREBRAL OR CEREBRAL ARTERIES WITHOUT INFARCTION,CAR006,CAROTID ENDARTERECTOMY AND STENTING,024,EXTRACRANIAL VASCULAR PROCEDURES,01,DISEASES AND DISORDERS OF THE NERVOUS SYSTEM,1,Minor,Minor,Surgical,Medicaid,Medicaid,,,,false,17925.99,6966.42
Finger Lakes,Monroe,2701005,000413,Strong Memorial Hospital,50 to 69,144,F,Black/African American,Not Span/Hispanic,4,Emergency,Inpatient Rehabilitation Facility,2018,CIR020,CEREBRAL INFARCTION,CAR006,CAROTID ENDARTERECTOMY AND STENTING,024,EXTRACRANIAL VASCULAR PROCEDURES,01,DISEASES AND DISORDERS OF THE NERVOUS SYSTEM,3,Major,Moderate,Surgical,Medicare,Medicaid,Self-Pay,,,true,54332.33,21632.24
Capital/Adirond,Albany,0101004,000005,St. Peter's Hospital,50 to 69,120,M,White,Not Span/Hispanic,1,Elective,Home or Self Care,2018,CIR023,OCCLUSION OR STENOSIS OF PRECEREBRAL OR CEREBRAL ARTERIES WITHOUT INFARCTION,CAR006,CAROTID ENDARTERECTOMY AND STENTING,024,EXTRACRANIAL VASCULAR PROCEDURES,01,DISEASES AND DISORDERS OF THE NERVOUS SYSTEM,1,Minor,Minor,Surgical,Medicare,Medicare,,,,false,17054.8,7050.07