Hospital Service Area,Hospital County,Operating Certificate Number,Permanent Facility Id,Facility Name,Age Group,Zip Code - 3 digits,Gender,Race,Ethnicity,Length of Stay,Type of Admission,Patient Disposition,Discharge Year,CCS Diagnosis Code,CCS Diagnosis Description,CCS Procedure Code,CCS Procedure Description,APR DRG Code,APR DRG Description,APR MDC Code,APR MDC Description,APR Severity of Illness Code,APR Severity of Illness Description,APR Risk of Mortality,APR Medical Surgical Description,Payment Typology 1,Payment Typology 2,Payment Typology 3,Birth Weight,Abortion Edit Indicator,Emergency Department Indicator,Total Charges,Total Costs
New York City,Manhattan,7002001,001438,Bellevue Hospital Center,30 to 49,100,M,Black/African American,Not Span/Hispanic,1,Emergency,Home or Self Care,2019,INJ025,"INJURY TO NERVES, MUSCLES AND TENDONS, INITIAL ENCOUNTER",CAR010,LIGATION AND EMBOLIZATION OF VESSELS,024,EXTRACRANIAL VASCULAR PROCEDURES,01,DISEASES AND DISORDERS OF THE NERVOUS SYSTEM,2,Moderate,Minor,Surgical,Medicaid,Medicaid,,,,true,17504.04,11633.18
New York City,Manhattan,7002001,001438,Bellevue Hospital Center,50 to 69,100,M,Other Race,Not Span/Hispanic,5,Emergency,Home or Self Care,2019,CIR020,CEREBRAL INFARCTION,CAR008,ANGIOPLASTY AND RELATED VESSEL PROCEDURES (ENDOVASCULAR; EXCLUDING CAROTID),024,EXTRACRANIAL VASCULAR PROCEDURES,01,DISEASES AND DISORDERS OF THE NERVOUS SYSTEM,3,Major,Moderate,Surgical,Medicaid,Medicaid,,,,true,42566.45,28289.66
New York City,Manhattan,7002001,001438,Bellevue Hospital Center,50 to 69,104,M,Black/African American,Not Span/Hispanic,11,Emergency,Home or Self Care,2019,CIR020,CEREBRAL INFARCTION,CAR008,ANGIOPLASTY AND RELATED VESSEL PROCEDURES (ENDOVASCULAR; EXCLUDING CAROTID),024,EXTRACRANIAL VASCULAR PROCEDURES,01,DISEASES AND DISORDERS OF THE NERVOUS SYSTEM,4,Extreme,Extreme,Surgical,Private Health Insurance,,,,,false,73293.33,48710.75
New York City,Manhattan,7002001,001438,Bellevue Hospital Center,70 or Older,114,M,Black/African American,Not Span/Hispanic,13,Emergency,Home w/ Home Health Services,2019,CIR020,CEREBRAL INFARCTION,CAR006,CAROTID ENDARTERECTOMY AND STENTING,024,EXTRACRANIAL VASCULAR PROCEDURES,01,DISEASES AND DISORDERS OF THE NERVOUS SYSTEM,3,Major,Moderate,Surgical,Medicare,Medicare,,,,false,75460.31,50150.92
New York City,Manhattan,7002001,001438,Bellevue Hospital Center,30 to 49,104,M,Black/African American,Not Span/Hispanic,4,Emergency,Home or Self Care,2019,CIR020,CEREBRAL INFARCTION,CAR006,CAROTID ENDARTERECTOMY AND STENTING,024,EXTRACRANIAL VASCULAR PROCEDURES,01,DISEASES AND DISORDERS OF THE NERVOUS SYSTEM,3,Major,Extreme,Surgical,Medicaid,,,,,true,41290.83,27441.89
New York City,Manhattan,7002001,001438,Bellevue Hospital Center,30 to 49,100,F,Other Race,Spanish/Hispanic,1,Emergency,Home or Self Care,2019,CIR024,OTHER AND ILL-DEFINED CEREBROVASCULAR DISEASE,CAR006,CAROTID ENDARTERECTOMY AND STENTING,024,EXTRACRANIAL VASCULAR PROCEDURES,01,DISEASES AND DISORDERS OF THE NERVOUS SYSTEM,1,Minor,Minor,Surgical,Medicaid,,,,,false,9056.34,6018.84
New York City,Manhattan,7002001,001438,Bellevue Hospital Center,50 to 69,112,F,Other Race,Spanish/Hispanic,5,Emergency,Inpatient Rehabilitation Facility,2019,CIR020,CEREBRAL INFARCTION,CAR008,ANGIOPLASTY AND RELATED VESSEL PROCEDURES (ENDOVASCULAR; EXCLUDING CAROTID),024,EXTRACRANIAL VASCULAR PROCEDURES,01,DISEASES AND DISORDERS OF THE NERVOUS SYSTEM,4,Extreme,Major,Surgical,Medicaid,,,,,false,39589.88,26311.43
New York City,Manhattan,7002001,001438,Bellevue Hospital Center,50 to 69,104,F,Black/African American,Not Span/Hispanic,7,Emergency,Skilled Nursing Home,2019,CIR023,OCCLUSION OR STENOSIS OF PRECEREBRAL OR CEREBRAL ARTERIES WITHOUT INFARCTION,CAR006,CAROTID ENDARTERECTOMY AND STENTING,024,EXTRACRANIAL VASCULAR PROCEDURES,01,DISEASES AND DISORDERS OF THE NERVOUS SYSTEM,2,Moderate,Minor,Surgical,Private Health Insurance,Medicaid,,,,false,39552.62,26286.67
New York City,Manhattan,7002001,001438,Bellevue Hospital Center,70 or Older,112,F,Other Race,Not Span/Hispanic,9,Emergency,Inpatient Rehabilitation Facility,2019,CIR020,CEREBRAL INFARCTION,CAR006,CAROTID ENDARTERECTOMY AND STENTING,024,EXTRACRANIAL VASCULAR PROCEDURES,01,DISEASES AND DISORDERS OF THE NERVOUS SYSTEM,4,Extreme,Extreme,Surgical,Medicare,Medicare,Medicaid,,,false,64017.77,42546.21
New York City,Manhattan,7002001,001438,Bellevue Hospital Center,70 or Older,112,F,Other Race,Not Span/Hispanic,3,Emergency,Home or Self Care,2019,CIR020,CEREBRAL INFARCTION,CAR006,CAROTID ENDARTERECTOMY AND STENTING,024,EXTRACRANIAL VASCULAR PROCEDURES,01,DISEASES AND DISORDERS OF THE NERVOUS SYSTEM,3,Major,Moderate,Surgical,Medicaid,,,,,false,28397.33,18872.87
New York City,Manhattan,7002001,001438,Bellevue Hospital Center,50 to 69,112,F,Black/African American,Not Span/Hispanic,13,Emergency,Inpatient Rehabilitation Facility,2019,CIR020,CEREBRAL INFARCTION,CAR008,ANGIOPLASTY AND RELATED VESSEL PROCEDURES (ENDOVASCULAR; EXCLUDING CAROTID),024,EXTRACRANIAL VASCULAR PROCEDURES,01,DISEASES AND DISORDERS OF THE NERVOUS SYSTEM,3,Major,Major,Surgical,Blue Cross/Blue Shield,Medicare,,,,false,91598.97,60876.68
New York City,Manhattan,7002001,001438,Bellevue Hospital Center,70 or Older,112,F,Other Race,Spanish/Hispanic,2,Emergency,Expired,2019,CIR020,CEREBRAL INFARCTION,CAR006,CAROTID ENDARTERECTOMY AND STENTING,024,EXTRACRANIAL VASCULAR PROCEDURES,01,DISEASES AND DISORDERS OF THE NERVOUS SYSTEM,3,Major,Major,Surgical,Medicare,Medicaid,,,,false,25887.94,17205.12
New York City,Manhattan,7002001,001438,Bellevue Hospital Center,70 or Older,100,F,Other Race,Not Span/Hispanic,9,Emergency,Home or Self Care,2019,NVS010,HEADACHE; INCLUDING MIGRAINE,CAR021,"ARTERY, VEIN, AND GREAT VESSEL PROCEDURES, NEC",024,EXTRACRANIAL VASCULAR PROCEDURES,01,DISEASES AND DISORDERS OF THE NERVOUS SYSTEM,3,Major,Major,Surgical,Medicare,Medicare,,,,true,52213.38,34701.01
New York City,Manhattan,7002001,001438,Bellevue Hospital Center,50 to 69,113,M,Other Race,Not Span/Hispanic,5,Emergency,Home w/ Home Health Services,2019,CIR020,CEREBRAL INFARCTION,ADM005,ADMINISTRATION OF THROMBOLYTICS AND PLATELET INHIBITORS,024,EXTRACRANIAL VASCULAR PROCEDURES,01,DISEASES AND DISORDERS OF THE NERVOUS SYSTEM,2,Moderate,Moderate,Surgical,Medicaid,Medicaid,,,,false,39220.69,26066.07
New York City,Manhattan,7002001,001438,Bellevue Hospital Center,30 to 49,113,F,Other Race,Spanish/Hispanic,1,Elective,Home or Self Care,2019,CIR023,OCCLUSION OR STENOSIS OF PRECEREBRAL OR CEREBRAL ARTERIES WITHOUT INFARCTION,CAR006,CAROTID ENDARTERECTOMY AND STENTING,024,EXTRACRANIAL VASCULAR PROCEDURES,01,DISEASES AND DISORDERS OF THE NERVOUS SYSTEM,2,Moderate,Minor,Surgical,Self-Pay,,,,,false,55050.91,36586.83
New York City,Manhattan,7002001,001438,Bellevue Hospital Center,30 to 49,104,F,Black/African American,Spanish/Hispanic,1,Elective,Home or Self Care,2019,CIR024,OTHER AND ILL-DEFINED CEREBROVASCULAR DISEASE,CAR011,ANEURYSM REPAIR PROCEDURES,024,EXTRACRANIAL VASCULAR PROCEDURES,01,DISEASES AND DISORDERS OF THE NERVOUS SYSTEM,1,Minor,Minor,Surgical,Medicaid,,,,,false,42767.24,28423.11
New York City,Manhattan,7002001,001438,Bellevue Hospital Center,70 or Older,OOS,M,Other Race,Unknown,6,Emergency,Home or Self Care,2019,CIR020,CEREBRAL INFARCTION,CAR006,CAROTID ENDARTERECTOMY AND STENTING,024,EXTRACRANIAL VASCULAR PROCEDURES,01,DISEASES AND DISORDERS OF THE NERVOUS SYSTEM,3,Major,Major,Surgical,Private Health Insurance,,,,,true,86476.18,57472.07
New York City,Manhattan,7002001,001438,Bellevue Hospital Center,70 or Older,100,M,Other Race,Not Span/Hispanic,42,Emergency,Hospice - Medical Facility,2019,CIR020,CEREBRAL INFARCTION,CAR008,ANGIOPLASTY AND RELATED VESSEL PROCEDURES (ENDOVASCULAR; EXCLUDING CAROTID),024,EXTRACRANIAL VASCULAR PROCEDURES,01,DISEASES AND DISORDERS OF THE NERVOUS SYSTEM,4,Extreme,Extreme,Surgical,Medicare,,,,,true,290479.55,193052.71
New York City,Manhattan,7002001,001438,Bellevue Hospital Center,18 to 29,112,M,Other Race,Not Span/Hispanic,7,Urgent,Inpatient Rehabilitation Facility,2019,CIR021,ACUTE HEMORRHAGIC CEREBROVASCULAR DISEASE,CAR011,ANEURYSM REPAIR PROCEDURES,024,EXTRACRANIAL VASCULAR PROCEDURES,01,DISEASES AND DISORDERS OF THE NERVOUS SYSTEM,4,Extreme,Major,Surgical,Private Health Insurance,,,,,true,100181.03,66580.31
New York City,Manhattan,7002001,001438,Bellevue Hospital Center,70 or Older,100,M,Black/African American,Not Span/Hispanic,20,Emergency,Expired,2019,CIR020,CEREBRAL INFARCTION,CAR008,ANGIOPLASTY AND RELATED VESSEL PROCEDURES (ENDOVASCULAR; EXCLUDING CAROTID),024,EXTRACRANIAL VASCULAR PROCEDURES,01,DISEASES AND DISORDERS OF THE NERVOUS SYSTEM,4,Extreme,Extreme,Surgical,Medicare,,,,,false,242053.7,160868.89
New York City,Manhattan,7002001,001438,Bellevue Hospital Center,50 to 69,112,F,Other Race,Unknown,1,Elective,Home or Self Care,2019,CIR024,OTHER AND ILL-DEFINED CEREBROVASCULAR DISEASE,CAR006,CAROTID ENDARTERECTOMY AND STENTING,024,EXTRACRANIAL VASCULAR PROCEDURES,01,DISEASES AND DISORDERS OF THE NERVOUS SYSTEM,2,Moderate,Minor,Surgical,Medicaid,,,,,false,25821.55,17161
New York City,Manhattan,7002001,001438,Bellevue Hospital Center,50 to 69,100,F,Other Race,Unknown,4,Emergency,Home or Self Care,2019,CIR020,CEREBRAL INFARCTION,CAR008,ANGIOPLASTY AND RELATED VESSEL PROCEDURES (ENDOVASCULAR; EXCLUDING CAROTID),024,EXTRACRANIAL VASCULAR PROCEDURES,01,DISEASES AND DISORDERS OF THE NERVOUS SYSTEM,3,Major,Major,Surgical,Private Health Insurance,,,,,true,61195.82,40670.74
New York City,Manhattan,7002001,001438,Bellevue Hospital Center,70 or Older,104,F,Other Race,Spanish/Hispanic,24,Urgent,Inpatient Rehabilitation Facility,2019,CIR020,CEREBRAL INFARCTION,CAR006,CAROTID ENDARTERECTOMY AND STENTING,024,EXTRACRANIAL VASCULAR PROCEDURES,01,DISEASES AND DISORDERS OF THE NERVOUS SYSTEM,3,Major,Major,Surgical,Medicare,,,,,false,222806.75,148077.37
New York City,Manhattan,7002001,001438,Bellevue Hospital Center,50 to 69,100,F,Other Race,Unknown,5,Emergency,Home or Self Care,2019,CIR020,CEREBRAL INFARCTION,CAR008,ANGIOPLASTY AND RELATED VESSEL PROCEDURES (ENDOVASCULAR; EXCLUDING CAROTID),024,EXTRACRANIAL VASCULAR PROCEDURES,01,DISEASES AND DISORDERS OF THE NERVOUS SYSTEM,3,Major,Moderate,Surgical,Private Health Insurance,,,,,true,90448.01,60111.75
New York City,Manhattan,7002001,001438,Bellevue Hospital Center,70 or Older,100,M,Other Race,Unknown,18,Emergency,Expired,2019,CIR020,CEREBRAL INFARCTION,CAR008,ANGIOPLASTY AND RELATED VESSEL PROCEDURES (ENDOVASCULAR; EXCLUDING CAROTID),024,EXTRACRANIAL VASCULAR PROCEDURES,01,DISEASES AND DISORDERS OF THE NERVOUS SYSTEM,4,Extreme,Extreme,Surgical,Medicare,,,,,true,244874.16,162743.37
New York City,Manhattan,7002001,001438,Bellevue Hospital Center,50 to 69,100,M,Black/African American,Unknown,1,Elective,Home or Self Care,2019,CIR024,OTHER AND ILL-DEFINED CEREBROVASCULAR DISEASE,CAR011,ANEURYSM REPAIR PROCEDURES,024,EXTRACRANIAL VASCULAR PROCEDURES,01,DISEASES AND DISORDERS OF THE NERVOUS SYSTEM,1,Minor,Minor,Surgical,Medicaid,,,,,false,22769.37,15132.52
New York City,Manhattan,7002001,001438,Bellevue Hospital Center,70 or Older,100,F,Other Race,Spanish/Hispanic,1,Elective,Home or Self Care,2019,CIR024,OTHER AND ILL-DEFINED CEREBROVASCULAR DISEASE,CAR006,CAROTID ENDARTERECTOMY AND STENTING,024,EXTRACRANIAL VASCULAR PROCEDURES,01,DISEASES AND DISORDERS OF THE NERVOUS SYSTEM,1,Minor,Minor,Surgical,Medicare,Medicaid,,,,false,276924.94,184044.32
New York City,Manhattan,7002001,001438,Bellevue Hospital Center,70 or Older,112,M,Other Race,Spanish/Hispanic,7,Emergency,Inpatient Rehabilitation Facility,2019,CIR020,CEREBRAL INFARCTION,CAR006,CAROTID ENDARTERECTOMY AND STENTING,024,EXTRACRANIAL VASCULAR PROCEDURES,01,DISEASES AND DISORDERS OF THE NERVOUS SYSTEM,3,Major,Major,Surgical,Medicare,,,,,true,88962.08,59124.2
New York City,Manhattan,7002001,001438,Bellevue Hospital Center,50 to 69,104,M,Other Race,Not Span/Hispanic,11,Urgent,Inpatient Rehabilitation Facility,2019,CIR020,CEREBRAL INFARCTION,CAR008,ANGIOPLASTY AND RELATED VESSEL PROCEDURES (ENDOVASCULAR; EXCLUDING CAROTID),024,EXTRACRANIAL VASCULAR PROCEDURES,01,DISEASES AND DISORDERS OF THE NERVOUS SYSTEM,4,Extreme,Major,Surgical,Medicare,,,,,false,135827.16,90270.73
New York City,Manhattan,7002001,001438,Bellevue Hospital Center,50 to 69,104,M,Other Race,Spanish/Hispanic,12,Urgent,Home or Self Care,2019,CIR021,ACUTE HEMORRHAGIC CEREBROVASCULAR DISEASE,CAR011,ANEURYSM REPAIR PROCEDURES,024,EXTRACRANIAL VASCULAR PROCEDURES,01,DISEASES AND DISORDERS OF THE NERVOUS SYSTEM,1,Minor,Minor,Surgical,Private Health Insurance,,,,,false,97930.23,65084.43
New York City,Manhattan,7002001,001438,Bellevue Hospital Center,30 to 49,104,F,Other Race,Spanish/Hispanic,1,Elective,Home or Self Care,2019,CIR024,OTHER AND ILL-DEFINED CEREBROVASCULAR DISEASE,CAR006,CAROTID ENDARTERECTOMY AND STENTING,024,EXTRACRANIAL VASCULAR PROCEDURES,01,DISEASES AND DISORDERS OF THE NERVOUS SYSTEM,1,Minor,Minor,Surgical,Medicare,Medicaid,,,,false,73333.96,48737.75
New York City,Manhattan,7002001,001438,Bellevue Hospital Center,50 to 69,112,M,Other Race,Spanish/Hispanic,12,Urgent,Inpatient Rehabilitation Facility,2019,CIR020,CEREBRAL INFARCTION,CAR008,ANGIOPLASTY AND RELATED VESSEL PROCEDURES (ENDOVASCULAR; EXCLUDING CAROTID),024,EXTRACRANIAL VASCULAR PROCEDURES,01,DISEASES AND DISORDERS OF THE NERVOUS SYSTEM,4,Extreme,Extreme,Surgical,Medicaid,,,,,false,123070.63,81792.74
New York City,Manhattan,7002001,001438,Bellevue Hospital Center,30 to 49,112,F,Other Race,Not Span/Hispanic,8,Urgent,Inpatient Rehabilitation Facility,2019,CIR020,CEREBRAL INFARCTION,CAR008,ANGIOPLASTY AND RELATED VESSEL PROCEDURES (ENDOVASCULAR; EXCLUDING CAROTID),024,EXTRACRANIAL VASCULAR PROCEDURES,01,DISEASES AND DISORDERS OF THE NERVOUS SYSTEM,4,Extreme,Extreme,Surgical,Private Health Insurance,,,,,false,113211.02,75240.04
New York City,Manhattan,7002001,001438,Bellevue Hospital Center,50 to 69,104,M,Other Race,Spanish/Hispanic,3,Elective,Skilled Nursing Home,2019,CIR024,OTHER AND ILL-DEFINED CEREBROVASCULAR DISEASE,CAR011,ANEURYSM REPAIR PROCEDURES,024,EXTRACRANIAL VASCULAR PROCEDURES,01,DISEASES AND DISORDERS OF THE NERVOUS SYSTEM,2,Moderate,Minor,Surgical,Medicare,,,,,false,23876.68,15868.44
New York City,Manhattan,7002001,001438,Bellevue Hospital Center,50 to 69,114,M,Other Race,Not Span/Hispanic,11,Urgent,Inpatient Rehabilitation Facility,2019,CIR021,ACUTE HEMORRHAGIC CEREBROVASCULAR DISEASE,CAR011,ANEURYSM REPAIR PROCEDURES,024,EXTRACRANIAL VASCULAR PROCEDURES,01,DISEASES AND DISORDERS OF THE NERVOUS SYSTEM,4,Extreme,Major,Surgical,Medicaid,,,,,false,134314.75,89265.58
New York City,Manhattan,7002001,001438,Bellevue Hospital Center,50 to 69,113,M,Other Race,Unknown,21,Emergency,Inpatient Rehabilitation Facility,2019,CIR020,CEREBRAL INFARCTION,CAR008,ANGIOPLASTY AND RELATED VESSEL PROCEDURES (ENDOVASCULAR; EXCLUDING CAROTID),024,EXTRACRANIAL VASCULAR PROCEDURES,01,DISEASES AND DISORDERS OF THE NERVOUS SYSTEM,4,Extreme,Extreme,Surgical,Private Health Insurance,,,,,true,264221.15,175601.38
New York City,Manhattan,7002001,001438,Bellevue Hospital Center,70 or Older,100,F,Black/African American,Unknown,1,Elective,Home or Self Care,2019,CIR024,OTHER AND ILL-DEFINED CEREBROVASCULAR DISEASE,CAR011,ANEURYSM REPAIR PROCEDURES,024,EXTRACRANIAL VASCULAR PROCEDURES,01,DISEASES AND DISORDERS OF THE NERVOUS SYSTEM,1,Minor,Minor,Surgical,Self-Pay,,,,,false,55656.25,36989.14
New York City,Manhattan,7002001,001438,Bellevue Hospital Center,70 or Older,100,M,Black/African American,Spanish/Hispanic,3,Urgent,Home or Self Care,2019,CIR020,CEREBRAL INFARCTION,CAR008,ANGIOPLASTY AND RELATED VESSEL PROCEDURES (ENDOVASCULAR; EXCLUDING CAROTID),024,EXTRACRANIAL VASCULAR PROCEDURES,01,DISEASES AND DISORDERS OF THE NERVOUS SYSTEM,3,Major,Moderate,Surgical,Medicare,Medicaid,,,,false,24092.86,16012.11
New York City,Manhattan,7002001,001438,Bellevue Hospital Center,70 or Older,,F,Multi-racial,Spanish/Hispanic,6,Urgent,Short-term Hospital,2019,CIR020,CEREBRAL INFARCTION,CAR008,ANGIOPLASTY AND RELATED VESSEL PROCEDURES (ENDOVASCULAR; EXCLUDING CAROTID),024,EXTRACRANIAL VASCULAR PROCEDURES,01,DISEASES AND DISORDERS OF THE NERVOUS SYSTEM,3,Major,Major,Surgical,Medicaid,,,,,false,76614.61,50918.07
New York City,Manhattan,7002001,001438,Bellevue Hospital Center,30 to 49,104,M,Other Race,Unknown,2,Urgent,Home or Self Care,2019,CIR020,CEREBRAL INFARCTION,CAR006,CAROTID ENDARTERECTOMY AND STENTING,024,EXTRACRANIAL VASCULAR PROCEDURES,01,DISEASES AND DISORDERS OF THE NERVOUS SYSTEM,3,Major,Moderate,Surgical,Medicare,,,,,false,34710.95,23068.9
New York City,Manhattan,7002001,001438,Bellevue Hospital Center,30 to 49,104,M,Other Race,Not Span/Hispanic,1,Emergency,Expired,2019,CIR020,CEREBRAL INFARCTION,CAR004,PERCUTANEOUS CORONARY INTERVENTIONS (PCI),024,EXTRACRANIAL VASCULAR PROCEDURES,01,DISEASES AND DISORDERS OF THE NERVOUS SYSTEM,4,Extreme,Extreme,Surgical,Medicaid,,,,,false,69441.88,46151.07
New York City,Manhattan,7002001,001438,Bellevue Hospital Center,50 to 69,114,M,Other Race,Not Span/Hispanic,3,Emergency,Inpatient Rehabilitation Facility,2019,CIR020,CEREBRAL INFARCTION,CAR006,CAROTID ENDARTERECTOMY AND STENTING,024,EXTRACRANIAL VASCULAR PROCEDURES,01,DISEASES AND DISORDERS OF THE NERVOUS SYSTEM,4,Extreme,Major,Surgical,Medicaid,,,,,false,78369.27,52084.22
New York City,Manhattan,7002001,001438,Bellevue Hospital Center,50 to 69,112,F,Black/African American,Not Span/Hispanic,1,Elective,Home or Self Care,2019,CIR024,OTHER AND ILL-DEFINED CEREBROVASCULAR DISEASE,CAR006,CAROTID ENDARTERECTOMY AND STENTING,024,EXTRACRANIAL VASCULAR PROCEDURES,01,DISEASES AND DISORDERS OF THE NERVOUS SYSTEM,1,Minor,Minor,Surgical,Medicaid,,,,,false,52674.44,35007.43
New York City,Manhattan,7002001,001438,Bellevue Hospital Center,70 or Older,112,M,Other Race,Not Span/Hispanic,5,Urgent,Home or Self Care,2019,CIR020,CEREBRAL INFARCTION,CAR006,CAROTID ENDARTERECTOMY AND STENTING,024,EXTRACRANIAL VASCULAR PROCEDURES,01,DISEASES AND DISORDERS OF THE NERVOUS SYSTEM,4,Extreme,Major,Surgical,Medicare,,,,,false,88880.65,59070.08
New York City,Manhattan,7002001,001438,Bellevue Hospital Center,50 to 69,112,M,Black/African American,Not Span/Hispanic,8,Urgent,Home or Self Care,2019,CIR020,CEREBRAL INFARCTION,CAR006,CAROTID ENDARTERECTOMY AND STENTING,024,EXTRACRANIAL VASCULAR PROCEDURES,01,DISEASES AND DISORDERS OF THE NERVOUS SYSTEM,3,Major,Moderate,Surgical,Medicaid,,,,,false,126210.77,83879.68
New York City,Manhattan,7002001,001438,Bellevue Hospital Center,30 to 49,104,M,Other Race,Not Span/Hispanic,3,Trauma,Inpatient Rehabilitation Facility,2019,CIR020,CEREBRAL INFARCTION,CAR008,ANGIOPLASTY AND RELATED VESSEL PROCEDURES (ENDOVASCULAR; EXCLUDING CAROTID),024,EXTRACRANIAL VASCULAR PROCEDURES,01,DISEASES AND DISORDERS OF THE NERVOUS SYSTEM,3,Major,Major,Surgical,Miscellaneous/Other,,,,,true,60128.28,39961.25
New York City,Manhattan,7002001,001438,Bellevue Hospital Center,70 or Older,112,F,Other Race,Spanish/Hispanic,10,Urgent,Inpatient Rehabilitation Facility,2019,CIR020,CEREBRAL INFARCTION,CAR008,ANGIOPLASTY AND RELATED VESSEL PROCEDURES (ENDOVASCULAR; EXCLUDING CAROTID),024,EXTRACRANIAL VASCULAR PROCEDURES,01,DISEASES AND DISORDERS OF THE NERVOUS SYSTEM,4,Extreme,Extreme,Surgical,Medicare,Medicaid,,,,false,112704.92,74903.69
New York City,Manhattan,7002001,001438,Bellevue Hospital Center,30 to 49,114,M,Other Race,Spanish/Hispanic,1,Elective,Home or Self Care,2019,CIR024,OTHER AND ILL-DEFINED CEREBROVASCULAR DISEASE,IMG002,FLUOROSCOPIC ANGIOGRAPHY (EXCLUDING CORONARY),024,EXTRACRANIAL VASCULAR PROCEDURES,01,DISEASES AND DISORDERS OF THE NERVOUS SYSTEM,1,Minor,Minor,Surgical,Medicaid,,,,,false,17508.76,11636.32
New York City,Manhattan,7002001,001438,Bellevue Hospital Center,30 to 49,112,M,White,Not Span/Hispanic,1,Elective,Home or Self Care,2019,CIR024,OTHER AND ILL-DEFINED CEREBROVASCULAR DISEASE,CAR006,CAROTID ENDARTERECTOMY AND STENTING,024,EXTRACRANIAL VASCULAR PROCEDURES,01,DISEASES AND DISORDERS OF THE NERVOUS SYSTEM,1,Minor,Minor,Surgical,Private Health Insurance,,,,,false,61710.74,41012.96
New York City,Manhattan,7002001,001438,Bellevue Hospital Center,50 to 69,113,M,Other Race,Not Span/Hispanic,13,Emergency,Inpatient Rehabilitation Facility,2019,CIR020,CEREBRAL INFARCTION,CAR006,CAROTID ENDARTERECTOMY AND STENTING,024,EXTRACRANIAL VASCULAR PROCEDURES,01,DISEASES AND DISORDERS OF THE NERVOUS SYSTEM,3,Major,Moderate,Surgical,Medicaid,,,,,true,139566.41,92755.84
New York City,Manhattan,7002001,001438,Bellevue Hospital Center,50 to 69,104,F,Other Race,Spanish/Hispanic,1,Elective,Home or Self Care,2019,CIR024,OTHER AND ILL-DEFINED CEREBROVASCULAR DISEASE,CAR011,ANEURYSM REPAIR PROCEDURES,024,EXTRACRANIAL VASCULAR PROCEDURES,01,DISEASES AND DISORDERS OF THE NERVOUS SYSTEM,1,Minor,Minor,Surgical,Medicaid,,,,,false,41314.19,27457.41
New York City,Manhattan,7002001,001438,Bellevue Hospital Center,50 to 69,112,F,White,Unknown,2,Elective,Home or Self Care,2019,CIR024,OTHER AND ILL-DEFINED CEREBROVASCULAR DISEASE,CAR011,ANEURYSM REPAIR PROCEDURES,024,EXTRACRANIAL VASCULAR PROCEDURES,01,DISEASES AND DISORDERS OF THE NERVOUS SYSTEM,1,Minor,Minor,Surgical,Medicaid,,,,,false,40102.07,26651.84
New York City,Manhattan,7002001,001438,Bellevue Hospital Center,50 to 69,114,M,Other Race,Spanish/Hispanic,7,Urgent,Home or Self Care,2019,CIR020,CEREBRAL INFARCTION,CAR006,CAROTID ENDARTERECTOMY AND STENTING,024,EXTRACRANIAL VASCULAR PROCEDURES,01,DISEASES AND DISORDERS OF THE NERVOUS SYSTEM,3,Major,Moderate,Surgical,Medicaid,,,,,false,85029.19,56510.4
New York City,Manhattan,7002001,001438,Bellevue Hospital Center,50 to 69,114,M,Other Race,Not Span/Hispanic,2,Elective,Home or Self Care,2019,CIR023,OCCLUSION OR STENOSIS OF PRECEREBRAL OR CEREBRAL ARTERIES WITHOUT INFARCTION,CAR006,CAROTID ENDARTERECTOMY AND STENTING,024,EXTRACRANIAL VASCULAR PROCEDURES,01,DISEASES AND DISORDERS OF THE NERVOUS SYSTEM,2,Moderate,Moderate,Surgical,Medicaid,,,,,false,38689.87,25713.29
New York City,Manhattan,7002001,001438,Bellevue Hospital Center,50 to 69,104,M,Other Race,Unknown,19,Urgent,Inpatient Rehabilitation Facility,2019,CIR020,CEREBRAL INFARCTION,CAR008,ANGIOPLASTY AND RELATED VESSEL PROCEDURES (ENDOVASCULAR; EXCLUDING CAROTID),024,EXTRACRANIAL VASCULAR PROCEDURES,01,DISEASES AND DISORDERS OF THE NERVOUS SYSTEM,3,Major,Moderate,Surgical,Medicaid,,,,,false,208279.83,138422.78
New York City,Manhattan,7002001,001438,Bellevue Hospital Center,50 to 69,104,F,Black/African American,Unknown,12,Urgent,Expired,2019,CIR021,ACUTE HEMORRHAGIC CEREBROVASCULAR DISEASE,CAR011,ANEURYSM REPAIR PROCEDURES,024,EXTRACRANIAL VASCULAR PROCEDURES,01,DISEASES AND DISORDERS OF THE NERVOUS SYSTEM,4,Extreme,Extreme,Surgical,Medicare,,,,,false,195526.07,129946.63
New York City,Manhattan,7002001,001438,Bellevue Hospital Center,50 to 69,113,F,Other Race,Not Span/Hispanic,12,Emergency,Home or Self Care,2019,CIR020,CEREBRAL INFARCTION,CAR008,ANGIOPLASTY AND RELATED VESSEL PROCEDURES (ENDOVASCULAR; EXCLUDING CAROTID),024,EXTRACRANIAL VASCULAR PROCEDURES,01,DISEASES AND DISORDERS OF THE NERVOUS SYSTEM,3,Major,Major,Surgical,Medicaid,,,,,true,152263.98,101194.64
New York City,Manhattan,7002001,001438,Bellevue Hospital Center,50 to 69,112,F,Other Race,Unknown,1,Elective,Home or Self Care,2019,CIR024,OTHER AND ILL-DEFINED CEREBROVASCULAR DISEASE,CAR011,ANEURYSM REPAIR PROCEDURES,024,EXTRACRANIAL VASCULAR PROCEDURES,01,DISEASES AND DISORDERS OF THE NERVOUS SYSTEM,2,Moderate,Minor,Surgical,Medicaid,,,,,false,34909.45,23200.82
New York City,Manhattan,7002001,001438,Bellevue Hospital Center,30 to 49,113,M,Other Race,Unknown,8,Emergency,Expired,2019,CIR021,ACUTE HEMORRHAGIC CEREBROVASCULAR DISEASE,CAR010,LIGATION AND EMBOLIZATION OF VESSELS,024,EXTRACRANIAL VASCULAR PROCEDURES,01,DISEASES AND DISORDERS OF THE NERVOUS SYSTEM,4,Extreme,Extreme,Surgical,Medicaid,,,,,false,118301.61,78623.25
