Hospital Service Area,Hospital County,Operating Certificate Number,Permanent Facility Id,Facility Name,Age Group,Zip Code - 3 digits,Gender,Race,Ethnicity,Length of Stay,Type of Admission,Patient Disposition,Discharge Year,CCS Diagnosis Code,CCS Diagnosis Description,CCS Procedure Code,CCS Procedure Description,APR DRG Code,APR DRG Description,APR MDC Code,APR MDC Description,APR Severity of Illness Code,APR Severity of Illness Description,APR Risk of Mortality,APR Medical Surgical Description,Payment Typology 1,Payment Typology 2,Payment Typology 3,Birth Weight,Abortion Edit Indicator,Emergency Department Indicator,Total Charges,Total Costs
New York City,Manhattan,7002053,001463,NYU Langone Hospitals,70 or Older,100,M,White,Not Span/Hispanic,1,Elective,Home or Self Care,2020,CIR023,OCCLUSION OR STENOSIS OF PRECEREBRAL OR CEREBRAL ARTERIES WITHOUT INFARCTION,CAR006,CAROTID ENDARTERECTOMY AND STENTING,024,OPEN EXTRACRANIAL VASCULAR PROCEDURES,01,DISEASES AND DISORDERS OF THE NERVOUS SYSTEM,1,Minor,Minor,Surgical,Medicare,Medicare,,,,N,61028.11,10452.84
New York City,Manhattan,7002053,001463,NYU Langone Hospitals,50 to 69,112,M,Other Race,Spanish/Hispanic,5,Elective,Home or Self Care,2020,CIR023,OCCLUSION OR STENOSIS OF PRECEREBRAL OR CEREBRAL ARTERIES WITHOUT INFARCTION,CAR006,CAROTID ENDARTERECTOMY AND STENTING,024,OPEN EXTRACRANIAL VASCULAR PROCEDURES,01,DISEASES AND DISORDERS OF THE NERVOUS SYSTEM,3,Major,Major,Surgical,Medicare,,,,,N,149817.21,31842.18
New York City,Manhattan,7002053,001463,NYU Langone Hospitals,50 to 69,100,F,White,Not Span/Hispanic,2,Elective,Home or Self Care,2020,CIR023,OCCLUSION OR STENOSIS OF PRECEREBRAL OR CEREBRAL ARTERIES WITHOUT INFARCTION,CAR006,CAROTID ENDARTERECTOMY AND STENTING,024,OPEN EXTRACRANIAL VASCULAR PROCEDURES,01,DISEASES AND DISORDERS OF THE NERVOUS SYSTEM,1,Minor,Minor,Surgical,Medicare,,,,,N,73442.19,14406.28
New York City,Manhattan,7002053,001463,NYU Langone Hospitals,70 or Older,103,F,White,Not Span/Hispanic,1,Elective,Home w/ Home Health Services,2020,CIR023,OCCLUSION OR STENOSIS OF PRECEREBRAL OR CEREBRAL ARTERIES WITHOUT INFARCTION,CAR006,CAROTID ENDARTERECTOMY AND STENTING,024,OPEN EXTRACRANIAL VASCULAR PROCEDURES,01,DISEASES AND DISORDERS OF THE NERVOUS SYSTEM,1,Minor,Minor,Surgical,Medicare,Blue Cross/Blue Shield,Private Health Insurance,,,N,64069.57,11030.84
New York City,Manhattan,7002053,001463,NYU Langone Hospitals,70 or Older,100,F,White,Not Span/Hispanic,3,Emergency,Inpatient Rehabilitation Facility,2020,CIR020,CEREBRAL INFARCTION,CAR006,CAROTID ENDARTERECTOMY AND STENTING,024,OPEN EXTRACRANIAL VASCULAR PROCEDURES,01,DISEASES AND DISORDERS OF THE NERVOUS SYSTEM,3,Major,Moderate,Surgical,Medicare,Medicare,,,,Y,134381.9,24863.03
New York City,Manhattan,7002053,001463,NYU Langone Hospitals,70 or Older,OOS,F,White,Not Span/Hispanic,2,Elective,Home or Self Care,2020,CIR023,OCCLUSION OR STENOSIS OF PRECEREBRAL OR CEREBRAL ARTERIES WITHOUT INFARCTION,CAR006,CAROTID ENDARTERECTOMY AND STENTING,024,OPEN EXTRACRANIAL VASCULAR PROCEDURES,01,DISEASES AND DISORDERS OF THE NERVOUS SYSTEM,2,Moderate,Minor,Surgical,Medicare,Medicare,,,,N,71521.97,14429.55
New York City,Manhattan,7002053,001463,NYU Langone Hospitals,50 to 69,OOS,M,White,Not Span/Hispanic,1,Elective,Home or Self Care,2020,CIR023,OCCLUSION OR STENOSIS OF PRECEREBRAL OR CEREBRAL ARTERIES WITHOUT INFARCTION,CAR006,CAROTID ENDARTERECTOMY AND STENTING,024,OPEN EXTRACRANIAL VASCULAR PROCEDURES,01,DISEASES AND DISORDERS OF THE NERVOUS SYSTEM,1,Minor,Minor,Surgical,Blue Cross/Blue Shield,,,,,N,64971.57,11219.28
New York City,Manhattan,7002053,001463,NYU Langone Hospitals,70 or Older,112,M,White,Not Span/Hispanic,8,Emergency,Home or Self Care,2020,CIR020,CEREBRAL INFARCTION,CAR006,CAROTID ENDARTERECTOMY AND STENTING,024,OPEN EXTRACRANIAL VASCULAR PROCEDURES,01,DISEASES AND DISORDERS OF THE NERVOUS SYSTEM,3,Major,Moderate,Surgical,Medicare,Medicare,,,,Y,206873.04,46355.88
New York City,Manhattan,7002053,001463,NYU Langone Hospitals,70 or Older,113,M,White,Not Span/Hispanic,1,Elective,Home or Self Care,2020,CIR023,OCCLUSION OR STENOSIS OF PRECEREBRAL OR CEREBRAL ARTERIES WITHOUT INFARCTION,CAR006,CAROTID ENDARTERECTOMY AND STENTING,024,OPEN EXTRACRANIAL VASCULAR PROCEDURES,01,DISEASES AND DISORDERS OF THE NERVOUS SYSTEM,1,Minor,Moderate,Surgical,Medicare,Medicare,,,,N,70243.26,11323.41
New York City,Manhattan,7002053,001463,NYU Langone Hospitals,70 or Older,112,M,White,Not Span/Hispanic,1,Elective,Home w/ Home Health Services,2020,CIR023,OCCLUSION OR STENOSIS OF PRECEREBRAL OR CEREBRAL ARTERIES WITHOUT INFARCTION,CAR006,CAROTID ENDARTERECTOMY AND STENTING,024,OPEN EXTRACRANIAL VASCULAR PROCEDURES,01,DISEASES AND DISORDERS OF THE NERVOUS SYSTEM,2,Moderate,Minor,Surgical,Medicare,Medicaid,,,,N,86564.82,13730.84
New York City,Manhattan,7002053,001463,NYU Langone Hospitals,50 to 69,114,M,Other Race,Not Span/Hispanic,1,Elective,Home or Self Care,2020,CIR023,OCCLUSION OR STENOSIS OF PRECEREBRAL OR CEREBRAL ARTERIES WITHOUT INFARCTION,CAR006,CAROTID ENDARTERECTOMY AND STENTING,024,OPEN EXTRACRANIAL VASCULAR PROCEDURES,01,DISEASES AND DISORDERS OF THE NERVOUS SYSTEM,1,Minor,Minor,Surgical,Medicaid,,,,,N,100495.8,15902.28
New York City,Manhattan,7002053,001463,NYU Langone Hospitals,30 to 49,OOS,F,Other Race,Not Span/Hispanic,2,Elective,Home w/ Home Health Services,2020,CIR023,OCCLUSION OR STENOSIS OF PRECEREBRAL OR CEREBRAL ARTERIES WITHOUT INFARCTION,CAR006,CAROTID ENDARTERECTOMY AND STENTING,024,OPEN EXTRACRANIAL VASCULAR PROCEDURES,01,DISEASES AND DISORDERS OF THE NERVOUS SYSTEM,1,Minor,Minor,Surgical,Blue Cross/Blue Shield,,,,,N,114362.27,17913.33
New York City,Manhattan,7002053,001463,NYU Langone Hospitals,70 or Older,113,F,White,Not Span/Hispanic,1,Elective,Home w/ Home Health Services,2020,CIR023,OCCLUSION OR STENOSIS OF PRECEREBRAL OR CEREBRAL ARTERIES WITHOUT INFARCTION,CAR006,CAROTID ENDARTERECTOMY AND STENTING,024,OPEN EXTRACRANIAL VASCULAR PROCEDURES,01,DISEASES AND DISORDERS OF THE NERVOUS SYSTEM,1,Minor,Minor,Surgical,Medicare,Medicaid,,,,N,58198.46,9784.07
New York City,Manhattan,7002053,001463,NYU Langone Hospitals,50 to 69,111,M,Other Race,Not Span/Hispanic,1,Elective,Home or Self Care,2020,CIR023,OCCLUSION OR STENOSIS OF PRECEREBRAL OR CEREBRAL ARTERIES WITHOUT INFARCTION,CAR006,CAROTID ENDARTERECTOMY AND STENTING,024,OPEN EXTRACRANIAL VASCULAR PROCEDURES,01,DISEASES AND DISORDERS OF THE NERVOUS SYSTEM,2,Moderate,Minor,Surgical,Medicare,Medicaid,,,,N,82235.87,12988.94
New York City,Manhattan,7002053,001463,NYU Langone Hospitals,70 or Older,104,M,White,Not Span/Hispanic,6,Emergency,Home or Self Care,2020,CIR023,OCCLUSION OR STENOSIS OF PRECEREBRAL OR CEREBRAL ARTERIES WITHOUT INFARCTION,CAR006,CAROTID ENDARTERECTOMY AND STENTING,024,OPEN EXTRACRANIAL VASCULAR PROCEDURES,01,DISEASES AND DISORDERS OF THE NERVOUS SYSTEM,3,Major,Extreme,Surgical,Medicare,Medicare,,,,Y,204982.11,41394.89
New York City,Manhattan,7002053,001463,NYU Langone Hospitals,50 to 69,113,M,Other Race,Unknown,1,Elective,Home or Self Care,2020,CIR023,OCCLUSION OR STENOSIS OF PRECEREBRAL OR CEREBRAL ARTERIES WITHOUT INFARCTION,CAR006,CAROTID ENDARTERECTOMY AND STENTING,024,OPEN EXTRACRANIAL VASCULAR PROCEDURES,01,DISEASES AND DISORDERS OF THE NERVOUS SYSTEM,1,Minor,Minor,Surgical,Medicaid,,,,,N,84868.9,13820.67
New York City,Manhattan,7002053,001463,NYU Langone Hospitals,50 to 69,112,F,White,Spanish/Hispanic,1,Elective,Home or Self Care,2020,CIR023,OCCLUSION OR STENOSIS OF PRECEREBRAL OR CEREBRAL ARTERIES WITHOUT INFARCTION,CAR006,CAROTID ENDARTERECTOMY AND STENTING,024,OPEN EXTRACRANIAL VASCULAR PROCEDURES,01,DISEASES AND DISORDERS OF THE NERVOUS SYSTEM,1,Minor,Minor,Surgical,Medicare,Blue Cross/Blue Shield,,,,N,57040.74,9944.13
New York City,Manhattan,7002053,001463,NYU Langone Hospitals,70 or Older,112,M,Black/African American,Not Span/Hispanic,1,Elective,Home or Self Care,2020,CIR023,OCCLUSION OR STENOSIS OF PRECEREBRAL OR CEREBRAL ARTERIES WITHOUT INFARCTION,CAR006,CAROTID ENDARTERECTOMY AND STENTING,024,OPEN EXTRACRANIAL VASCULAR PROCEDURES,01,DISEASES AND DISORDERS OF THE NERVOUS SYSTEM,2,Moderate,Minor,Surgical,Medicare,Blue Cross/Blue Shield,,,,N,76923.57,12724.93
New York City,Manhattan,7002053,001463,NYU Langone Hospitals,70 or Older,100,F,White,Not Span/Hispanic,5,Emergency,Home w/ Home Health Services,2020,CIR023,OCCLUSION OR STENOSIS OF PRECEREBRAL OR CEREBRAL ARTERIES WITHOUT INFARCTION,CAR006,CAROTID ENDARTERECTOMY AND STENTING,024,OPEN EXTRACRANIAL VASCULAR PROCEDURES,01,DISEASES AND DISORDERS OF THE NERVOUS SYSTEM,2,Moderate,Minor,Surgical,Medicare,,,,,Y,173374.63,36447.13
New York City,Manhattan,7002053,001463,NYU Langone Hospitals,50 to 69,100,M,White,Not Span/Hispanic,1,Elective,Home or Self Care,2020,CIR023,OCCLUSION OR STENOSIS OF PRECEREBRAL OR CEREBRAL ARTERIES WITHOUT INFARCTION,CAR006,CAROTID ENDARTERECTOMY AND STENTING,024,OPEN EXTRACRANIAL VASCULAR PROCEDURES,01,DISEASES AND DISORDERS OF THE NERVOUS SYSTEM,1,Minor,Minor,Surgical,Medicare,Blue Cross/Blue Shield,,,,N,75658.09,12550.83
New York City,Manhattan,7002053,001463,NYU Langone Hospitals,70 or Older,100,M,Black/African American,Not Span/Hispanic,11,Emergency,Inpatient Rehabilitation Facility,2020,CIR020,CEREBRAL INFARCTION,CAR006,CAROTID ENDARTERECTOMY AND STENTING,024,OPEN EXTRACRANIAL VASCULAR PROCEDURES,01,DISEASES AND DISORDERS OF THE NERVOUS SYSTEM,3,Major,Major,Surgical,Medicare,,,,,Y,285171.9,60916.63
New York City,Manhattan,7002053,001463,NYU Langone Hospitals,50 to 69,103,M,White,Not Span/Hispanic,1,Elective,Home or Self Care,2020,CIR023,OCCLUSION OR STENOSIS OF PRECEREBRAL OR CEREBRAL ARTERIES WITHOUT INFARCTION,CAR006,CAROTID ENDARTERECTOMY AND STENTING,024,OPEN EXTRACRANIAL VASCULAR PROCEDURES,01,DISEASES AND DISORDERS OF THE NERVOUS SYSTEM,1,Minor,Minor,Surgical,Medicare,Blue Cross/Blue Shield,,,,N,66675.32,12239.87
New York City,Manhattan,7002053,001463,NYU Langone Hospitals,50 to 69,103,F,White,Unknown,1,Elective,Home or Self Care,2020,CIR023,OCCLUSION OR STENOSIS OF PRECEREBRAL OR CEREBRAL ARTERIES WITHOUT INFARCTION,CAR006,CAROTID ENDARTERECTOMY AND STENTING,024,OPEN EXTRACRANIAL VASCULAR PROCEDURES,01,DISEASES AND DISORDERS OF THE NERVOUS SYSTEM,1,Minor,Minor,Surgical,Medicare,Medicare,,,,N,89502.03,15124.85
New York City,Manhattan,7002053,001463,NYU Langone Hospitals,70 or Older,113,M,White,Not Span/Hispanic,1,Elective,Home or Self Care,2020,CIR023,OCCLUSION OR STENOSIS OF PRECEREBRAL OR CEREBRAL ARTERIES WITHOUT INFARCTION,CAR006,CAROTID ENDARTERECTOMY AND STENTING,024,OPEN EXTRACRANIAL VASCULAR PROCEDURES,01,DISEASES AND DISORDERS OF THE NERVOUS SYSTEM,2,Moderate,Moderate,Surgical,Medicare,Medicare,,,,N,59262.88,10908.65
New York City,Manhattan,7002053,001463,NYU Langone Hospitals,50 to 69,OOS,M,Other Race,Not Span/Hispanic,3,Elective,Home or Self Care,2020,NEO072,NEOPLASMS OF UNSPECIFIED NATURE OR UNCERTAIN BEHAVIOR,CAR020,SAPHENOUS VEIN HARVEST AND OTHER THERAPEUTIC VESSEL REMOVAL,024,OPEN EXTRACRANIAL VASCULAR PROCEDURES,01,DISEASES AND DISORDERS OF THE NERVOUS SYSTEM,2,Moderate,Minor,Surgical,Medicare,Medicare,,,,N,116436.22,29815.01
New York City,Manhattan,7002053,001463,NYU Langone Hospitals,70 or Older,100,M,Other Race,Not Span/Hispanic,6,Emergency,Skilled Nursing Home,2020,CIR020,CEREBRAL INFARCTION,CAR006,CAROTID ENDARTERECTOMY AND STENTING,024,OPEN EXTRACRANIAL VASCULAR PROCEDURES,01,DISEASES AND DISORDERS OF THE NERVOUS SYSTEM,3,Major,Extreme,Surgical,Medicare,,,,,Y,223020.84,49262.28
New York City,Manhattan,7002053,001463,NYU Langone Hospitals,50 to 69,OOS,F,Other Race,Spanish/Hispanic,3,Elective,Home or Self Care,2020,CIR024,OTHER AND ILL-DEFINED CEREBROVASCULAR DISEASE,CAR021,"ARTERY, VEIN, AND GREAT VESSEL PROCEDURES, NEC",024,OPEN EXTRACRANIAL VASCULAR PROCEDURES,01,DISEASES AND DISORDERS OF THE NERVOUS SYSTEM,1,Minor,Minor,Surgical,Private Health Insurance,,,,,N,104928.13,26122.77
New York City,Manhattan,7002053,001463,NYU Langone Hospitals,70 or Older,100,F,White,Not Span/Hispanic,6,Emergency,Home or Self Care,2020,CIR023,OCCLUSION OR STENOSIS OF PRECEREBRAL OR CEREBRAL ARTERIES WITHOUT INFARCTION,CAR006,CAROTID ENDARTERECTOMY AND STENTING,024,OPEN EXTRACRANIAL VASCULAR PROCEDURES,01,DISEASES AND DISORDERS OF THE NERVOUS SYSTEM,2,Moderate,Moderate,Surgical,Medicare,,,,,Y,189781.01,46885.41
New York City,Manhattan,7002053,001463,NYU Langone Hospitals,70 or Older,100,F,White,Not Span/Hispanic,1,Elective,Home or Self Care,2020,CIR023,OCCLUSION OR STENOSIS OF PRECEREBRAL OR CEREBRAL ARTERIES WITHOUT INFARCTION,CAR006,CAROTID ENDARTERECTOMY AND STENTING,024,OPEN EXTRACRANIAL VASCULAR PROCEDURES,01,DISEASES AND DISORDERS OF THE NERVOUS SYSTEM,1,Minor,Minor,Surgical,Medicare,Medicare,,,,N,91152.14,15504.82
New York City,Manhattan,7002053,001463,NYU Langone Hospitals,70 or Older,OOS,M,White,Not Span/Hispanic,1,Elective,Home or Self Care,2020,CIR023,OCCLUSION OR STENOSIS OF PRECEREBRAL OR CEREBRAL ARTERIES WITHOUT INFARCTION,CAR006,CAROTID ENDARTERECTOMY AND STENTING,024,OPEN EXTRACRANIAL VASCULAR PROCEDURES,01,DISEASES AND DISORDERS OF THE NERVOUS SYSTEM,1,Minor,Minor,Surgical,Medicare,Blue Cross/Blue Shield,,,,N,57642.2,10806.73
New York City,Manhattan,7002053,001463,NYU Langone Hospitals,50 to 69,100,F,Other Race,Spanish/Hispanic,3,Emergency,Home or Self Care,2020,CIR023,OCCLUSION OR STENOSIS OF PRECEREBRAL OR CEREBRAL ARTERIES WITHOUT INFARCTION,CAR006,CAROTID ENDARTERECTOMY AND STENTING,024,OPEN EXTRACRANIAL VASCULAR PROCEDURES,01,DISEASES AND DISORDERS OF THE NERVOUS SYSTEM,1,Minor,Minor,Surgical,Private Health Insurance,,,,,Y,131503.09,29461.6
New York City,Manhattan,7002053,001463,NYU Langone Hospitals,50 to 69,OOS,M,White,Not Span/Hispanic,1,Elective,Home or Self Care,2020,CIR023,OCCLUSION OR STENOSIS OF PRECEREBRAL OR CEREBRAL ARTERIES WITHOUT INFARCTION,CAR006,CAROTID ENDARTERECTOMY AND STENTING,024,OPEN EXTRACRANIAL VASCULAR PROCEDURES,01,DISEASES AND DISORDERS OF THE NERVOUS SYSTEM,1,Minor,Moderate,Surgical,Private Health Insurance,,,,,N,93887.93,17900.23
New York City,Manhattan,7002053,001463,NYU Langone Hospitals,70 or Older,113,M,White,Not Span/Hispanic,1,Elective,Home w/ Home Health Services,2020,CIR023,OCCLUSION OR STENOSIS OF PRECEREBRAL OR CEREBRAL ARTERIES WITHOUT INFARCTION,CAR006,CAROTID ENDARTERECTOMY AND STENTING,024,OPEN EXTRACRANIAL VASCULAR PROCEDURES,01,DISEASES AND DISORDERS OF THE NERVOUS SYSTEM,2,Moderate,Moderate,Surgical,Medicare,,,,,N,129092.4,21014.46
New York City,Manhattan,7002053,001463,NYU Langone Hospitals,70 or Older,,M,White,Not Span/Hispanic,1,Elective,Home or Self Care,2020,CIR023,OCCLUSION OR STENOSIS OF PRECEREBRAL OR CEREBRAL ARTERIES WITHOUT INFARCTION,CAR006,CAROTID ENDARTERECTOMY AND STENTING,024,OPEN EXTRACRANIAL VASCULAR PROCEDURES,01,DISEASES AND DISORDERS OF THE NERVOUS SYSTEM,1,Minor,Minor,Surgical,Medicare,Medicare,,,,N,86352.72,16914.04
New York City,Manhattan,7002053,001463,NYU Langone Hospitals,50 to 69,103,M,White,Not Span/Hispanic,1,Elective,Home or Self Care,2020,CIR023,OCCLUSION OR STENOSIS OF PRECEREBRAL OR CEREBRAL ARTERIES WITHOUT INFARCTION,CAR006,CAROTID ENDARTERECTOMY AND STENTING,024,OPEN EXTRACRANIAL VASCULAR PROCEDURES,01,DISEASES AND DISORDERS OF THE NERVOUS SYSTEM,1,Minor,Minor,Surgical,Blue Cross/Blue Shield,,,,,N,75180.66,13398.06
New York City,Manhattan,7002053,001463,NYU Langone Hospitals,70 or Older,100,F,White,Not Span/Hispanic,1,Elective,Home or Self Care,2020,CIR023,OCCLUSION OR STENOSIS OF PRECEREBRAL OR CEREBRAL ARTERIES WITHOUT INFARCTION,CAR006,CAROTID ENDARTERECTOMY AND STENTING,024,OPEN EXTRACRANIAL VASCULAR PROCEDURES,01,DISEASES AND DISORDERS OF THE NERVOUS SYSTEM,1,Minor,Minor,Surgical,Medicare,,,,,N,80903.21,16438.78
New York City,Manhattan,7002053,001463,NYU Langone Hospitals,70 or Older,100,M,White,Not Span/Hispanic,4,Emergency,Inpatient Rehabilitation Facility,2020,CIR020,CEREBRAL INFARCTION,CAR006,CAROTID ENDARTERECTOMY AND STENTING,024,OPEN EXTRACRANIAL VASCULAR PROCEDURES,01,DISEASES AND DISORDERS OF THE NERVOUS SYSTEM,3,Major,Moderate,Surgical,Medicare,Private Health Insurance,,,,Y,207542.37,43931.22
New York City,Manhattan,7002053,001463,NYU Langone Hospitals,50 to 69,112,F,Black/African American,Not Span/Hispanic,2,Elective,Home or Self Care,2020,NEO072,NEOPLASMS OF UNSPECIFIED NATURE OR UNCERTAIN BEHAVIOR,ENP006,"ENDOCRINE PROCEDURES, NEC",024,OPEN EXTRACRANIAL VASCULAR PROCEDURES,01,DISEASES AND DISORDERS OF THE NERVOUS SYSTEM,2,Moderate,Minor,Surgical,Blue Cross/Blue Shield,,,,,N,97185.81,18719.72
New York City,Manhattan,7002053,001463,NYU Langone Hospitals,50 to 69,103,M,White,Not Span/Hispanic,1,Elective,Home or Self Care,2020,CIR023,OCCLUSION OR STENOSIS OF PRECEREBRAL OR CEREBRAL ARTERIES WITHOUT INFARCTION,CAR006,CAROTID ENDARTERECTOMY AND STENTING,024,OPEN EXTRACRANIAL VASCULAR PROCEDURES,01,DISEASES AND DISORDERS OF THE NERVOUS SYSTEM,2,Moderate,Minor,Surgical,Blue Cross/Blue Shield,,,,,N,85335.49,14353.3
New York City,Manhattan,7002053,001463,NYU Langone Hospitals,30 to 49,117,F,Other Race,Not Span/Hispanic,2,Elective,Left Against Medical Advice,2020,NEO072,NEOPLASMS OF UNSPECIFIED NATURE OR UNCERTAIN BEHAVIOR,CAR020,SAPHENOUS VEIN HARVEST AND OTHER THERAPEUTIC VESSEL REMOVAL,024,OPEN EXTRACRANIAL VASCULAR PROCEDURES,01,DISEASES AND DISORDERS OF THE NERVOUS SYSTEM,2,Moderate,Minor,Surgical,Blue Cross/Blue Shield,,,,,N,210920.51,36856.64
New York City,Manhattan,7002053,001463,NYU Langone Hospitals,70 or Older,113,M,White,Not Span/Hispanic,1,Elective,Home or Self Care,2020,CIR023,OCCLUSION OR STENOSIS OF PRECEREBRAL OR CEREBRAL ARTERIES WITHOUT INFARCTION,CAR006,CAROTID ENDARTERECTOMY AND STENTING,024,OPEN EXTRACRANIAL VASCULAR PROCEDURES,01,DISEASES AND DISORDERS OF THE NERVOUS SYSTEM,1,Minor,Moderate,Surgical,Medicare,Blue Cross/Blue Shield,,,,N,65222.7,11815.5
New York City,Manhattan,7002053,001463,NYU Langone Hospitals,18 to 29,OOS,F,White,Not Span/Hispanic,4,Elective,Home or Self Care,2020,NVS009,EPILEPSY; CONVULSIONS,MST028,"SUBCUTANEOUS TISSUE AND FASCIA PROCEDURES, NEC",024,OPEN EXTRACRANIAL VASCULAR PROCEDURES,01,DISEASES AND DISORDERS OF THE NERVOUS SYSTEM,1,Minor,Minor,Surgical,Private Health Insurance,,,,,N,516500.3,74902.25
New York City,Manhattan,7002053,001463,NYU Langone Hospitals,70 or Older,OOS,M,White,Not Span/Hispanic,2,Elective,Home or Self Care,2020,CIR023,OCCLUSION OR STENOSIS OF PRECEREBRAL OR CEREBRAL ARTERIES WITHOUT INFARCTION,CAR006,CAROTID ENDARTERECTOMY AND STENTING,024,OPEN EXTRACRANIAL VASCULAR PROCEDURES,01,DISEASES AND DISORDERS OF THE NERVOUS SYSTEM,2,Moderate,Minor,Surgical,Medicare,Private Health Insurance,,,,N,120208.71,21894.36
New York City,Manhattan,7002053,001463,NYU Langone Hospitals,70 or Older,OOS,M,White,Not Span/Hispanic,1,Elective,Home or Self Care,2020,CIR023,OCCLUSION OR STENOSIS OF PRECEREBRAL OR CEREBRAL ARTERIES WITHOUT INFARCTION,CAR006,CAROTID ENDARTERECTOMY AND STENTING,024,OPEN EXTRACRANIAL VASCULAR PROCEDURES,01,DISEASES AND DISORDERS OF THE NERVOUS SYSTEM,2,Moderate,Moderate,Surgical,Medicare,Medicare,,,,N,104186.56,17703.19
New York City,Manhattan,7002053,001463,NYU Langone Hospitals,70 or Older,113,M,Other Race,Not Span/Hispanic,1,Elective,Home or Self Care,2020,CIR023,OCCLUSION OR STENOSIS OF PRECEREBRAL OR CEREBRAL ARTERIES WITHOUT INFARCTION,CAR006,CAROTID ENDARTERECTOMY AND STENTING,024,OPEN EXTRACRANIAL VASCULAR PROCEDURES,01,DISEASES AND DISORDERS OF THE NERVOUS SYSTEM,1,Minor,Minor,Surgical,Blue Cross/Blue Shield,Medicare,,,,N,85180.41,14478.51
New York City,Manhattan,7002053,001463,NYU Langone Hospitals,70 or Older,112,M,Black/African American,Not Span/Hispanic,1,Elective,Home or Self Care,2020,CIR023,OCCLUSION OR STENOSIS OF PRECEREBRAL OR CEREBRAL ARTERIES WITHOUT INFARCTION,CAR006,CAROTID ENDARTERECTOMY AND STENTING,024,OPEN EXTRACRANIAL VASCULAR PROCEDURES,01,DISEASES AND DISORDERS OF THE NERVOUS SYSTEM,2,Moderate,Moderate,Surgical,Blue Cross/Blue Shield,,,,,N,57738.24,11106.22
New York City,Manhattan,7002053,001463,NYU Langone Hospitals,70 or Older,114,M,Other Race,Spanish/Hispanic,1,Elective,Home or Self Care,2020,CIR023,OCCLUSION OR STENOSIS OF PRECEREBRAL OR CEREBRAL ARTERIES WITHOUT INFARCTION,CAR006,CAROTID ENDARTERECTOMY AND STENTING,024,OPEN EXTRACRANIAL VASCULAR PROCEDURES,01,DISEASES AND DISORDERS OF THE NERVOUS SYSTEM,1,Minor,Minor,Surgical,Medicare,Private Health Insurance,,,,N,97939.01,16431.81
New York City,Manhattan,7002053,001463,NYU Langone Hospitals,70 or Older,100,M,White,Not Span/Hispanic,5,Emergency,Home w/ Home Health Services,2020,CIR023,OCCLUSION OR STENOSIS OF PRECEREBRAL OR CEREBRAL ARTERIES WITHOUT INFARCTION,CAR006,CAROTID ENDARTERECTOMY AND STENTING,024,OPEN EXTRACRANIAL VASCULAR PROCEDURES,01,DISEASES AND DISORDERS OF THE NERVOUS SYSTEM,3,Major,Minor,Surgical,Medicare,Medicare,,,,Y,199771.47,47130.74
New York City,Manhattan,7002053,001463,NYU Langone Hospitals,70 or Older,100,F,White,Not Span/Hispanic,3,Elective,Home or Self Care,2020,CIR023,OCCLUSION OR STENOSIS OF PRECEREBRAL OR CEREBRAL ARTERIES WITHOUT INFARCTION,CAR006,CAROTID ENDARTERECTOMY AND STENTING,024,OPEN EXTRACRANIAL VASCULAR PROCEDURES,01,DISEASES AND DISORDERS OF THE NERVOUS SYSTEM,2,Moderate,Minor,Surgical,Medicare,Medicare,,,,N,142842.71,28900.95
New York City,Manhattan,7002053,001463,NYU Langone Hospitals,70 or Older,100,M,Other Race,Not Span/Hispanic,1,Elective,Home w/ Home Health Services,2020,CIR023,OCCLUSION OR STENOSIS OF PRECEREBRAL OR CEREBRAL ARTERIES WITHOUT INFARCTION,CAR006,CAROTID ENDARTERECTOMY AND STENTING,024,OPEN EXTRACRANIAL VASCULAR PROCEDURES,01,DISEASES AND DISORDERS OF THE NERVOUS SYSTEM,3,Major,Major,Surgical,Medicare,Medicaid,,,,N,110736.54,20733.69
New York City,Manhattan,7002053,001463,NYU Langone Hospitals,70 or Older,100,F,White,Spanish/Hispanic,1,Elective,Home or Self Care,2020,CIR023,OCCLUSION OR STENOSIS OF PRECEREBRAL OR CEREBRAL ARTERIES WITHOUT INFARCTION,CAR006,CAROTID ENDARTERECTOMY AND STENTING,024,OPEN EXTRACRANIAL VASCULAR PROCEDURES,01,DISEASES AND DISORDERS OF THE NERVOUS SYSTEM,2,Moderate,Minor,Surgical,Medicare,Medicare,,,,N,66602.69,12388.15
New York City,Manhattan,7002053,001463,NYU Langone Hospitals,50 to 69,113,M,Other Race,Not Span/Hispanic,1,Elective,Home or Self Care,2020,CIR023,OCCLUSION OR STENOSIS OF PRECEREBRAL OR CEREBRAL ARTERIES WITHOUT INFARCTION,CAR006,CAROTID ENDARTERECTOMY AND STENTING,024,OPEN EXTRACRANIAL VASCULAR PROCEDURES,01,DISEASES AND DISORDERS OF THE NERVOUS SYSTEM,1,Minor,Minor,Surgical,Medicaid,,,,,N,78851.76,16382.73
New York City,Manhattan,7002053,001463,NYU Langone Hospitals,50 to 69,103,M,White,Not Span/Hispanic,1,Elective,Home or Self Care,2020,CIR023,OCCLUSION OR STENOSIS OF PRECEREBRAL OR CEREBRAL ARTERIES WITHOUT INFARCTION,CAR006,CAROTID ENDARTERECTOMY AND STENTING,024,OPEN EXTRACRANIAL VASCULAR PROCEDURES,01,DISEASES AND DISORDERS OF THE NERVOUS SYSTEM,1,Minor,Minor,Surgical,Blue Cross/Blue Shield,,,,,N,85181.79,15248.87
New York City,Manhattan,7002053,001463,NYU Langone Hospitals,70 or Older,OOS,M,Other Race,Not Span/Hispanic,1,Elective,Home or Self Care,2020,CIR023,OCCLUSION OR STENOSIS OF PRECEREBRAL OR CEREBRAL ARTERIES WITHOUT INFARCTION,CAR006,CAROTID ENDARTERECTOMY AND STENTING,024,OPEN EXTRACRANIAL VASCULAR PROCEDURES,01,DISEASES AND DISORDERS OF THE NERVOUS SYSTEM,2,Moderate,Moderate,Surgical,Medicare,Medicare,,,,N,99452.93,18212.36
