Hospital Service Area,Hospital County,Operating Certificate Number,Permanent Facility Id,Facility Name,Age Group,Zip Code - 3 digits,Gender,Race,Ethnicity,Length of Stay,Type of Admission,Patient Disposition,Discharge Year,CCS Diagnosis Code,CCS Diagnosis Description,CCS Procedure Code,CCS Procedure Description,APR DRG Code,APR DRG Description,APR MDC Code,APR MDC Description,APR Severity of Illness Code,APR Severity of Illness Description,APR Risk of Mortality,APR Medical Surgical Description,Payment Typology 1,Payment Typology 2,Payment Typology 3,Birth Weight,Abortion Edit Indicator,Emergency Department Indicator,Total Charges,Total Costs
New York City,Kings,7002053,001304,NYU Langone Hospital-Brooklyn,50 to 69,112,M,White,Not Span/Hispanic,3,Emergency,Home or Self Care,2019,NEO013,GASTROINTESTINAL CANCERS - STOMACH,ADM021,"ADMINISTRATION OF THERAPEUTIC SUBSTANCES, NEC",240,DIGESTIVE MALIGNANCY,06,DISEASES AND DISORDERS OF THE DIGESTIVE SYSTEM,2,Moderate,Major,Medical,Private Health Insurance,,,,,true,57299.94,14832.98
New York City,Kings,7002053,001304,NYU Langone Hospital-Brooklyn,50 to 69,112,M,White,Not Span/Hispanic,1,Elective,Home or Self Care,2019,NEO015,GASTROINTESTINAL CANCERS - COLORECTAL,GIS004,GI SYSTEM ENDOSCOPY WITHOUT BIOPSY (DIAGNOSTIC),240,DIGESTIVE MALIGNANCY,06,DISEASES AND DISORDERS OF THE DIGESTIVE SYSTEM,1,Minor,Minor,Medical,Private Health Insurance,,,,,false,46454.1,8689.82
New York City,Kings,7002053,001304,NYU Langone Hospital-Brooklyn,50 to 69,112,M,White,Not Span/Hispanic,15,Emergency,Psychiatric Hospital or Unit of Hosp,2019,NEO015,GASTROINTESTINAL CANCERS - COLORECTAL,CAR025,PLACEMENT OF TUNNELED OR IMPLANTABLE PORTION OF A VASCULAR ACCESS DEVICE,240,DIGESTIVE MALIGNANCY,06,DISEASES AND DISORDERS OF THE DIGESTIVE SYSTEM,3,Major,Moderate,Medical,Medicare,Medicaid,,,,false,205337.07,54355.63
New York City,Kings,7002053,001304,NYU Langone Hospital-Brooklyn,70 or Older,112,M,Other Race,Spanish/Hispanic,5,Emergency,Hospice - Home,2019,NEO013,GASTROINTESTINAL CANCERS - STOMACH,GIS027,"UPPER GI THERAPEUTIC PROCEDURES, NEC (ENDOSCOPIC)",240,DIGESTIVE MALIGNANCY,06,DISEASES AND DISORDERS OF THE DIGESTIVE SYSTEM,2,Moderate,Moderate,Medical,Medicaid,,,,,true,81436.02,22216.39
New York City,Kings,7002053,001304,NYU Langone Hospital-Brooklyn,30 to 49,112,M,Other Race,Spanish/Hispanic,8,Emergency,Hospice - Home,2019,NEO013,GASTROINTESTINAL CANCERS - STOMACH,RES005,CHEST TUBE PLACEMENT AND THERAPEUTIC THORACENTESIS,240,DIGESTIVE MALIGNANCY,06,DISEASES AND DISORDERS OF THE DIGESTIVE SYSTEM,3,Major,Major,Medical,Medicaid,,,,,true,127083.5,35095.01
New York City,Kings,7002053,001304,NYU Langone Hospital-Brooklyn,50 to 69,112,M,Other Race,Not Span/Hispanic,3,Emergency,Home or Self Care,2019,NEO015,GASTROINTESTINAL CANCERS - COLORECTAL,GIS002,COLONOSCOPY AND PROCTOSCOPY WITH BIOPSY,240,DIGESTIVE MALIGNANCY,06,DISEASES AND DISORDERS OF THE DIGESTIVE SYSTEM,3,Major,Moderate,Medical,Medicare,,,,,true,123311.32,24540.94
New York City,Kings,7002053,001304,NYU Langone Hospital-Brooklyn,50 to 69,112,F,White,Not Span/Hispanic,3,Emergency,Home or Self Care,2019,NEO070,SECONDARY MALIGNANCIES,GIS006,PARACENTESIS,240,DIGESTIVE MALIGNANCY,06,DISEASES AND DISORDERS OF THE DIGESTIVE SYSTEM,3,Major,Major,Medical,Private Health Insurance,,,,,true,78521.41,17534.92
New York City,Kings,7002053,001304,NYU Langone Hospital-Brooklyn,70 or Older,112,M,Other Race,Spanish/Hispanic,1,Emergency,Home or Self Care,2019,NEO013,GASTROINTESTINAL CANCERS - STOMACH,ADM001,TRANSFUSION OF BLOOD AND BLOOD PRODUCTS,240,DIGESTIVE MALIGNANCY,06,DISEASES AND DISORDERS OF THE DIGESTIVE SYSTEM,2,Moderate,Moderate,Medical,Medicaid,,,,,true,22552.57,5545.78
New York City,Kings,7002053,001304,NYU Langone Hospital-Brooklyn,70 or Older,112,M,Other Race,Spanish/Hispanic,6,Emergency,Home or Self Care,2019,NEO013,GASTROINTESTINAL CANCERS - STOMACH,CAR025,PLACEMENT OF TUNNELED OR IMPLANTABLE PORTION OF A VASCULAR ACCESS DEVICE,240,DIGESTIVE MALIGNANCY,06,DISEASES AND DISORDERS OF THE DIGESTIVE SYSTEM,3,Major,Major,Medical,Medicaid,,,,,true,167219.22,37568.12
New York City,Kings,7002053,001304,NYU Langone Hospital-Brooklyn,30 to 49,112,M,White,Not Span/Hispanic,4,Emergency,Home or Self Care,2019,NEO070,SECONDARY MALIGNANCIES,IMG006,COMPUTERIZED TOMOGRAPHY (CT) WITH CONTRAST,240,DIGESTIVE MALIGNANCY,06,DISEASES AND DISORDERS OF THE DIGESTIVE SYSTEM,3,Major,Major,Medical,Medicaid,,,,,true,61079.33,17319.96
New York City,Kings,7002053,001304,NYU Langone Hospital-Brooklyn,70 or Older,112,M,White,Not Span/Hispanic,1,Elective,Home or Self Care,2019,NEO015,GASTROINTESTINAL CANCERS - COLORECTAL,CAR024,VENOUS AND ARTERIAL CATHETER PLACEMENT,240,DIGESTIVE MALIGNANCY,06,DISEASES AND DISORDERS OF THE DIGESTIVE SYSTEM,2,Moderate,Major,Medical,Private Health Insurance,Medicare,,,,false,35075.64,7266.45
New York City,Kings,7002053,001304,NYU Langone Hospital-Brooklyn,70 or Older,112,F,White,Not Span/Hispanic,20,Emergency,Hospice - Medical Facility,2019,NEO020,GASTROINTESTINAL CANCERS - PERITONEUM,GIS006,PARACENTESIS,240,DIGESTIVE MALIGNANCY,06,DISEASES AND DISORDERS OF THE DIGESTIVE SYSTEM,4,Extreme,Extreme,Medical,Medicare,Medicare,,,,true,218843.57,67281.98
New York City,Kings,7002053,001304,NYU Langone Hospital-Brooklyn,70 or Older,103,M,White,Not Span/Hispanic,11,Emergency,Home w/ Home Health Services,2019,NEO013,GASTROINTESTINAL CANCERS - STOMACH,HEP010,HEPATOBILIARY AND PANCREATIC DRAINAGE,240,DIGESTIVE MALIGNANCY,06,DISEASES AND DISORDERS OF THE DIGESTIVE SYSTEM,3,Major,Major,Medical,Medicare,Private Health Insurance,,,,true,146958,45013.08
New York City,Kings,7002053,001304,NYU Langone Hospital-Brooklyn,50 to 69,112,M,White,Not Span/Hispanic,1,Emergency,Home or Self Care,2019,NEO013,GASTROINTESTINAL CANCERS - STOMACH,,,240,DIGESTIVE MALIGNANCY,06,DISEASES AND DISORDERS OF THE DIGESTIVE SYSTEM,2,Moderate,Moderate,Medical,Private Health Insurance,,,,,true,27592.26,6206.38
New York City,Kings,7002053,001304,NYU Langone Hospital-Brooklyn,70 or Older,112,M,White,Spanish/Hispanic,6,Emergency,Home w/ Home Health Services,2019,NEO012,GASTROINTESTINAL CANCERS - ESOPHAGUS,GIS006,PARACENTESIS,240,DIGESTIVE MALIGNANCY,06,DISEASES AND DISORDERS OF THE DIGESTIVE SYSTEM,3,Major,Major,Medical,Private Health Insurance,Medicaid,,,,true,69512.21,21812.7
New York City,Kings,7002053,001304,NYU Langone Hospital-Brooklyn,70 or Older,112,F,Other Race,Not Span/Hispanic,3,Emergency,Home or Self Care,2019,NEO070,SECONDARY MALIGNANCIES,GIS002,COLONOSCOPY AND PROCTOSCOPY WITH BIOPSY,240,DIGESTIVE MALIGNANCY,06,DISEASES AND DISORDERS OF THE DIGESTIVE SYSTEM,2,Moderate,Moderate,Medical,Private Health Insurance,Medicare,,,,true,66626.16,15850.68
New York City,Kings,7002053,001304,NYU Langone Hospital-Brooklyn,70 or Older,112,M,Other Race,Spanish/Hispanic,3,Emergency,Home w/ Home Health Services,2019,NEO015,GASTROINTESTINAL CANCERS - COLORECTAL,GIS002,COLONOSCOPY AND PROCTOSCOPY WITH BIOPSY,240,DIGESTIVE MALIGNANCY,06,DISEASES AND DISORDERS OF THE DIGESTIVE SYSTEM,2,Moderate,Major,Medical,Private Health Insurance,,,,,true,75633.23,17980.1
New York City,Kings,7002053,001304,NYU Langone Hospital-Brooklyn,50 to 69,112,F,White,Not Span/Hispanic,8,Emergency,Home or Self Care,2019,NEO070,SECONDARY MALIGNANCIES,GIS006,PARACENTESIS,240,DIGESTIVE MALIGNANCY,06,DISEASES AND DISORDERS OF THE DIGESTIVE SYSTEM,3,Major,Major,Medical,Medicare,,,,,true,112041.82,33983.95
New York City,Kings,7002053,001304,NYU Langone Hospital-Brooklyn,70 or Older,112,F,White,Not Span/Hispanic,7,Emergency,Skilled Nursing Home,2019,NEO015,GASTROINTESTINAL CANCERS - COLORECTAL,GIS004,GI SYSTEM ENDOSCOPY WITHOUT BIOPSY (DIAGNOSTIC),240,DIGESTIVE MALIGNANCY,06,DISEASES AND DISORDERS OF THE DIGESTIVE SYSTEM,3,Major,Major,Medical,Medicare,,,,,true,93420.73,27711.23
New York City,Kings,7002053,001304,NYU Langone Hospital-Brooklyn,70 or Older,112,M,Other Race,Not Span/Hispanic,15,Emergency,Home w/ Home Health Services,2019,NEO069,CANCER OF OTHER SITES,CAR029,"CARDIOVASCULAR DEVICE PROCEDURES, NEC",240,DIGESTIVE MALIGNANCY,06,DISEASES AND DISORDERS OF THE DIGESTIVE SYSTEM,4,Extreme,Major,Medical,Medicaid,,,,,true,256085.68,65991.46
New York City,Kings,7002053,001304,NYU Langone Hospital-Brooklyn,70 or Older,112,M,White,Not Span/Hispanic,5,Emergency,Left Against Medical Advice,2019,NEO015,GASTROINTESTINAL CANCERS - COLORECTAL,ADM001,TRANSFUSION OF BLOOD AND BLOOD PRODUCTS,240,DIGESTIVE MALIGNANCY,06,DISEASES AND DISORDERS OF THE DIGESTIVE SYSTEM,3,Major,Major,Medical,Medicaid,,,,,true,61169.2,20492.21
New York City,Kings,7002053,001304,NYU Langone Hospital-Brooklyn,70 or Older,112,M,Other Race,Not Span/Hispanic,3,Emergency,Home w/ Home Health Services,2019,NEO015,GASTROINTESTINAL CANCERS - COLORECTAL,GIS029,"LOWER GI THERAPEUTIC PROCEDURES, NEC (EXCLUDING OPEN AND LAPAROSCOPIC)",240,DIGESTIVE MALIGNANCY,06,DISEASES AND DISORDERS OF THE DIGESTIVE SYSTEM,2,Moderate,Moderate,Medical,Medicaid,,,,,true,114489.71,25449.27
New York City,Kings,7002053,001304,NYU Langone Hospital-Brooklyn,30 to 49,112,M,Other Race,Spanish/Hispanic,3,Emergency,Home or Self Care,2019,NEO013,GASTROINTESTINAL CANCERS - STOMACH,GIS001,ESOPHAGOGASTRODUODENOSCOPY (EGD) WITH BIOPSY,240,DIGESTIVE MALIGNANCY,06,DISEASES AND DISORDERS OF THE DIGESTIVE SYSTEM,3,Major,Major,Medical,Medicaid,,,,,true,74427.77,17322.96
New York City,Kings,7002053,001304,NYU Langone Hospital-Brooklyn,70 or Older,112,M,Other Race,Not Span/Hispanic,6,Emergency,Skilled Nursing Home,2019,NEO013,GASTROINTESTINAL CANCERS - STOMACH,,,240,DIGESTIVE MALIGNANCY,06,DISEASES AND DISORDERS OF THE DIGESTIVE SYSTEM,3,Major,Major,Medical,Medicaid,,,,,true,96805.66,29180.21
New York City,Kings,7002053,001304,NYU Langone Hospital-Brooklyn,30 to 49,112,F,Black/African American,Not Span/Hispanic,5,Emergency,Home or Self Care,2019,NEO015,GASTROINTESTINAL CANCERS - COLORECTAL,ADM021,"ADMINISTRATION OF THERAPEUTIC SUBSTANCES, NEC",240,DIGESTIVE MALIGNANCY,06,DISEASES AND DISORDERS OF THE DIGESTIVE SYSTEM,3,Major,Moderate,Medical,Private Health Insurance,,,,,true,117808.06,27894.58
New York City,Kings,7002053,001304,NYU Langone Hospital-Brooklyn,50 to 69,112,F,Black/African American,Unknown,4,Emergency,Home or Self Care,2019,NEO015,GASTROINTESTINAL CANCERS - COLORECTAL,GIS002,COLONOSCOPY AND PROCTOSCOPY WITH BIOPSY,240,DIGESTIVE MALIGNANCY,06,DISEASES AND DISORDERS OF THE DIGESTIVE SYSTEM,3,Major,Moderate,Medical,Medicaid,,,,,true,100116.39,23620.43
New York City,Kings,7002053,001304,NYU Langone Hospital-Brooklyn,50 to 69,112,M,Other Race,Spanish/Hispanic,9,Emergency,Hospice - Home,2019,NEO013,GASTROINTESTINAL CANCERS - STOMACH,RES005,CHEST TUBE PLACEMENT AND THERAPEUTIC THORACENTESIS,240,DIGESTIVE MALIGNANCY,06,DISEASES AND DISORDERS OF THE DIGESTIVE SYSTEM,4,Extreme,Extreme,Medical,Medicaid,,,,,true,145746.84,43327.87
New York City,Kings,7002053,001304,NYU Langone Hospital-Brooklyn,70 or Older,112,F,White,Not Span/Hispanic,2,Emergency,Home or Self Care,2019,NEO070,SECONDARY MALIGNANCIES,GIS006,PARACENTESIS,240,DIGESTIVE MALIGNANCY,06,DISEASES AND DISORDERS OF THE DIGESTIVE SYSTEM,3,Major,Major,Medical,Medicare,Medicaid,,,,true,60138.67,12922.16
New York City,Kings,7002053,001304,NYU Langone Hospital-Brooklyn,70 or Older,112,F,Other Race,Not Span/Hispanic,4,Emergency,Hospice - Home,2019,NEO015,GASTROINTESTINAL CANCERS - COLORECTAL,GIS007,GI SYSTEM DRAINAGE (EXCLUDING PARACENTESIS),240,DIGESTIVE MALIGNANCY,06,DISEASES AND DISORDERS OF THE DIGESTIVE SYSTEM,2,Moderate,Major,Medical,Medicare,Medicare,,,,true,63580.6,16318.71
New York City,Kings,7002053,001304,NYU Langone Hospital-Brooklyn,30 to 49,112,M,Multi-racial,Not Span/Hispanic,1,Emergency,Home or Self Care,2019,NEO015,GASTROINTESTINAL CANCERS - COLORECTAL,GIS002,COLONOSCOPY AND PROCTOSCOPY WITH BIOPSY,240,DIGESTIVE MALIGNANCY,06,DISEASES AND DISORDERS OF THE DIGESTIVE SYSTEM,1,Minor,Minor,Medical,Private Health Insurance,,,,,true,89775.57,15294.03
New York City,Kings,7002053,001304,NYU Langone Hospital-Brooklyn,70 or Older,112,M,White,Not Span/Hispanic,4,Emergency,Expired,2019,NEO013,GASTROINTESTINAL CANCERS - STOMACH,ADM021,"ADMINISTRATION OF THERAPEUTIC SUBSTANCES, NEC",240,DIGESTIVE MALIGNANCY,06,DISEASES AND DISORDERS OF THE DIGESTIVE SYSTEM,4,Extreme,Extreme,Medical,Medicare,Private Health Insurance,,,,true,65974.23,17056.45
New York City,Kings,7002053,001304,NYU Langone Hospital-Brooklyn,50 to 69,112,M,White,Unknown,3,Emergency,Home or Self Care,2019,NEO012,GASTROINTESTINAL CANCERS - ESOPHAGUS,GIS001,ESOPHAGOGASTRODUODENOSCOPY (EGD) WITH BIOPSY,240,DIGESTIVE MALIGNANCY,06,DISEASES AND DISORDERS OF THE DIGESTIVE SYSTEM,3,Major,Moderate,Medical,Medicaid,,,,,true,101597.18,20073.57
New York City,Kings,7002053,001304,NYU Langone Hospital-Brooklyn,70 or Older,112,F,White,Not Span/Hispanic,3,Emergency,Skilled Nursing Home,2019,NEO015,GASTROINTESTINAL CANCERS - COLORECTAL,ADM001,TRANSFUSION OF BLOOD AND BLOOD PRODUCTS,240,DIGESTIVE MALIGNANCY,06,DISEASES AND DISORDERS OF THE DIGESTIVE SYSTEM,3,Major,Major,Medical,Medicare,Medicare,,,,true,64168.31,22499.85
New York City,Kings,7002053,001304,NYU Langone Hospital-Brooklyn,50 to 69,112,M,Other Race,Not Span/Hispanic,2,Emergency,Home or Self Care,2019,NEO015,GASTROINTESTINAL CANCERS - COLORECTAL,GIS002,COLONOSCOPY AND PROCTOSCOPY WITH BIOPSY,240,DIGESTIVE MALIGNANCY,06,DISEASES AND DISORDERS OF THE DIGESTIVE SYSTEM,2,Moderate,Major,Medical,Private Health Insurance,,,,,true,85316.95,17285.94
New York City,Kings,7002053,001304,NYU Langone Hospital-Brooklyn,70 or Older,112,M,Other Race,Not Span/Hispanic,21,Emergency,Skilled Nursing Home,2019,NEO015,GASTROINTESTINAL CANCERS - COLORECTAL,,,240,DIGESTIVE MALIGNANCY,06,DISEASES AND DISORDERS OF THE DIGESTIVE SYSTEM,4,Extreme,Extreme,Medical,Medicaid,Medicaid,,,,true,175394.87,71877.84
New York City,Kings,7002053,001304,NYU Langone Hospital-Brooklyn,30 to 49,112,F,Black/African American,Spanish/Hispanic,4,Emergency,Home or Self Care,2019,NEO070,SECONDARY MALIGNANCIES,GIS006,PARACENTESIS,240,DIGESTIVE MALIGNANCY,06,DISEASES AND DISORDERS OF THE DIGESTIVE SYSTEM,2,Moderate,Moderate,Medical,Medicaid,,,,,true,83613.64,21025.45
New York City,Kings,7002053,001304,NYU Langone Hospital-Brooklyn,70 or Older,112,F,Other Race,Spanish/Hispanic,1,Emergency,Home w/ Home Health Services,2019,NEO013,GASTROINTESTINAL CANCERS - STOMACH,ADM001,TRANSFUSION OF BLOOD AND BLOOD PRODUCTS,240,DIGESTIVE MALIGNANCY,06,DISEASES AND DISORDERS OF THE DIGESTIVE SYSTEM,2,Moderate,Moderate,Medical,Medicare,Blue Cross/Blue Shield,,,,true,20484.35,5325.21
New York City,Kings,7002053,001304,NYU Langone Hospital-Brooklyn,50 to 69,112,M,White,Not Span/Hispanic,4,Emergency,Cancer Center or Children's Hospital,2019,NEO013,GASTROINTESTINAL CANCERS - STOMACH,GIS004,GI SYSTEM ENDOSCOPY WITHOUT BIOPSY (DIAGNOSTIC),240,DIGESTIVE MALIGNANCY,06,DISEASES AND DISORDERS OF THE DIGESTIVE SYSTEM,3,Major,Major,Medical,Blue Cross/Blue Shield,,,,,true,65307.53,17520.29
New York City,Kings,7002053,001304,NYU Langone Hospital-Brooklyn,50 to 69,112,F,White,Not Span/Hispanic,7,Emergency,Hospice - Medical Facility,2019,NEO013,GASTROINTESTINAL CANCERS - STOMACH,RES005,CHEST TUBE PLACEMENT AND THERAPEUTIC THORACENTESIS,240,DIGESTIVE MALIGNANCY,06,DISEASES AND DISORDERS OF THE DIGESTIVE SYSTEM,4,Extreme,Extreme,Medical,Medicare,Medicare,,,,true,86642.25,27442.92
New York City,Kings,7002053,001304,NYU Langone Hospital-Brooklyn,70 or Older,112,F,Other Race,Spanish/Hispanic,1,Emergency,Home or Self Care,2019,NEO013,GASTROINTESTINAL CANCERS - STOMACH,ADM001,TRANSFUSION OF BLOOD AND BLOOD PRODUCTS,240,DIGESTIVE MALIGNANCY,06,DISEASES AND DISORDERS OF THE DIGESTIVE SYSTEM,2,Moderate,Moderate,Medical,Medicare,Blue Cross/Blue Shield,,,,true,17555.45,4914.25
New York City,Kings,7002053,001304,NYU Langone Hospital-Brooklyn,70 or Older,112,F,White,Not Span/Hispanic,4,Emergency,Home w/ Home Health Services,2019,NEO015,GASTROINTESTINAL CANCERS - COLORECTAL,GIS002,COLONOSCOPY AND PROCTOSCOPY WITH BIOPSY,240,DIGESTIVE MALIGNANCY,06,DISEASES AND DISORDERS OF THE DIGESTIVE SYSTEM,3,Major,Moderate,Medical,Medicare,Blue Cross/Blue Shield,Medicaid,,,true,69208.82,19152.02
New York City,Kings,7002053,001304,NYU Langone Hospital-Brooklyn,50 to 69,100,M,White,Not Span/Hispanic,24,Emergency,Skilled Nursing Home,2019,NEO013,GASTROINTESTINAL CANCERS - STOMACH,GIS027,"UPPER GI THERAPEUTIC PROCEDURES, NEC (ENDOSCOPIC)",240,DIGESTIVE MALIGNANCY,06,DISEASES AND DISORDERS OF THE DIGESTIVE SYSTEM,3,Major,Major,Medical,Private Health Insurance,,,,,true,249851.46,86314.61
New York City,Kings,7002053,001304,NYU Langone Hospital-Brooklyn,70 or Older,112,M,White,Not Span/Hispanic,1,Emergency,Home or Self Care,2019,NEO015,GASTROINTESTINAL CANCERS - COLORECTAL,ADM001,TRANSFUSION OF BLOOD AND BLOOD PRODUCTS,240,DIGESTIVE MALIGNANCY,06,DISEASES AND DISORDERS OF THE DIGESTIVE SYSTEM,1,Minor,Moderate,Medical,Medicare,Blue Cross/Blue Shield,,,,true,24021.03,6066.17
New York City,Kings,7002053,001304,NYU Langone Hospital-Brooklyn,18 to 29,112,M,Black/African American,Not Span/Hispanic,3,Emergency,Home or Self Care,2019,NEO015,GASTROINTESTINAL CANCERS - COLORECTAL,HEP001,LIVER BIOPSY,240,DIGESTIVE MALIGNANCY,06,DISEASES AND DISORDERS OF THE DIGESTIVE SYSTEM,1,Minor,Moderate,Medical,Private Health Insurance,Blue Cross/Blue Shield,,,,true,74670.34,16839.97
New York City,Kings,7002053,001304,NYU Langone Hospital-Brooklyn,30 to 49,112,F,Black/African American,Not Span/Hispanic,3,Emergency,Home or Self Care,2019,NEO070,SECONDARY MALIGNANCIES,RES003,THORACENTESIS (DIAGNOSTIC),240,DIGESTIVE MALIGNANCY,06,DISEASES AND DISORDERS OF THE DIGESTIVE SYSTEM,3,Major,Major,Medical,Private Health Insurance,,,,,true,56556.6,13536.89
New York City,Kings,7002053,001304,NYU Langone Hospital-Brooklyn,70 or Older,112,F,Other Race,Unknown,4,Emergency,Skilled Nursing Home,2019,NEO070,SECONDARY MALIGNANCIES,GIS006,PARACENTESIS,240,DIGESTIVE MALIGNANCY,06,DISEASES AND DISORDERS OF THE DIGESTIVE SYSTEM,3,Major,Major,Medical,Medicare,Medicaid,,,,true,68551.31,22675.84
New York City,Kings,7002053,001304,NYU Langone Hospital-Brooklyn,30 to 49,113,F,White,Not Span/Hispanic,1,Emergency,Home or Self Care,2019,NEO015,GASTROINTESTINAL CANCERS - COLORECTAL,GIS029,"LOWER GI THERAPEUTIC PROCEDURES, NEC (EXCLUDING OPEN AND LAPAROSCOPIC)",240,DIGESTIVE MALIGNANCY,06,DISEASES AND DISORDERS OF THE DIGESTIVE SYSTEM,1,Minor,Minor,Medical,Blue Cross/Blue Shield,,,,,true,103453.64,17523.29
New York City,Kings,7002053,001304,NYU Langone Hospital-Brooklyn,50 to 69,112,M,White,Not Span/Hispanic,1,Elective,Home or Self Care,2019,NEO015,GASTROINTESTINAL CANCERS - COLORECTAL,GIS016,GI SYSTEM ENDOSCOPIC THERAPEUTIC PROCEDURES,240,DIGESTIVE MALIGNANCY,06,DISEASES AND DISORDERS OF THE DIGESTIVE SYSTEM,2,Moderate,Moderate,Medical,Medicaid,,,,,false,86546.65,14479.93
New York City,Kings,7002053,001304,NYU Langone Hospital-Brooklyn,70 or Older,112,F,White,Not Span/Hispanic,5,Emergency,Home w/ Home Health Services,2019,NEO015,GASTROINTESTINAL CANCERS - COLORECTAL,GIS002,COLONOSCOPY AND PROCTOSCOPY WITH BIOPSY,240,DIGESTIVE MALIGNANCY,06,DISEASES AND DISORDERS OF THE DIGESTIVE SYSTEM,4,Extreme,Extreme,Medical,Medicare,,,,,true,117072.35,28415.35
New York City,Kings,7002053,001304,NYU Langone Hospital-Brooklyn,70 or Older,112,M,Black/African American,Unknown,4,Emergency,Home or Self Care,2019,NEO070,SECONDARY MALIGNANCIES,,,240,DIGESTIVE MALIGNANCY,06,DISEASES AND DISORDERS OF THE DIGESTIVE SYSTEM,3,Major,Major,Medical,Medicaid,,,,,true,40666.56,15000.31
New York City,Kings,7002053,001304,NYU Langone Hospital-Brooklyn,30 to 49,112,F,White,Not Span/Hispanic,2,Emergency,Home or Self Care,2019,NEO070,SECONDARY MALIGNANCIES,GIS006,PARACENTESIS,240,DIGESTIVE MALIGNANCY,06,DISEASES AND DISORDERS OF THE DIGESTIVE SYSTEM,3,Major,Extreme,Medical,Private Health Insurance,,,,,true,46119.05,11033.28
New York City,Kings,7002053,001304,NYU Langone Hospital-Brooklyn,30 to 49,112,M,Other Race,Not Span/Hispanic,2,Emergency,Home or Self Care,2019,NEO070,SECONDARY MALIGNANCIES,GIS007,GI SYSTEM DRAINAGE (EXCLUDING PARACENTESIS),240,DIGESTIVE MALIGNANCY,06,DISEASES AND DISORDERS OF THE DIGESTIVE SYSTEM,3,Major,Major,Medical,Blue Cross/Blue Shield,,,,,true,44528.85,10005.99
New York City,Kings,7002053,001304,NYU Langone Hospital-Brooklyn,70 or Older,112,F,White,Not Span/Hispanic,2,Emergency,Home or Self Care,2019,NEO070,SECONDARY MALIGNANCIES,HEP003,DIAGNOSTIC ERCP WITH OR WITHOUT BIOPSY,240,DIGESTIVE MALIGNANCY,06,DISEASES AND DISORDERS OF THE DIGESTIVE SYSTEM,2,Moderate,Moderate,Medical,Private Health Insurance,,,,,true,111467.88,20570.81
New York City,Kings,7002053,001304,NYU Langone Hospital-Brooklyn,70 or Older,112,F,Other Race,Not Span/Hispanic,5,Emergency,Expired,2019,NEO015,GASTROINTESTINAL CANCERS - COLORECTAL,,,240,DIGESTIVE MALIGNANCY,06,DISEASES AND DISORDERS OF THE DIGESTIVE SYSTEM,4,Extreme,Extreme,Medical,Medicare,Medicaid,,,,true,73890.77,22389.91
New York City,Kings,7002053,001304,NYU Langone Hospital-Brooklyn,70 or Older,112,M,White,Not Span/Hispanic,10,Emergency,Skilled Nursing Home,2019,NEO015,GASTROINTESTINAL CANCERS - COLORECTAL,RES005,CHEST TUBE PLACEMENT AND THERAPEUTIC THORACENTESIS,240,DIGESTIVE MALIGNANCY,06,DISEASES AND DISORDERS OF THE DIGESTIVE SYSTEM,3,Major,Major,Medical,Medicare,Medicaid,,,,true,110237.28,36644.44
New York City,Kings,7002053,001304,NYU Langone Hospital-Brooklyn,70 or Older,112,M,Other Race,Not Span/Hispanic,4,Emergency,Home or Self Care,2019,NEO013,GASTROINTESTINAL CANCERS - STOMACH,ADM001,TRANSFUSION OF BLOOD AND BLOOD PRODUCTS,240,DIGESTIVE MALIGNANCY,06,DISEASES AND DISORDERS OF THE DIGESTIVE SYSTEM,3,Major,Major,Medical,Medicare,Medicaid,,,,true,46177.83,15596.62
New York City,Kings,7002053,001304,NYU Langone Hospital-Brooklyn,70 or Older,112,M,Other Race,Unknown,2,Emergency,Home or Self Care,2019,NEO013,GASTROINTESTINAL CANCERS - STOMACH,GIS001,ESOPHAGOGASTRODUODENOSCOPY (EGD) WITH BIOPSY,240,DIGESTIVE MALIGNANCY,06,DISEASES AND DISORDERS OF THE DIGESTIVE SYSTEM,3,Major,Moderate,Medical,Medicaid,,,,,true,72122.44,15385.81
New York City,Kings,7002053,001304,NYU Langone Hospital-Brooklyn,50 to 69,112,F,White,Not Span/Hispanic,2,Emergency,Home or Self Care,2019,NEO070,SECONDARY MALIGNANCIES,GIS006,PARACENTESIS,240,DIGESTIVE MALIGNANCY,06,DISEASES AND DISORDERS OF THE DIGESTIVE SYSTEM,3,Major,Extreme,Medical,Medicaid,,,,,true,72835.33,15128.59
New York City,Kings,7002053,001304,NYU Langone Hospital-Brooklyn,70 or Older,112,M,Other Race,Spanish/Hispanic,6,Emergency,Home or Self Care,2019,NEO015,GASTROINTESTINAL CANCERS - COLORECTAL,GIS002,COLONOSCOPY AND PROCTOSCOPY WITH BIOPSY,240,DIGESTIVE MALIGNANCY,06,DISEASES AND DISORDERS OF THE DIGESTIVE SYSTEM,3,Major,Major,Medical,Medicaid,,,,,true,127964.95,32089.75
New York City,Kings,7002053,001304,NYU Langone Hospital-Brooklyn,70 or Older,112,F,Other Race,Not Span/Hispanic,3,Emergency,Home or Self Care,2019,NEO013,GASTROINTESTINAL CANCERS - STOMACH,GIS001,ESOPHAGOGASTRODUODENOSCOPY (EGD) WITH BIOPSY,240,DIGESTIVE MALIGNANCY,06,DISEASES AND DISORDERS OF THE DIGESTIVE SYSTEM,2,Moderate,Minor,Medical,Medicaid,,,,,true,74090.43,17682.87
New York City,Kings,7002053,001304,NYU Langone Hospital-Brooklyn,70 or Older,103,F,White,Not Span/Hispanic,1,Emergency,Home w/ Home Health Services,2019,NEO015,GASTROINTESTINAL CANCERS - COLORECTAL,GIS002,COLONOSCOPY AND PROCTOSCOPY WITH BIOPSY,240,DIGESTIVE MALIGNANCY,06,DISEASES AND DISORDERS OF THE DIGESTIVE SYSTEM,2,Moderate,Moderate,Medical,Medicare,,,,,true,43736.41,8726.8
New York City,Kings,7002053,001304,NYU Langone Hospital-Brooklyn,50 to 69,112,F,White,Not Span/Hispanic,3,Emergency,Home or Self Care,2019,NEO070,SECONDARY MALIGNANCIES,GIS006,PARACENTESIS,240,DIGESTIVE MALIGNANCY,06,DISEASES AND DISORDERS OF THE DIGESTIVE SYSTEM,3,Major,Major,Medical,Medicaid,,,,,true,56810.04,15420.15