Hospital Service Area,Hospital County,Operating Certificate Number,Permanent Facility Id,Facility Name,Age Group,Zip Code - 3 digits,Gender,Race,Ethnicity,Length of Stay,Type of Admission,Patient Disposition,Discharge Year,CCS Diagnosis Code,CCS Diagnosis Description,CCS Procedure Code,CCS Procedure Description,APR DRG Code,APR DRG Description,APR MDC Code,APR MDC Description,APR Severity of Illness Code,APR Severity of Illness Description,APR Risk of Mortality,APR Medical Surgical Description,Payment Typology 1,Payment Typology 2,Payment Typology 3,Birth Weight,Abortion Edit Indicator,Emergency Department Indicator,Total Charges,Total Costs
New York City,Bronx,7000006,003058,Montefiore Med Center - Jack D Weiler Hosp of A Einstein College Div,30 to 49,107,M,Black/African American,Not Span/Hispanic,13,Emergency,Home w/ Home Health Services,2020,NEO013,GASTROINTESTINAL CANCERS - STOMACH,CAR028,INFERIOR VENA CAVA (IVC) FILTER PROCEDURES,240,DIGESTIVE MALIGNANCY,06,DISEASES AND DISORDERS OF THE DIGESTIVE SYSTEM,3,Major,Major,Medical,Private Health Insurance,,,,,Y,175936.57,31332.19
New York City,Bronx,7000006,001169,Montefiore Medical Center - Henry & Lucy Moses Div,18 to 29,104,M,Other Race,Spanish/Hispanic,21,Emergency,Expired,2020,NEO070,SECONDARY MALIGNANCIES,GIS007,GI SYSTEM DRAINAGE (EXCLUDING PARACENTESIS),240,DIGESTIVE MALIGNANCY,06,DISEASES AND DISORDERS OF THE DIGESTIVE SYSTEM,4,Extreme,Major,Medical,Medicaid,,,,,Y,229088.95,44812.65
New York City,Bronx,7000006,003058,Montefiore Med Center - Jack D Weiler Hosp of A Einstein College Div,70 or Older,104,F,White,Not Span/Hispanic,17,Emergency,Skilled Nursing Home,2020,NEO015,GASTROINTESTINAL CANCERS - COLORECTAL,GIS002,COLONOSCOPY AND PROCTOSCOPY WITH BIOPSY,240,DIGESTIVE MALIGNANCY,06,DISEASES AND DISORDERS OF THE DIGESTIVE SYSTEM,3,Major,Major,Medical,Medicare,,,,,Y,150583.63,29321.08
New York City,Manhattan,7002024,001456,Mount Sinai Hospital,50 to 69,107,F,Other Race,Spanish/Hispanic,6,Emergency,Home or Self Care,2020,NEO013,GASTROINTESTINAL CANCERS - STOMACH,ADM002,TRANSFUSION OF PLASMA,240,DIGESTIVE MALIGNANCY,06,DISEASES AND DISORDERS OF THE DIGESTIVE SYSTEM,2,Moderate,Moderate,Medical,Blue Cross/Blue Shield,Medicaid,Self-Pay,,,Y,140714.83,30042.87
New York City,Bronx,7000006,003058,Montefiore Med Center - Jack D Weiler Hosp of A Einstein College Div,70 or Older,,M,White,Unknown,8,Emergency,Home w/ Home Health Services,2020,NEO015,GASTROINTESTINAL CANCERS - COLORECTAL,RES005,CHEST TUBE PLACEMENT AND THERAPEUTIC THORACENTESIS,240,DIGESTIVE MALIGNANCY,06,DISEASES AND DISORDERS OF THE DIGESTIVE SYSTEM,2,Moderate,Major,Medical,Medicare,,,,,Y,130182.62,33770.97
New York City,Bronx,7000006,003058,Montefiore Med Center - Jack D Weiler Hosp of A Einstein College Div,70 or Older,104,F,Black/African American,Not Span/Hispanic,11,Emergency,Hospice - Home,2020,NEO070,SECONDARY MALIGNANCIES,GIS027,"UPPER GI THERAPEUTIC PROCEDURES, NEC (ENDOSCOPIC)",240,DIGESTIVE MALIGNANCY,06,DISEASES AND DISORDERS OF THE DIGESTIVE SYSTEM,3,Major,Major,Medical,Medicare,,,,,Y,151605.16,30929.69
New York City,Bronx,7000006,003058,Montefiore Med Center - Jack D Weiler Hosp of A Einstein College Div,50 to 69,104,M,Black/African American,Not Span/Hispanic,23,Emergency,Hospice - Medical Facility,2020,NEO016,GASTROINTESTINAL CANCERS - ANUS,ADM001,TRANSFUSION OF BLOOD AND BLOOD PRODUCTS,240,DIGESTIVE MALIGNANCY,06,DISEASES AND DISORDERS OF THE DIGESTIVE SYSTEM,3,Major,Major,Medical,Private Health Insurance,,,,,Y,278940.9,52037.85
New York City,Bronx,7000006,003058,Montefiore Med Center - Jack D Weiler Hosp of A Einstein College Div,50 to 69,104,F,White,Not Span/Hispanic,9,Emergency,Home or Self Care,2020,NEO015,GASTROINTESTINAL CANCERS - COLORECTAL,GIS029,"LOWER GI THERAPEUTIC PROCEDURES, NEC (EXCLUDING OPEN AND LAPAROSCOPIC)",240,DIGESTIVE MALIGNANCY,06,DISEASES AND DISORDERS OF THE DIGESTIVE SYSTEM,3,Major,Minor,Medical,Medicare,Private Health Insurance,,,,Y,135175.69,28458.35
New York City,Bronx,7000006,001169,Montefiore Medical Center - Henry & Lucy Moses Div,70 or Older,104,F,Other Race,Spanish/Hispanic,4,Emergency,Home or Self Care,2020,NEO070,SECONDARY MALIGNANCIES,GIS007,GI SYSTEM DRAINAGE (EXCLUDING PARACENTESIS),240,DIGESTIVE MALIGNANCY,06,DISEASES AND DISORDERS OF THE DIGESTIVE SYSTEM,2,Moderate,Major,Medical,Private Health Insurance,Medicare,,,,Y,56638.45,9584.07
New York City,Manhattan,7002024,001456,Mount Sinai Hospital,50 to 69,100,M,Black/African American,Not Span/Hispanic,34,Emergency,Skilled Nursing Home,2020,NEO013,GASTROINTESTINAL CANCERS - STOMACH,ADM001,TRANSFUSION OF BLOOD AND BLOOD PRODUCTS,240,DIGESTIVE MALIGNANCY,06,DISEASES AND DISORDERS OF THE DIGESTIVE SYSTEM,4,Extreme,Extreme,Medical,Private Health Insurance,Self-Pay,,,,Y,454994.78,111869.32
New York City,Kings,7002002,001324,Mount Sinai Brooklyn,70 or Older,112,F,Black/African American,Not Span/Hispanic,7,Emergency,Home w/ Home Health Services,2020,NEO013,GASTROINTESTINAL CANCERS - STOMACH,CAR028,INFERIOR VENA CAVA (IVC) FILTER PROCEDURES,240,DIGESTIVE MALIGNANCY,06,DISEASES AND DISORDERS OF THE DIGESTIVE SYSTEM,2,Moderate,Moderate,Medical,Medicare,Medicaid,Self-Pay,,,Y,107810.52,15627.29
New York City,Bronx,7000006,001169,Montefiore Medical Center - Henry & Lucy Moses Div,50 to 69,104,M,Other Race,Spanish/Hispanic,10,Emergency,Home or Self Care,2020,NEO012,GASTROINTESTINAL CANCERS - ESOPHAGUS,ADM001,TRANSFUSION OF BLOOD AND BLOOD PRODUCTS,240,DIGESTIVE MALIGNANCY,06,DISEASES AND DISORDERS OF THE DIGESTIVE SYSTEM,3,Major,Major,Medical,Private Health Insurance,,,,,Y,129599.78,23172.36
New York City,Manhattan,7002032,001466,Mount Sinai West,50 to 69,112,F,Black/African American,Not Span/Hispanic,6,Urgent,Home or Self Care,2020,NEO070,SECONDARY MALIGNANCIES,GIS004,GI SYSTEM ENDOSCOPY WITHOUT BIOPSY (DIAGNOSTIC),240,DIGESTIVE MALIGNANCY,06,DISEASES AND DISORDERS OF THE DIGESTIVE SYSTEM,3,Major,Major,Medical,Medicare,Medicare,Self-Pay,,,N,68426.23,14607.3
New York City,Manhattan,7002002,001439,Mount Sinai Beth Israel,70 or Older,100,F,Other Race,Spanish/Hispanic,12,Emergency,Expired,2020,NEO013,GASTROINTESTINAL CANCERS - STOMACH,HEP009,PANCREATIC AND PROXIMAL BILIARY DILATION AND STENTING,240,DIGESTIVE MALIGNANCY,06,DISEASES AND DISORDERS OF THE DIGESTIVE SYSTEM,4,Extreme,Extreme,Medical,Medicare,Miscellaneous/Other,Medicaid,,,Y,161293.87,38221.8
New York City,Manhattan,7002032,001466,Mount Sinai West,50 to 69,100,F,Other Race,Not Span/Hispanic,7,Emergency,Home or Self Care,2020,NEO070,SECONDARY MALIGNANCIES,GIS007,GI SYSTEM DRAINAGE (EXCLUDING PARACENTESIS),240,DIGESTIVE MALIGNANCY,06,DISEASES AND DISORDERS OF THE DIGESTIVE SYSTEM,4,Extreme,Extreme,Medical,Medicare,Medicare,Medicaid,,,Y,87039.68,19654.92
New York City,Manhattan,7002032,001466,Mount Sinai West,50 to 69,112,M,Other Race,Spanish/Hispanic,2,Urgent,Home or Self Care,2020,NEO013,GASTROINTESTINAL CANCERS - STOMACH,GIS001,ESOPHAGOGASTRODUODENOSCOPY (EGD) WITH BIOPSY,240,DIGESTIVE MALIGNANCY,06,DISEASES AND DISORDERS OF THE DIGESTIVE SYSTEM,2,Moderate,Moderate,Medical,Medicaid,Medicaid,Self-Pay,,,N,26909.53,5884.73
New York City,Manhattan,7002032,001466,Mount Sinai West,70 or Older,112,M,Black/African American,Not Span/Hispanic,2,Urgent,Home or Self Care,2020,NEO013,GASTROINTESTINAL CANCERS - STOMACH,HEP003,DIAGNOSTIC ERCP WITH OR WITHOUT BIOPSY,240,DIGESTIVE MALIGNANCY,06,DISEASES AND DISORDERS OF THE DIGESTIVE SYSTEM,1,Minor,Minor,Medical,Medicare,Medicare,Self-Pay,,,N,37162.26,8316.28
Hudson Valley,Westchester,5901000,001039,NewYork-Presbyterian/Hudson Valley Hospital,50 to 69,OOS,F,White,Not Span/Hispanic,3,Emergency,Home or Self Care,2020,NEO070,SECONDARY MALIGNANCIES,RES005,CHEST TUBE PLACEMENT AND THERAPEUTIC THORACENTESIS,240,DIGESTIVE MALIGNANCY,06,DISEASES AND DISORDERS OF THE DIGESTIVE SYSTEM,3,Major,Major,Medical,Medicare,Private Health Insurance,,,,Y,53400.14,12538.33
New York City,Bronx,7000006,001169,Montefiore Medical Center - Henry & Lucy Moses Div,50 to 69,104,M,Other Race,Spanish/Hispanic,1,Elective,Home or Self Care,2020,NEO013,GASTROINTESTINAL CANCERS - STOMACH,GIS010,GASTRECTOMY,240,DIGESTIVE MALIGNANCY,06,DISEASES AND DISORDERS OF THE DIGESTIVE SYSTEM,2,Moderate,Moderate,Medical,Medicare,Private Health Insurance,,,,N,39635.77,7314.32
New York City,Bronx,7000006,001169,Montefiore Medical Center - Henry & Lucy Moses Div,70 or Older,104,F,Black/African American,Not Span/Hispanic,13,Emergency,Expired,2020,NEO070,SECONDARY MALIGNANCIES,GIS007,GI SYSTEM DRAINAGE (EXCLUDING PARACENTESIS),240,DIGESTIVE MALIGNANCY,06,DISEASES AND DISORDERS OF THE DIGESTIVE SYSTEM,3,Major,Major,Medical,Medicare,Private Health Insurance,,,,Y,158064.86,31519.51
New York City,Bronx,7000006,001169,Montefiore Medical Center - Henry & Lucy Moses Div,30 to 49,104,F,Other Race,Spanish/Hispanic,8,Emergency,Home w/ Home Health Services,2020,NEO016,GASTROINTESTINAL CANCERS - ANUS,CAR024,VENOUS AND ARTERIAL CATHETER PLACEMENT,240,DIGESTIVE MALIGNANCY,06,DISEASES AND DISORDERS OF THE DIGESTIVE SYSTEM,2,Moderate,Major,Medical,Private Health Insurance,,,,,Y,125503.95,23214.02
New York City,Bronx,7000006,001169,Montefiore Medical Center - Henry & Lucy Moses Div,70 or Older,104,F,Black/African American,Not Span/Hispanic,7,Emergency,Home or Self Care,2020,NEO015,GASTROINTESTINAL CANCERS - COLORECTAL,GIS002,COLONOSCOPY AND PROCTOSCOPY WITH BIOPSY,240,DIGESTIVE MALIGNANCY,06,DISEASES AND DISORDERS OF THE DIGESTIVE SYSTEM,2,Moderate,Moderate,Medical,Medicare,,,,,Y,158369.32,32410.25
New York City,Bronx,7000006,003058,Montefiore Med Center - Jack D Weiler Hosp of A Einstein College Div,70 or Older,104,F,Other Race,Spanish/Hispanic,3,Emergency,Hospice - Home,2020,NEO016,GASTROINTESTINAL CANCERS - ANUS,ADM001,TRANSFUSION OF BLOOD AND BLOOD PRODUCTS,240,DIGESTIVE MALIGNANCY,06,DISEASES AND DISORDERS OF THE DIGESTIVE SYSTEM,1,Minor,Minor,Medical,Medicare,,,,,Y,46276.1,8184.81
New York City,Bronx,7000006,001169,Montefiore Medical Center - Henry & Lucy Moses Div,50 to 69,104,F,Other Race,Spanish/Hispanic,1,Emergency,Home or Self Care,2020,NEO070,SECONDARY MALIGNANCIES,ADM001,TRANSFUSION OF BLOOD AND BLOOD PRODUCTS,240,DIGESTIVE MALIGNANCY,06,DISEASES AND DISORDERS OF THE DIGESTIVE SYSTEM,2,Moderate,Minor,Medical,Medicare,,,,,Y,29765.64,2840.73
New York City,Manhattan,7002054,003975,New York Presbyterian Hospital - Allen Hospital,70 or Older,104,F,Multi-racial,Spanish/Hispanic,2,Emergency,Home w/ Home Health Services,2020,NEO070,SECONDARY MALIGNANCIES,IMG007,COMPUTERIZED TOMOGRAPHY (CT) WITHOUT CONTRAST,240,DIGESTIVE MALIGNANCY,06,DISEASES AND DISORDERS OF THE DIGESTIVE SYSTEM,3,Major,Major,Medical,Medicare,Medicare,Medicaid,,,Y,27407.22,6060.02
New York City,Bronx,7000006,003058,Montefiore Med Center - Jack D Weiler Hosp of A Einstein College Div,50 to 69,104,M,Other Race,Not Span/Hispanic,5,Emergency,Home or Self Care,2020,NEO015,GASTROINTESTINAL CANCERS - COLORECTAL,GIS016,GI SYSTEM ENDOSCOPIC THERAPEUTIC PROCEDURES,240,DIGESTIVE MALIGNANCY,06,DISEASES AND DISORDERS OF THE DIGESTIVE SYSTEM,2,Moderate,Minor,Medical,Private Health Insurance,,,,,Y,82894.64,15410.33
New York City,Manhattan,7002054,001464,New York-Presbyterian Hospital - Columbia Presbyterian Center,50 to 69,100,M,Other Race,Multi-ethnic,2,Elective,Home or Self Care,2020,NEO013,GASTROINTESTINAL CANCERS - STOMACH,GIS010,GASTRECTOMY,240,DIGESTIVE MALIGNANCY,06,DISEASES AND DISORDERS OF THE DIGESTIVE SYSTEM,1,Minor,Minor,Medical,Medicaid,Medicaid,Self-Pay,,,N,52431.57,12671.82
New York City,Manhattan,7002054,001464,New York-Presbyterian Hospital - Columbia Presbyterian Center,30 to 49,OOS,M,Multi-racial,Not Span/Hispanic,10,Emergency,Home w/ Home Health Services,2020,NEO070,SECONDARY MALIGNANCIES,RES005,CHEST TUBE PLACEMENT AND THERAPEUTIC THORACENTESIS,240,DIGESTIVE MALIGNANCY,06,DISEASES AND DISORDERS OF THE DIGESTIVE SYSTEM,3,Major,Major,Medical,Private Health Insurance,Self-Pay,,,,Y,150247.96,31779.55
New York City,Manhattan,7002054,001464,New York-Presbyterian Hospital - Columbia Presbyterian Center,30 to 49,OOS,M,Multi-racial,Not Span/Hispanic,11,Emergency,Home w/ Home Health Services,2020,NEO070,SECONDARY MALIGNANCIES,GIS006,PARACENTESIS,240,DIGESTIVE MALIGNANCY,06,DISEASES AND DISORDERS OF THE DIGESTIVE SYSTEM,4,Extreme,Extreme,Medical,Private Health Insurance,Self-Pay,,,,Y,195661.1,57194.33
New York City,Manhattan,7002054,001464,New York-Presbyterian Hospital - Columbia Presbyterian Center,70 or Older,100,F,Multi-racial,Multi-ethnic,7,Emergency,Home or Self Care,2020,NEO070,SECONDARY MALIGNANCIES,RES005,CHEST TUBE PLACEMENT AND THERAPEUTIC THORACENTESIS,240,DIGESTIVE MALIGNANCY,06,DISEASES AND DISORDERS OF THE DIGESTIVE SYSTEM,2,Moderate,Major,Medical,Medicare,Medicare,Medicaid,,,Y,104331.97,23180.22
New York City,Manhattan,7002054,001464,New York-Presbyterian Hospital - Columbia Presbyterian Center,70 or Older,107,F,Black/African American,Not Span/Hispanic,8,Emergency,Skilled Nursing Home,2020,NEO015,GASTROINTESTINAL CANCERS - COLORECTAL,ADM001,TRANSFUSION OF BLOOD AND BLOOD PRODUCTS,240,DIGESTIVE MALIGNANCY,06,DISEASES AND DISORDERS OF THE DIGESTIVE SYSTEM,3,Major,Extreme,Medical,Medicare,Private Health Insurance,Medicaid,,,Y,114379.77,25647.44
New York City,Manhattan,7002054,001464,New York-Presbyterian Hospital - Columbia Presbyterian Center,50 to 69,100,M,Multi-racial,Multi-ethnic,1,Emergency,Home or Self Care,2020,NEO015,GASTROINTESTINAL CANCERS - COLORECTAL,GIS006,PARACENTESIS,240,DIGESTIVE MALIGNANCY,06,DISEASES AND DISORDERS OF THE DIGESTIVE SYSTEM,2,Moderate,Major,Medical,Private Health Insurance,Self-Pay,,,,Y,30977.84,7297
New York City,Manhattan,7002054,001464,New York-Presbyterian Hospital - Columbia Presbyterian Center,50 to 69,103,M,White,Not Span/Hispanic,9,Emergency,Home w/ Home Health Services,2020,NEO012,GASTROINTESTINAL CANCERS - ESOPHAGUS,GIS027,"UPPER GI THERAPEUTIC PROCEDURES, NEC (ENDOSCOPIC)",240,DIGESTIVE MALIGNANCY,06,DISEASES AND DISORDERS OF THE DIGESTIVE SYSTEM,2,Moderate,Major,Medical,Medicare,Private Health Insurance,Self-Pay,,,Y,146879.1,34488.68
New York City,Manhattan,7002054,001464,New York-Presbyterian Hospital - Columbia Presbyterian Center,50 to 69,103,M,White,Not Span/Hispanic,6,Urgent,Home w/ Home Health Services,2020,NEO012,GASTROINTESTINAL CANCERS - ESOPHAGUS,RES001,BRONCHOSCOPY (DIAGNOSTIC),240,DIGESTIVE MALIGNANCY,06,DISEASES AND DISORDERS OF THE DIGESTIVE SYSTEM,3,Major,Moderate,Medical,Medicare,Private Health Insurance,Self-Pay,,,N,96068.73,20882.1
New York City,Manhattan,7002054,001464,New York-Presbyterian Hospital - Columbia Presbyterian Center,70 or Older,104,F,Other Race,Multi-ethnic,8,Emergency,Home w/ Home Health Services,2020,NEO015,GASTROINTESTINAL CANCERS - COLORECTAL,GIS004,GI SYSTEM ENDOSCOPY WITHOUT BIOPSY (DIAGNOSTIC),240,DIGESTIVE MALIGNANCY,06,DISEASES AND DISORDERS OF THE DIGESTIVE SYSTEM,3,Major,Major,Medical,Medicare,Medicare,Medicaid,,,Y,107490.08,23466.36
New York City,Manhattan,7002054,001464,New York-Presbyterian Hospital - Columbia Presbyterian Center,50 to 69,104,F,Multi-racial,Not Span/Hispanic,3,Emergency,Skilled Nursing Home,2020,NEO016,GASTROINTESTINAL CANCERS - ANUS,,,240,DIGESTIVE MALIGNANCY,06,DISEASES AND DISORDERS OF THE DIGESTIVE SYSTEM,3,Major,Major,Medical,Medicaid,Medicaid,Self-Pay,,,Y,42175.03,9606.43
New York City,Manhattan,7002054,001464,New York-Presbyterian Hospital - Columbia Presbyterian Center,50 to 69,104,M,Other Race,Multi-ethnic,5,Emergency,Home or Self Care,2020,NEO013,GASTROINTESTINAL CANCERS - STOMACH,GIS006,PARACENTESIS,240,DIGESTIVE MALIGNANCY,06,DISEASES AND DISORDERS OF THE DIGESTIVE SYSTEM,3,Major,Major,Medical,Medicaid,Medicaid,Self-Pay,,,Y,75577.45,16360.84
New York City,Manhattan,7002054,001464,New York-Presbyterian Hospital - Columbia Presbyterian Center,50 to 69,100,F,White,Not Span/Hispanic,7,Emergency,Home w/ Home Health Services,2020,NEO070,SECONDARY MALIGNANCIES,ADM001,TRANSFUSION OF BLOOD AND BLOOD PRODUCTS,240,DIGESTIVE MALIGNANCY,06,DISEASES AND DISORDERS OF THE DIGESTIVE SYSTEM,2,Moderate,Major,Medical,Medicaid,Self-Pay,,,,Y,84997.91,18323.93
New York City,Manhattan,7002054,001464,New York-Presbyterian Hospital - Columbia Presbyterian Center,70 or Older,104,M,Other Race,Not Span/Hispanic,26,Emergency,Skilled Nursing Home,2020,NEO013,GASTROINTESTINAL CANCERS - STOMACH,GIS010,GASTRECTOMY,240,DIGESTIVE MALIGNANCY,06,DISEASES AND DISORDERS OF THE DIGESTIVE SYSTEM,4,Extreme,Extreme,Medical,Medicare,Medicare,Self-Pay,,,Y,455450.76,131834.52
New York City,Manhattan,7002054,001464,New York-Presbyterian Hospital - Columbia Presbyterian Center,50 to 69,136,F,White,Not Span/Hispanic,11,Urgent,Expired,2020,NEO067,MESOTHELIOMA,ADM017,ADMINISTRATION OF NUTRITIONAL AND ELECTROLYTIC SUBSTANCES,240,DIGESTIVE MALIGNANCY,06,DISEASES AND DISORDERS OF THE DIGESTIVE SYSTEM,4,Extreme,Extreme,Medical,Medicaid,Medicaid,Self-Pay,,,N,204836.78,60773.42
New York City,Manhattan,7002054,001464,New York-Presbyterian Hospital - Columbia Presbyterian Center,70 or Older,100,F,Black/African American,Not Span/Hispanic,20,Emergency,Hospice - Home,2020,NEO013,GASTROINTESTINAL CANCERS - STOMACH,GIS001,ESOPHAGOGASTRODUODENOSCOPY (EGD) WITH BIOPSY,240,DIGESTIVE MALIGNANCY,06,DISEASES AND DISORDERS OF THE DIGESTIVE SYSTEM,3,Major,Extreme,Medical,Medicare,Blue Cross/Blue Shield,Self-Pay,,,Y,244995.42,54415.57
New York City,Manhattan,7002054,001464,New York-Presbyterian Hospital - Columbia Presbyterian Center,70 or Older,107,M,White,Not Span/Hispanic,9,Emergency,Expired,2020,NEO012,GASTROINTESTINAL CANCERS - ESOPHAGUS,ADM001,TRANSFUSION OF BLOOD AND BLOOD PRODUCTS,240,DIGESTIVE MALIGNANCY,06,DISEASES AND DISORDERS OF THE DIGESTIVE SYSTEM,4,Extreme,Major,Medical,Medicare,Blue Cross/Blue Shield,Self-Pay,,,Y,123894.09,26885.13
New York City,Manhattan,7002054,001464,New York-Presbyterian Hospital - Columbia Presbyterian Center,50 to 69,105,M,White,Not Span/Hispanic,13,Emergency,Hospice - Home,2020,NEO013,GASTROINTESTINAL CANCERS - STOMACH,RES005,CHEST TUBE PLACEMENT AND THERAPEUTIC THORACENTESIS,240,DIGESTIVE MALIGNANCY,06,DISEASES AND DISORDERS OF THE DIGESTIVE SYSTEM,4,Extreme,Extreme,Medical,Medicaid,Medicaid,Self-Pay,,,N,151362.75,33791.72
New York City,Manhattan,7002054,001464,New York-Presbyterian Hospital - Columbia Presbyterian Center,50 to 69,100,M,Multi-racial,Not Span/Hispanic,6,Urgent,Home or Self Care,2020,NEO015,GASTROINTESTINAL CANCERS - COLORECTAL,ADM012,CHEMOTHERAPY,240,DIGESTIVE MALIGNANCY,06,DISEASES AND DISORDERS OF THE DIGESTIVE SYSTEM,3,Major,Moderate,Medical,Medicaid,Medicaid,Self-Pay,,,N,80307.08,17655.74
New York City,Manhattan,7002054,001464,New York-Presbyterian Hospital - Columbia Presbyterian Center,50 to 69,104,F,Other Race,Not Span/Hispanic,6,Emergency,Home w/ Home Health Services,2020,NEO070,SECONDARY MALIGNANCIES,GNR009,"RETROPERITONEAL PROCEDURES, NEC",240,DIGESTIVE MALIGNANCY,06,DISEASES AND DISORDERS OF THE DIGESTIVE SYSTEM,3,Major,Major,Medical,Medicaid,Medicaid,Self-Pay,,,Y,104617.48,22988.53
New York City,Manhattan,7002024,001456,Mount Sinai Hospital,50 to 69,104,M,Multi-racial,Not Span/Hispanic,7,Emergency,Home w/ Home Health Services,2020,NEO012,GASTROINTESTINAL CANCERS - ESOPHAGUS,IMG008,ULTRASONOGRAPHY,240,DIGESTIVE MALIGNANCY,06,DISEASES AND DISORDERS OF THE DIGESTIVE SYSTEM,3,Major,Moderate,Medical,Medicaid,Self-Pay,,,,Y,75093.25,19139.02
New York City,Manhattan,7002024,001456,Mount Sinai Hospital,50 to 69,OOS,M,White,Not Span/Hispanic,1,Elective,Home or Self Care,2020,NEO013,GASTROINTESTINAL CANCERS - STOMACH,GIS016,GI SYSTEM ENDOSCOPIC THERAPEUTIC PROCEDURES,240,DIGESTIVE MALIGNANCY,06,DISEASES AND DISORDERS OF THE DIGESTIVE SYSTEM,2,Moderate,Minor,Medical,Private Health Insurance,Self-Pay,,,,N,29621.14,8561.08
New York City,Manhattan,7002024,001456,Mount Sinai Hospital,50 to 69,100,F,Other Race,Spanish/Hispanic,8,Emergency,Home w/ Home Health Services,2020,NEO070,SECONDARY MALIGNANCIES,GIS001,ESOPHAGOGASTRODUODENOSCOPY (EGD) WITH BIOPSY,240,DIGESTIVE MALIGNANCY,06,DISEASES AND DISORDERS OF THE DIGESTIVE SYSTEM,3,Major,Moderate,Medical,Medicaid,Medicaid,Self-Pay,,,Y,126865.52,32211.71
New York City,Manhattan,7002024,001456,Mount Sinai Hospital,70 or Older,115,F,White,Not Span/Hispanic,2,Emergency,Home or Self Care,2020,NEO070,SECONDARY MALIGNANCIES,GIS003,GI SYSTEM BIOPSY (NON-ENDOSCOPIC),240,DIGESTIVE MALIGNANCY,06,DISEASES AND DISORDERS OF THE DIGESTIVE SYSTEM,2,Moderate,Minor,Medical,Medicare,Private Health Insurance,Self-Pay,,,Y,35643.22,8525.11
New York City,Queens,7003010,001637,New York - Presbyterian/Queens,70 or Older,113,F,White,Not Span/Hispanic,9,Emergency,Home or Self Care,2020,NEO014,GASTROINTESTINAL CANCERS - SMALL INTESTINE,GIS001,ESOPHAGOGASTRODUODENOSCOPY (EGD) WITH BIOPSY,240,DIGESTIVE MALIGNANCY,06,DISEASES AND DISORDERS OF THE DIGESTIVE SYSTEM,2,Moderate,Minor,Medical,Medicare,Blue Cross/Blue Shield,Self-Pay,,,Y,84062.71,21449.05
New York City,Queens,7003010,001637,New York - Presbyterian/Queens,70 or Older,113,M,Other Race,Not Span/Hispanic,20,Emergency,Hospice - Medical Facility,2020,NEO013,GASTROINTESTINAL CANCERS - STOMACH,GIS016,GI SYSTEM ENDOSCOPIC THERAPEUTIC PROCEDURES,240,DIGESTIVE MALIGNANCY,06,DISEASES AND DISORDERS OF THE DIGESTIVE SYSTEM,3,Major,Major,Medical,Medicare,Medicaid,Self-Pay,,,Y,219160.14,51418.14
New York City,Queens,7003010,001637,New York - Presbyterian/Queens,70 or Older,113,M,White,Not Span/Hispanic,4,Emergency,Home or Self Care,2020,NEO013,GASTROINTESTINAL CANCERS - STOMACH,GIS001,ESOPHAGOGASTRODUODENOSCOPY (EGD) WITH BIOPSY,240,DIGESTIVE MALIGNANCY,06,DISEASES AND DISORDERS OF THE DIGESTIVE SYSTEM,3,Major,Major,Medical,Private Health Insurance,Medicare,Self-Pay,,,Y,47383.31,11068.85
New York City,Queens,7003010,001637,New York - Presbyterian/Queens,50 to 69,114,F,Other Race,Spanish/Hispanic,6,Emergency,Home w/ Home Health Services,2020,NEO070,SECONDARY MALIGNANCIES,GIS006,PARACENTESIS,240,DIGESTIVE MALIGNANCY,06,DISEASES AND DISORDERS OF THE DIGESTIVE SYSTEM,4,Extreme,Extreme,Medical,Medicaid,Self-Pay,,,,Y,63417.76,14742.68
New York City,Queens,7003010,001637,New York - Presbyterian/Queens,70 or Older,113,M,Other Race,Not Span/Hispanic,8,Emergency,Expired,2020,NEO013,GASTROINTESTINAL CANCERS - STOMACH,CAR024,VENOUS AND ARTERIAL CATHETER PLACEMENT,240,DIGESTIVE MALIGNANCY,06,DISEASES AND DISORDERS OF THE DIGESTIVE SYSTEM,4,Extreme,Extreme,Medical,Medicare,Private Health Insurance,Medicaid,,,Y,58643.48,15561.78
New York City,Queens,7003010,001637,New York - Presbyterian/Queens,50 to 69,115,F,Other Race,Not Span/Hispanic,4,Emergency,Home or Self Care,2020,NEO070,SECONDARY MALIGNANCIES,CAR024,VENOUS AND ARTERIAL CATHETER PLACEMENT,240,DIGESTIVE MALIGNANCY,06,DISEASES AND DISORDERS OF THE DIGESTIVE SYSTEM,3,Major,Major,Medical,"Managed Care, Unspecified",Medicaid,Self-Pay,,,Y,32804.51,8225.92
New York City,Queens,7003010,001637,New York - Presbyterian/Queens,30 to 49,114,F,Other Race,Not Span/Hispanic,11,Emergency,Medicare Cert Long Term Care Hospital,2020,NEO013,GASTROINTESTINAL CANCERS - STOMACH,ADM016,ADMINISTRATION OF ANTI-INFLAMMATORY AGENTS,240,DIGESTIVE MALIGNANCY,06,DISEASES AND DISORDERS OF THE DIGESTIVE SYSTEM,3,Major,Major,Medical,"Managed Care, Unspecified",Medicaid,Self-Pay,,,Y,109614.42,24274.07
New York City,Bronx,7000006,001169,Montefiore Medical Center - Henry & Lucy Moses Div,50 to 69,104,M,Black/African American,Not Span/Hispanic,6,Emergency,Hospice - Medical Facility,2020,NEO015,GASTROINTESTINAL CANCERS - COLORECTAL,GIS006,PARACENTESIS,240,DIGESTIVE MALIGNANCY,06,DISEASES AND DISORDERS OF THE DIGESTIVE SYSTEM,3,Major,Major,Medical,Medicaid,,,,,Y,94906.94,19096.65