Hospital Service Area,Hospital County,Operating Certificate Number,Permanent Facility Id,Facility Name,Age Group,Zip Code - 3 digits,Gender,Race,Ethnicity,Length of Stay,Type of Admission,Patient Disposition,Discharge Year,CCS Diagnosis Code,CCS Diagnosis Description,CCS Procedure Code,CCS Procedure Description,APR DRG Code,APR DRG Description,APR MDC Code,APR MDC Description,APR Severity of Illness Code,APR Severity of Illness Description,APR Risk of Mortality,APR Medical Surgical Description,Payment Typology 1,Payment Typology 2,Payment Typology 3,Birth Weight,Abortion Edit Indicator,Emergency Department Indicator,Total Charges,Total Costs
Long Island,Suffolk,5123000,000885,Long Island Community Hospital,50 to 69,117,M,White,Not Span/Hispanic,10,Emergency,Expired,2020,NEO070,SECONDARY MALIGNANCIES,GIS006,PARACENTESIS,240,DIGESTIVE MALIGNANCY,06,DISEASES AND DISORDERS OF THE DIGESTIVE SYSTEM,4,Extreme,Extreme,Medical,Medicare,Medicare,Blue Cross/Blue Shield,,,Y,97696.48,17313.03
Long Island,Suffolk,5123000,000885,Long Island Community Hospital,70 or Older,117,M,White,Not Span/Hispanic,41,Emergency,Home w/ Home Health Services,2020,NEO015,GASTROINTESTINAL CANCERS - COLORECTAL,GIS004,GI SYSTEM ENDOSCOPY WITHOUT BIOPSY (DIAGNOSTIC),240,DIGESTIVE MALIGNANCY,06,DISEASES AND DISORDERS OF THE DIGESTIVE SYSTEM,3,Major,Major,Medical,Medicare,Medicare,Blue Cross/Blue Shield,,,Y,234166.49,58767.19
Long Island,Suffolk,5123000,000885,Long Island Community Hospital,70 or Older,119,F,White,Not Span/Hispanic,5,Emergency,Home or Self Care,2020,NEO015,GASTROINTESTINAL CANCERS - COLORECTAL,GIS002,COLONOSCOPY AND PROCTOSCOPY WITH BIOPSY,240,DIGESTIVE MALIGNANCY,06,DISEASES AND DISORDERS OF THE DIGESTIVE SYSTEM,3,Major,Major,Medical,Medicare,Medicare,Private Health Insurance,,,Y,61087.91,11603.1
Long Island,Suffolk,5123000,000885,Long Island Community Hospital,70 or Older,117,M,Other Race,Not Span/Hispanic,15,Emergency,Short-term Hospital,2020,NEO070,SECONDARY MALIGNANCIES,GIS007,GI SYSTEM DRAINAGE (EXCLUDING PARACENTESIS),240,DIGESTIVE MALIGNANCY,06,DISEASES AND DISORDERS OF THE DIGESTIVE SYSTEM,3,Major,Moderate,Medical,Medicare,,,,,Y,93984,22159.15
Long Island,Suffolk,5123000,000885,Long Island Community Hospital,70 or Older,117,M,White,Not Span/Hispanic,3,Emergency,Expired,2020,NEO070,SECONDARY MALIGNANCIES,,,240,DIGESTIVE MALIGNANCY,06,DISEASES AND DISORDERS OF THE DIGESTIVE SYSTEM,2,Moderate,Major,Medical,Medicare,Medicare,Medicaid,,,Y,36138.3,4980.49
Long Island,Suffolk,5123000,000885,Long Island Community Hospital,50 to 69,119,M,White,Not Span/Hispanic,8,Emergency,Home or Self Care,2020,NEO012,GASTROINTESTINAL CANCERS - ESOPHAGUS,MAM005,MEASUREMENT DURING CARDIAC CATHETERIZATION,240,DIGESTIVE MALIGNANCY,06,DISEASES AND DISORDERS OF THE DIGESTIVE SYSTEM,2,Moderate,Major,Medical,Medicare,Medicare,,,,Y,100435.74,17854.54
Long Island,Suffolk,5123000,000885,Long Island Community Hospital,70 or Older,117,M,Other Race,Not Span/Hispanic,5,Emergency,Home or Self Care,2020,NEO015,GASTROINTESTINAL CANCERS - COLORECTAL,,,240,DIGESTIVE MALIGNANCY,06,DISEASES AND DISORDERS OF THE DIGESTIVE SYSTEM,2,Moderate,Moderate,Medical,Medicare,,,,,Y,43624.45,7339.2
Long Island,Suffolk,5123000,000885,Long Island Community Hospital,70 or Older,117,M,Other Race,Not Span/Hispanic,4,Emergency,Hospice - Home,2020,NEO013,GASTROINTESTINAL CANCERS - STOMACH,,,240,DIGESTIVE MALIGNANCY,06,DISEASES AND DISORDERS OF THE DIGESTIVE SYSTEM,2,Moderate,Major,Medical,Medicare,Medicare,Private Health Insurance,,,Y,51943.37,8498.62
Long Island,Suffolk,5123000,000885,Long Island Community Hospital,70 or Older,117,F,Black/African American,Not Span/Hispanic,6,Emergency,Expired,2020,NEO015,GASTROINTESTINAL CANCERS - COLORECTAL,ADM001,TRANSFUSION OF BLOOD AND BLOOD PRODUCTS,240,DIGESTIVE MALIGNANCY,06,DISEASES AND DISORDERS OF THE DIGESTIVE SYSTEM,4,Extreme,Extreme,Medical,Medicare,,,,,Y,105423.39,14370.09
Long Island,Suffolk,5123000,000885,Long Island Community Hospital,70 or Older,117,M,White,Not Span/Hispanic,2,Emergency,Home or Self Care,2020,NEO015,GASTROINTESTINAL CANCERS - COLORECTAL,GIS002,COLONOSCOPY AND PROCTOSCOPY WITH BIOPSY,240,DIGESTIVE MALIGNANCY,06,DISEASES AND DISORDERS OF THE DIGESTIVE SYSTEM,2,Moderate,Minor,Medical,Medicare,Medicare,Private Health Insurance,,,Y,47869.66,7105
Long Island,Suffolk,5123000,000885,Long Island Community Hospital,50 to 69,119,M,White,Not Span/Hispanic,8,Emergency,Home or Self Care,2020,NEO012,GASTROINTESTINAL CANCERS - ESOPHAGUS,,,240,DIGESTIVE MALIGNANCY,06,DISEASES AND DISORDERS OF THE DIGESTIVE SYSTEM,3,Major,Moderate,Medical,Medicare,Medicare,,,,Y,81942.93,13533.89
Long Island,Suffolk,5123000,000885,Long Island Community Hospital,70 or Older,117,M,Other Race,Not Span/Hispanic,19,Emergency,Skilled Nursing Home,2020,NEO015,GASTROINTESTINAL CANCERS - COLORECTAL,GIS001,ESOPHAGOGASTRODUODENOSCOPY (EGD) WITH BIOPSY,240,DIGESTIVE MALIGNANCY,06,DISEASES AND DISORDERS OF THE DIGESTIVE SYSTEM,3,Major,Moderate,Medical,Medicare,,,,,Y,159727.81,33109.44
Long Island,Suffolk,5123000,000885,Long Island Community Hospital,70 or Older,117,M,White,Not Span/Hispanic,3,Emergency,Expired,2020,NEO015,GASTROINTESTINAL CANCERS - COLORECTAL,ADM006,INFUSION OF VASOPRESSOR,240,DIGESTIVE MALIGNANCY,06,DISEASES AND DISORDERS OF THE DIGESTIVE SYSTEM,4,Extreme,Extreme,Medical,Medicare,Medicare,Medicaid,,,Y,49179.5,6548.82
Long Island,Suffolk,5123000,000885,Long Island Community Hospital,70 or Older,117,M,White,Not Span/Hispanic,1,Emergency,Expired,2020,NEO015,GASTROINTESTINAL CANCERS - COLORECTAL,GIS007,GI SYSTEM DRAINAGE (EXCLUDING PARACENTESIS),240,DIGESTIVE MALIGNANCY,06,DISEASES AND DISORDERS OF THE DIGESTIVE SYSTEM,3,Major,Major,Medical,Medicare,Medicare,Blue Cross/Blue Shield,,,Y,20805.27,2334.05
Long Island,Suffolk,5123000,000885,Long Island Community Hospital,70 or Older,117,M,White,Not Span/Hispanic,2,Emergency,Expired,2020,NEO070,SECONDARY MALIGNANCIES,,,240,DIGESTIVE MALIGNANCY,06,DISEASES AND DISORDERS OF THE DIGESTIVE SYSTEM,2,Moderate,Major,Medical,Medicare,Medicare,Private Health Insurance,,,Y,14497.71,3119.29
Long Island,Suffolk,5123000,000885,Long Island Community Hospital,50 to 69,117,M,White,Not Span/Hispanic,9,Emergency,Short-term Hospital,2020,NEO015,GASTROINTESTINAL CANCERS - COLORECTAL,URN001,CYSTOSCOPY AND URETEROSCOPY (INCLUDING BIOPSY),240,DIGESTIVE MALIGNANCY,06,DISEASES AND DISORDERS OF THE DIGESTIVE SYSTEM,3,Major,Major,Medical,Medicare,Medicare,Private Health Insurance,,,Y,101583.39,20830.07
Long Island,Suffolk,5123000,000885,Long Island Community Hospital,50 to 69,117,M,White,Not Span/Hispanic,6,Emergency,Home or Self Care,2020,NEO013,GASTROINTESTINAL CANCERS - STOMACH,GIS001,ESOPHAGOGASTRODUODENOSCOPY (EGD) WITH BIOPSY,240,DIGESTIVE MALIGNANCY,06,DISEASES AND DISORDERS OF THE DIGESTIVE SYSTEM,2,Moderate,Moderate,Medical,Medicare,,,,,Y,61339.93,11572.41
Long Island,Suffolk,5123000,000885,Long Island Community Hospital,50 to 69,119,F,White,Not Span/Hispanic,4,Emergency,Home w/ Home Health Services,2020,NEO012,GASTROINTESTINAL CANCERS - ESOPHAGUS,GIS001,ESOPHAGOGASTRODUODENOSCOPY (EGD) WITH BIOPSY,240,DIGESTIVE MALIGNANCY,06,DISEASES AND DISORDERS OF THE DIGESTIVE SYSTEM,2,Moderate,Minor,Medical,Medicare,Medicare,Medicaid,,,Y,66001.22,11474.81
Long Island,Suffolk,5123000,000885,Long Island Community Hospital,70 or Older,117,M,Black/African American,Not Span/Hispanic,5,Emergency,Skilled Nursing Home,2020,NEO014,GASTROINTESTINAL CANCERS - SMALL INTESTINE,GIS001,ESOPHAGOGASTRODUODENOSCOPY (EGD) WITH BIOPSY,240,DIGESTIVE MALIGNANCY,06,DISEASES AND DISORDERS OF THE DIGESTIVE SYSTEM,3,Major,Major,Medical,Medicare,,,,,Y,70841.44,13150.18
Long Island,Suffolk,5123000,000885,Long Island Community Hospital,70 or Older,117,M,White,Not Span/Hispanic,10,Emergency,Home or Self Care,2020,NEO070,SECONDARY MALIGNANCIES,OTR004,ISOLATION PROCEDURES,240,DIGESTIVE MALIGNANCY,06,DISEASES AND DISORDERS OF THE DIGESTIVE SYSTEM,3,Major,Moderate,Medical,Medicare,,,,,Y,114872.48,22224.47
Long Island,Suffolk,5123000,000885,Long Island Community Hospital,70 or Older,117,F,White,Not Span/Hispanic,49,Emergency,Expired,2020,NEO015,GASTROINTESTINAL CANCERS - COLORECTAL,GIS003,GI SYSTEM BIOPSY (NON-ENDOSCOPIC),240,DIGESTIVE MALIGNANCY,06,DISEASES AND DISORDERS OF THE DIGESTIVE SYSTEM,3,Major,Major,Medical,Medicare,Medicare,Medicaid,,,Y,295554.98,65818.76
