Hospital Service Area,Hospital County,Operating Certificate Number,Permanent Facility Id,Facility Name,Age Group,Zip Code - 3 digits,Gender,Race,Ethnicity,Length of Stay,Type of Admission,Patient Disposition,Discharge Year,CCS Diagnosis Code,CCS Diagnosis Description,CCS Procedure Code,CCS Procedure Description,APR DRG Code,APR DRG Description,APR MDC Code,APR MDC Description,APR Severity of Illness Code,APR Severity of Illness Description,APR Risk of Mortality,APR Medical Surgical Description,Payment Typology 1,Payment Typology 2,Payment Typology 3,Birth Weight,Abortion Edit Indicator,Emergency Department Indicator,Total Charges,Total Costs
New York City,Manhattan,7002053,001463,NYU Langone Hospitals,30 to 49,112,F,Other Race,Not Span/Hispanic,1,Emergency,Home or Self Care,2019,DIG005,GASTRODUODENAL ULCER,GIS004,GI SYSTEM ENDOSCOPY WITHOUT BIOPSY (DIAGNOSTIC),241,PEPTIC ULCER & GASTRITIS,06,DISEASES AND DISORDERS OF THE DIGESTIVE SYSTEM,4,Extreme,Moderate,Medical,Medicaid,,,,,false,39420.31,8051.59
New York City,Manhattan,7002053,001463,NYU Langone Hospitals,70 or Older,100,M,White,Unknown,9,Emergency,Home w/ Home Health Services,2019,DIG021,GASTROINTESTINAL HEMORRHAGE,GIS027,"UPPER GI THERAPEUTIC PROCEDURES, NEC (ENDOSCOPIC)",241,PEPTIC ULCER & GASTRITIS,06,DISEASES AND DISORDERS OF THE DIGESTIVE SYSTEM,3,Major,Major,Medical,Medicare,Private Health Insurance,Blue Cross/Blue Shield,,,true,156450.41,44458.05
New York City,Manhattan,7002053,001463,NYU Langone Hospitals,50 to 69,112,M,White,Not Span/Hispanic,5,Emergency,Home or Self Care,2019,DIG021,GASTROINTESTINAL HEMORRHAGE,GNR004,ENDOSCOPIC CONTROL OF BLEEDING,241,PEPTIC ULCER & GASTRITIS,06,DISEASES AND DISORDERS OF THE DIGESTIVE SYSTEM,3,Major,Minor,Medical,Medicaid,,,,,true,245396.09,46986.31
New York City,Manhattan,7002053,001463,NYU Langone Hospitals,50 to 69,112,M,White,Not Span/Hispanic,1,Emergency,Home or Self Care,2019,DIG007,GASTRITIS AND DUODENITIS,,,241,PEPTIC ULCER & GASTRITIS,06,DISEASES AND DISORDERS OF THE DIGESTIVE SYSTEM,1,Minor,Minor,Medical,Private Health Insurance,,,,,true,23957.57,5695.09
New York City,Manhattan,7002053,001463,NYU Langone Hospitals,50 to 69,103,M,White,Not Span/Hispanic,3,Emergency,Home or Self Care,2019,DIG005,GASTRODUODENAL ULCER,,,241,PEPTIC ULCER & GASTRITIS,06,DISEASES AND DISORDERS OF THE DIGESTIVE SYSTEM,2,Moderate,Minor,Medical,Blue Cross/Blue Shield,,,,,true,39021.21,12588.22
New York City,Manhattan,7002053,001463,NYU Langone Hospitals,70 or Older,100,M,White,Not Span/Hispanic,9,Emergency,Home or Self Care,2019,DIG021,GASTROINTESTINAL HEMORRHAGE,GNR004,ENDOSCOPIC CONTROL OF BLEEDING,241,PEPTIC ULCER & GASTRITIS,06,DISEASES AND DISORDERS OF THE DIGESTIVE SYSTEM,4,Extreme,Extreme,Medical,Medicare,Blue Cross/Blue Shield,,,,true,192071.98,58879.32
New York City,Manhattan,7002053,001463,NYU Langone Hospitals,70 or Older,100,M,White,Not Span/Hispanic,2,Emergency,Home or Self Care,2019,DIG021,GASTROINTESTINAL HEMORRHAGE,GIS027,"UPPER GI THERAPEUTIC PROCEDURES, NEC (ENDOSCOPIC)",241,PEPTIC ULCER & GASTRITIS,06,DISEASES AND DISORDERS OF THE DIGESTIVE SYSTEM,3,Major,Major,Medical,Medicare,Blue Cross/Blue Shield,,,,true,103067.83,25765.28
New York City,Manhattan,7002053,001463,NYU Langone Hospitals,70 or Older,100,F,White,Not Span/Hispanic,3,Emergency,Home w/ Home Health Services,2019,DIG021,GASTROINTESTINAL HEMORRHAGE,GIS001,ESOPHAGOGASTRODUODENOSCOPY (EGD) WITH BIOPSY,241,PEPTIC ULCER & GASTRITIS,06,DISEASES AND DISORDERS OF THE DIGESTIVE SYSTEM,2,Moderate,Moderate,Medical,Medicare,Blue Cross/Blue Shield,,,,true,51532.15,14197.78
New York City,Manhattan,7002053,001463,NYU Langone Hospitals,70 or Older,100,M,White,Not Span/Hispanic,2,Emergency,Home w/ Home Health Services,2019,DIG021,GASTROINTESTINAL HEMORRHAGE,GIS001,ESOPHAGOGASTRODUODENOSCOPY (EGD) WITH BIOPSY,241,PEPTIC ULCER & GASTRITIS,06,DISEASES AND DISORDERS OF THE DIGESTIVE SYSTEM,2,Moderate,Moderate,Medical,Medicare,Private Health Insurance,,,,true,56163.09,15494.77
New York City,Manhattan,7002053,001463,NYU Langone Hospitals,30 to 49,100,M,White,Not Span/Hispanic,2,Emergency,Home or Self Care,2019,DIG021,GASTROINTESTINAL HEMORRHAGE,,,241,PEPTIC ULCER & GASTRITIS,06,DISEASES AND DISORDERS OF THE DIGESTIVE SYSTEM,3,Major,Minor,Medical,Private Health Insurance,,,,,true,49654.24,10082.78
New York City,Manhattan,7002053,001463,NYU Langone Hospitals,18 to 29,100,M,Other Race,Not Span/Hispanic,1,Emergency,Home or Self Care,2019,DIG007,GASTRITIS AND DUODENITIS,,,241,PEPTIC ULCER & GASTRITIS,06,DISEASES AND DISORDERS OF THE DIGESTIVE SYSTEM,1,Minor,Minor,Medical,Private Health Insurance,,,,,true,22454.82,7665.54
New York City,Manhattan,7002053,001463,NYU Langone Hospitals,70 or Older,100,F,White,Not Span/Hispanic,3,Emergency,Skilled Nursing Home,2019,DIG021,GASTROINTESTINAL HEMORRHAGE,GIS004,GI SYSTEM ENDOSCOPY WITHOUT BIOPSY (DIAGNOSTIC),241,PEPTIC ULCER & GASTRITIS,06,DISEASES AND DISORDERS OF THE DIGESTIVE SYSTEM,2,Moderate,Major,Medical,Medicare,Private Health Insurance,,,,true,53367.6,14553.93
New York City,Manhattan,7002053,001463,NYU Langone Hospitals,50 to 69,112,M,White,Not Span/Hispanic,1,Emergency,Home or Self Care,2019,DIG021,GASTROINTESTINAL HEMORRHAGE,GIS004,GI SYSTEM ENDOSCOPY WITHOUT BIOPSY (DIAGNOSTIC),241,PEPTIC ULCER & GASTRITIS,06,DISEASES AND DISORDERS OF THE DIGESTIVE SYSTEM,2,Moderate,Minor,Medical,Medicare,Medicaid,,,,true,33367.6,7237.79
New York City,Manhattan,7002053,001463,NYU Langone Hospitals,50 to 69,112,F,Black/African American,Unknown,5,Emergency,Home w/ Home Health Services,2019,DIG007,GASTRITIS AND DUODENITIS,,,241,PEPTIC ULCER & GASTRITIS,06,DISEASES AND DISORDERS OF THE DIGESTIVE SYSTEM,2,Moderate,Minor,Medical,Medicaid,,,,,true,68712.67,29136.7
New York City,Manhattan,7002053,001463,NYU Langone Hospitals,18 to 29,112,F,Other Race,Not Span/Hispanic,6,Emergency,Home or Self Care,2019,DIG007,GASTRITIS AND DUODENITIS,GIS001,ESOPHAGOGASTRODUODENOSCOPY (EGD) WITH BIOPSY,241,PEPTIC ULCER & GASTRITIS,06,DISEASES AND DISORDERS OF THE DIGESTIVE SYSTEM,1,Minor,Minor,Medical,Private Health Insurance,,,,,true,86044.58,25629.53
New York City,Manhattan,7002053,001463,NYU Langone Hospitals,50 to 69,116,F,White,Not Span/Hispanic,1,Emergency,Home or Self Care,2019,DIG007,GASTRITIS AND DUODENITIS,,,241,PEPTIC ULCER & GASTRITIS,06,DISEASES AND DISORDERS OF THE DIGESTIVE SYSTEM,2,Moderate,Minor,Medical,Medicare,Private Health Insurance,,,,true,44595.11,13907.53
New York City,Manhattan,7002053,001463,NYU Langone Hospitals,70 or Older,104,F,Other Race,Spanish/Hispanic,10,Urgent,Skilled Nursing Home,2019,DIG021,GASTROINTESTINAL HEMORRHAGE,GIS001,ESOPHAGOGASTRODUODENOSCOPY (EGD) WITH BIOPSY,241,PEPTIC ULCER & GASTRITIS,06,DISEASES AND DISORDERS OF THE DIGESTIVE SYSTEM,4,Extreme,Major,Medical,Medicare,Medicaid,,,,false,116746.55,38041.14
New York City,Manhattan,7002053,001463,NYU Langone Hospitals,70 or Older,100,M,White,Not Span/Hispanic,5,Emergency,Home or Self Care,2019,DIG021,GASTROINTESTINAL HEMORRHAGE,CAR028,INFERIOR VENA CAVA (IVC) FILTER PROCEDURES,241,PEPTIC ULCER & GASTRITIS,06,DISEASES AND DISORDERS OF THE DIGESTIVE SYSTEM,3,Major,Major,Medical,Medicare,Blue Cross/Blue Shield,,,,true,148629.63,39059.37
New York City,Manhattan,7002053,001463,NYU Langone Hospitals,70 or Older,100,F,Other Race,Not Span/Hispanic,1,Emergency,Home or Self Care,2019,DIG021,GASTROINTESTINAL HEMORRHAGE,GIS004,GI SYSTEM ENDOSCOPY WITHOUT BIOPSY (DIAGNOSTIC),241,PEPTIC ULCER & GASTRITIS,06,DISEASES AND DISORDERS OF THE DIGESTIVE SYSTEM,2,Moderate,Moderate,Medical,Medicare,Medicare,,,,true,34571.45,7311.42
New York City,Manhattan,7002053,001463,NYU Langone Hospitals,50 to 69,120,F,White,Not Span/Hispanic,1,Emergency,Home or Self Care,2019,DIG007,GASTRITIS AND DUODENITIS,,,241,PEPTIC ULCER & GASTRITIS,06,DISEASES AND DISORDERS OF THE DIGESTIVE SYSTEM,1,Minor,Minor,Medical,Medicare,Medicare,,,,true,20499.26,5292.48
New York City,Manhattan,7002053,001463,NYU Langone Hospitals,50 to 69,100,M,Other Race,Spanish/Hispanic,2,Emergency,Home or Self Care,2019,DIG021,GASTROINTESTINAL HEMORRHAGE,GIS004,GI SYSTEM ENDOSCOPY WITHOUT BIOPSY (DIAGNOSTIC),241,PEPTIC ULCER & GASTRITIS,06,DISEASES AND DISORDERS OF THE DIGESTIVE SYSTEM,1,Minor,Minor,Medical,Blue Cross/Blue Shield,,,,,true,37148.9,9970.41
New York City,Manhattan,7002053,001463,NYU Langone Hospitals,50 to 69,100,F,Other Race,Unknown,3,Emergency,Home or Self Care,2019,DIG021,GASTROINTESTINAL HEMORRHAGE,GNR004,ENDOSCOPIC CONTROL OF BLEEDING,241,PEPTIC ULCER & GASTRITIS,06,DISEASES AND DISORDERS OF THE DIGESTIVE SYSTEM,2,Moderate,Minor,Medical,Medicaid,,,,,true,59388.41,15145.26
New York City,Manhattan,7002053,001463,NYU Langone Hospitals,50 to 69,OOS,M,White,Not Span/Hispanic,9,Emergency,Home or Self Care,2019,DIG021,GASTROINTESTINAL HEMORRHAGE,GNR004,ENDOSCOPIC CONTROL OF BLEEDING,241,PEPTIC ULCER & GASTRITIS,06,DISEASES AND DISORDERS OF THE DIGESTIVE SYSTEM,3,Major,Moderate,Medical,Medicare,Private Health Insurance,,,,true,148705.45,42028.09
New York City,Manhattan,7002053,001463,NYU Langone Hospitals,70 or Older,,F,White,Not Span/Hispanic,2,Emergency,Home or Self Care,2019,DIG021,GASTROINTESTINAL HEMORRHAGE,GIS001,ESOPHAGOGASTRODUODENOSCOPY (EGD) WITH BIOPSY,241,PEPTIC ULCER & GASTRITIS,06,DISEASES AND DISORDERS OF THE DIGESTIVE SYSTEM,2,Moderate,Minor,Medical,Blue Cross/Blue Shield,Medicare,,,,true,59649.86,13252.66
New York City,Manhattan,7002053,001463,NYU Langone Hospitals,70 or Older,100,M,White,Not Span/Hispanic,3,Emergency,Home w/ Home Health Services,2019,DIG007,GASTRITIS AND DUODENITIS,GIS004,GI SYSTEM ENDOSCOPY WITHOUT BIOPSY (DIAGNOSTIC),241,PEPTIC ULCER & GASTRITIS,06,DISEASES AND DISORDERS OF THE DIGESTIVE SYSTEM,3,Major,Moderate,Medical,Medicare,Blue Cross/Blue Shield,,,,true,72831.99,17400.49
New York City,Manhattan,7002053,001463,NYU Langone Hospitals,70 or Older,108,F,White,Not Span/Hispanic,3,Emergency,Home or Self Care,2019,DIG021,GASTROINTESTINAL HEMORRHAGE,GNR004,ENDOSCOPIC CONTROL OF BLEEDING,241,PEPTIC ULCER & GASTRITIS,06,DISEASES AND DISORDERS OF THE DIGESTIVE SYSTEM,2,Moderate,Moderate,Medical,Medicare,Blue Cross/Blue Shield,,,,true,61376.72,16115.68
New York City,Manhattan,7002053,001463,NYU Langone Hospitals,70 or Older,100,M,White,Not Span/Hispanic,3,Emergency,Home or Self Care,2019,DIG021,GASTROINTESTINAL HEMORRHAGE,ADM001,TRANSFUSION OF BLOOD AND BLOOD PRODUCTS,241,PEPTIC ULCER & GASTRITIS,06,DISEASES AND DISORDERS OF THE DIGESTIVE SYSTEM,3,Major,Moderate,Medical,Blue Cross/Blue Shield,Medicare,,,,true,57147.96,15046.82
New York City,Manhattan,7002053,001463,NYU Langone Hospitals,70 or Older,112,F,White,Not Span/Hispanic,3,Emergency,Home w/ Home Health Services,2019,DIG021,GASTROINTESTINAL HEMORRHAGE,ADM001,TRANSFUSION OF BLOOD AND BLOOD PRODUCTS,241,PEPTIC ULCER & GASTRITIS,06,DISEASES AND DISORDERS OF THE DIGESTIVE SYSTEM,3,Major,Major,Medical,Medicare,Blue Cross/Blue Shield,Medicaid,,,true,66691.29,16610.32
New York City,Manhattan,7002053,001463,NYU Langone Hospitals,70 or Older,100,M,White,Not Span/Hispanic,6,Emergency,Home or Self Care,2019,DIG005,GASTRODUODENAL ULCER,GNR004,ENDOSCOPIC CONTROL OF BLEEDING,241,PEPTIC ULCER & GASTRITIS,06,DISEASES AND DISORDERS OF THE DIGESTIVE SYSTEM,3,Major,Moderate,Medical,Medicare,Medicare,,,,true,74175.2,24759
New York City,Manhattan,7002053,001463,NYU Langone Hospitals,50 to 69,100,M,White,Not Span/Hispanic,3,Emergency,Home or Self Care,2019,DIG021,GASTROINTESTINAL HEMORRHAGE,GNR004,ENDOSCOPIC CONTROL OF BLEEDING,241,PEPTIC ULCER & GASTRITIS,06,DISEASES AND DISORDERS OF THE DIGESTIVE SYSTEM,3,Major,Minor,Medical,Private Health Insurance,,,,,true,65539.3,18140.42
New York City,Manhattan,7002053,001463,NYU Langone Hospitals,30 to 49,100,F,White,Spanish/Hispanic,1,Emergency,Home or Self Care,2019,DIG007,GASTRITIS AND DUODENITIS,,,241,PEPTIC ULCER & GASTRITIS,06,DISEASES AND DISORDERS OF THE DIGESTIVE SYSTEM,2,Moderate,Moderate,Medical,Blue Cross/Blue Shield,,,,,true,21551.71,5663.47
New York City,Manhattan,7002053,001463,NYU Langone Hospitals,70 or Older,100,F,White,Not Span/Hispanic,3,Emergency,Home w/ Home Health Services,2019,DIG007,GASTRITIS AND DUODENITIS,,,241,PEPTIC ULCER & GASTRITIS,06,DISEASES AND DISORDERS OF THE DIGESTIVE SYSTEM,3,Major,Major,Medical,Medicare,Medicare,,,,true,49768.15,13071.8
New York City,Manhattan,7002053,001463,NYU Langone Hospitals,30 to 49,100,M,White,Unknown,1,Emergency,Home or Self Care,2019,DIG007,GASTRITIS AND DUODENITIS,GIS001,ESOPHAGOGASTRODUODENOSCOPY (EGD) WITH BIOPSY,241,PEPTIC ULCER & GASTRITIS,06,DISEASES AND DISORDERS OF THE DIGESTIVE SYSTEM,1,Minor,Minor,Medical,Private Health Insurance,,,,,true,46575.17,8605.06
New York City,Manhattan,7002053,001463,NYU Langone Hospitals,50 to 69,112,F,Black/African American,Not Span/Hispanic,8,Emergency,Home or Self Care,2019,DIG021,GASTROINTESTINAL HEMORRHAGE,GIS004,GI SYSTEM ENDOSCOPY WITHOUT BIOPSY (DIAGNOSTIC),241,PEPTIC ULCER & GASTRITIS,06,DISEASES AND DISORDERS OF THE DIGESTIVE SYSTEM,3,Major,Moderate,Medical,Self-Pay,,,,,true,126200.38,34704.31
New York City,Manhattan,7002053,001463,NYU Langone Hospitals,50 to 69,105,F,White,Not Span/Hispanic,1,Emergency,Skilled Nursing Home,2019,DIG021,GASTROINTESTINAL HEMORRHAGE,GIS001,ESOPHAGOGASTRODUODENOSCOPY (EGD) WITH BIOPSY,241,PEPTIC ULCER & GASTRITIS,06,DISEASES AND DISORDERS OF THE DIGESTIVE SYSTEM,1,Minor,Minor,Medical,Medicare,Blue Cross/Blue Shield,,,,true,40666.95,8346.52
New York City,Manhattan,7002053,001463,NYU Langone Hospitals,50 to 69,100,M,Other Race,Not Span/Hispanic,3,Emergency,Home or Self Care,2019,DIG021,GASTROINTESTINAL HEMORRHAGE,GNR004,ENDOSCOPIC CONTROL OF BLEEDING,241,PEPTIC ULCER & GASTRITIS,06,DISEASES AND DISORDERS OF THE DIGESTIVE SYSTEM,2,Moderate,Minor,Medical,Blue Cross/Blue Shield,,,,,true,60256.41,15437.21
New York City,Manhattan,7002053,001463,NYU Langone Hospitals,70 or Older,112,M,White,Not Span/Hispanic,2,Emergency,Home w/ Home Health Services,2019,DIG007,GASTRITIS AND DUODENITIS,GIS001,ESOPHAGOGASTRODUODENOSCOPY (EGD) WITH BIOPSY,241,PEPTIC ULCER & GASTRITIS,06,DISEASES AND DISORDERS OF THE DIGESTIVE SYSTEM,3,Major,Major,Medical,Medicare,Medicaid,,,,true,71540.27,15022.4
New York City,Manhattan,7002053,001463,NYU Langone Hospitals,50 to 69,100,M,Other Race,Not Span/Hispanic,1,Emergency,Home or Self Care,2019,DIG021,GASTROINTESTINAL HEMORRHAGE,GIS001,ESOPHAGOGASTRODUODENOSCOPY (EGD) WITH BIOPSY,241,PEPTIC ULCER & GASTRITIS,06,DISEASES AND DISORDERS OF THE DIGESTIVE SYSTEM,1,Minor,Minor,Medical,Medicare,,,,,true,39264.5,8032.18
New York City,Manhattan,7002053,001463,NYU Langone Hospitals,70 or Older,OOS,M,Other Race,Not Span/Hispanic,2,Emergency,Home or Self Care,2019,DIG021,GASTROINTESTINAL HEMORRHAGE,GIS001,ESOPHAGOGASTRODUODENOSCOPY (EGD) WITH BIOPSY,241,PEPTIC ULCER & GASTRITIS,06,DISEASES AND DISORDERS OF THE DIGESTIVE SYSTEM,2,Moderate,Moderate,Medical,Medicare,Medicare,,,,true,45349.64,10411.97
New York City,Manhattan,7002053,001463,NYU Langone Hospitals,70 or Older,100,M,White,Not Span/Hispanic,3,Emergency,Home or Self Care,2019,DIG021,GASTROINTESTINAL HEMORRHAGE,GNR004,ENDOSCOPIC CONTROL OF BLEEDING,241,PEPTIC ULCER & GASTRITIS,06,DISEASES AND DISORDERS OF THE DIGESTIVE SYSTEM,3,Major,Major,Medical,Medicare,Blue Cross/Blue Shield,,,,true,136563.42,23045.11
New York City,Manhattan,7002053,001463,NYU Langone Hospitals,30 to 49,100,F,Black/African American,Not Span/Hispanic,2,Emergency,Home or Self Care,2019,DIG005,GASTRODUODENAL ULCER,GIS001,ESOPHAGOGASTRODUODENOSCOPY (EGD) WITH BIOPSY,241,PEPTIC ULCER & GASTRITIS,06,DISEASES AND DISORDERS OF THE DIGESTIVE SYSTEM,3,Major,Moderate,Medical,Medicaid,,,,,true,59705.26,12013.57
New York City,Manhattan,7002053,001463,NYU Langone Hospitals,70 or Older,100,F,Black/African American,Not Span/Hispanic,1,Emergency,Home w/ Home Health Services,2019,DIG021,GASTROINTESTINAL HEMORRHAGE,ADM001,TRANSFUSION OF BLOOD AND BLOOD PRODUCTS,241,PEPTIC ULCER & GASTRITIS,06,DISEASES AND DISORDERS OF THE DIGESTIVE SYSTEM,2,Moderate,Moderate,Medical,Medicare,Blue Cross/Blue Shield,,,,true,47515.37,9395.45
New York City,Manhattan,7002053,001463,NYU Langone Hospitals,70 or Older,112,M,White,Not Span/Hispanic,2,Emergency,Home or Self Care,2019,DIG021,GASTROINTESTINAL HEMORRHAGE,GIS001,ESOPHAGOGASTRODUODENOSCOPY (EGD) WITH BIOPSY,241,PEPTIC ULCER & GASTRITIS,06,DISEASES AND DISORDERS OF THE DIGESTIVE SYSTEM,3,Major,Major,Medical,Medicare,Private Health Insurance,,,,true,65735.64,13736.16
New York City,Manhattan,7002053,001463,NYU Langone Hospitals,30 to 49,OOS,M,White,Not Span/Hispanic,3,Emergency,Home w/ Home Health Services,2019,DIG021,GASTROINTESTINAL HEMORRHAGE,GNR004,ENDOSCOPIC CONTROL OF BLEEDING,241,PEPTIC ULCER & GASTRITIS,06,DISEASES AND DISORDERS OF THE DIGESTIVE SYSTEM,4,Extreme,Extreme,Medical,Medicare,Medicaid,,,,true,96214.23,26493.84
New York City,Manhattan,7002053,001463,NYU Langone Hospitals,30 to 49,114,F,Black/African American,Not Span/Hispanic,1,Emergency,Home or Self Care,2019,DIG005,GASTRODUODENAL ULCER,,,241,PEPTIC ULCER & GASTRITIS,06,DISEASES AND DISORDERS OF THE DIGESTIVE SYSTEM,2,Moderate,Minor,Medical,Blue Cross/Blue Shield,,,,,true,28794.35,6363.53
New York City,Manhattan,7002053,001463,NYU Langone Hospitals,70 or Older,112,F,White,Not Span/Hispanic,1,Emergency,Home w/ Home Health Services,2019,DIG007,GASTRITIS AND DUODENITIS,ADM021,"ADMINISTRATION OF THERAPEUTIC SUBSTANCES, NEC",241,PEPTIC ULCER & GASTRITIS,06,DISEASES AND DISORDERS OF THE DIGESTIVE SYSTEM,3,Major,Major,Medical,Medicare,,,,,true,24401.18,5722.2
New York City,Manhattan,7002053,001463,NYU Langone Hospitals,70 or Older,100,M,White,Not Span/Hispanic,1,Emergency,Home w/ Home Health Services,2019,DIG021,GASTROINTESTINAL HEMORRHAGE,GIS001,ESOPHAGOGASTRODUODENOSCOPY (EGD) WITH BIOPSY,241,PEPTIC ULCER & GASTRITIS,06,DISEASES AND DISORDERS OF THE DIGESTIVE SYSTEM,3,Major,Major,Medical,Medicare,Medicaid,,,,true,35966.3,7435.32
New York City,Manhattan,7002053,001463,NYU Langone Hospitals,70 or Older,112,M,White,Not Span/Hispanic,3,Emergency,Home or Self Care,2019,DIG021,GASTROINTESTINAL HEMORRHAGE,GIS004,GI SYSTEM ENDOSCOPY WITHOUT BIOPSY (DIAGNOSTIC),241,PEPTIC ULCER & GASTRITIS,06,DISEASES AND DISORDERS OF THE DIGESTIVE SYSTEM,2,Moderate,Minor,Medical,Private Health Insurance,Medicare,,,,true,76714.13,18280.12
New York City,Manhattan,7002053,001463,NYU Langone Hospitals,50 to 69,112,F,Other Race,Not Span/Hispanic,5,Emergency,Skilled Nursing Home,2019,DIG021,GASTROINTESTINAL HEMORRHAGE,GNR004,ENDOSCOPIC CONTROL OF BLEEDING,241,PEPTIC ULCER & GASTRITIS,06,DISEASES AND DISORDERS OF THE DIGESTIVE SYSTEM,3,Major,Minor,Medical,Medicare,,,,,true,83265.39,22796.09
New York City,Manhattan,7002053,001463,NYU Langone Hospitals,70 or Older,103,F,White,Not Span/Hispanic,11,Emergency,Home w/ Home Health Services,2019,DIG021,GASTROINTESTINAL HEMORRHAGE,GIS004,GI SYSTEM ENDOSCOPY WITHOUT BIOPSY (DIAGNOSTIC),241,PEPTIC ULCER & GASTRITIS,06,DISEASES AND DISORDERS OF THE DIGESTIVE SYSTEM,3,Major,Major,Medical,Medicare,Private Health Insurance,,,,true,130168.99,41753.42
New York City,Manhattan,7002053,001463,NYU Langone Hospitals,70 or Older,100,M,White,Not Span/Hispanic,4,Emergency,Home w/ Home Health Services,2019,DIG021,GASTROINTESTINAL HEMORRHAGE,GIS001,ESOPHAGOGASTRODUODENOSCOPY (EGD) WITH BIOPSY,241,PEPTIC ULCER & GASTRITIS,06,DISEASES AND DISORDERS OF THE DIGESTIVE SYSTEM,3,Major,Major,Medical,Medicare,Blue Cross/Blue Shield,,,,true,84236.49,21111.73
New York City,Manhattan,7002053,001463,NYU Langone Hospitals,50 to 69,100,M,Other Race,Not Span/Hispanic,1,Emergency,Home or Self Care,2019,DIG007,GASTRITIS AND DUODENITIS,,,241,PEPTIC ULCER & GASTRITIS,06,DISEASES AND DISORDERS OF THE DIGESTIVE SYSTEM,3,Major,Major,Medical,Private Health Insurance,,,,,true,23643.53,5864.3
New York City,Manhattan,7002053,001463,NYU Langone Hospitals,50 to 69,OOS,F,Other Race,Not Span/Hispanic,2,Emergency,Home or Self Care,2019,DIG021,GASTROINTESTINAL HEMORRHAGE,GNR004,ENDOSCOPIC CONTROL OF BLEEDING,241,PEPTIC ULCER & GASTRITIS,06,DISEASES AND DISORDERS OF THE DIGESTIVE SYSTEM,3,Major,Moderate,Medical,Blue Cross/Blue Shield,,,,,true,50529.38,11805.1
New York City,Manhattan,7002053,001463,NYU Langone Hospitals,70 or Older,112,M,White,Not Span/Hispanic,4,Emergency,Home or Self Care,2019,DIG008,OTHER SPECIFIED AND UNSPECIFIED DISORDERS OF STOMACH AND DUODENUM,GNR004,ENDOSCOPIC CONTROL OF BLEEDING,241,PEPTIC ULCER & GASTRITIS,06,DISEASES AND DISORDERS OF THE DIGESTIVE SYSTEM,3,Major,Major,Medical,Medicare,Private Health Insurance,,,,true,68870.37,18544.18
New York City,Manhattan,7002053,001463,NYU Langone Hospitals,70 or Older,103,M,White,Not Span/Hispanic,17,Emergency,Expired,2019,DIG021,GASTROINTESTINAL HEMORRHAGE,ADM021,"ADMINISTRATION OF THERAPEUTIC SUBSTANCES, NEC",241,PEPTIC ULCER & GASTRITIS,06,DISEASES AND DISORDERS OF THE DIGESTIVE SYSTEM,4,Extreme,Extreme,Medical,Medicare,Medicare,,,,true,365790.79,112065.85
New York City,Manhattan,7002053,001463,NYU Langone Hospitals,18 to 29,112,M,Other Race,Not Span/Hispanic,8,Emergency,Home or Self Care,2019,DIG021,GASTROINTESTINAL HEMORRHAGE,GNR004,ENDOSCOPIC CONTROL OF BLEEDING,241,PEPTIC ULCER & GASTRITIS,06,DISEASES AND DISORDERS OF THE DIGESTIVE SYSTEM,3,Major,Moderate,Medical,Private Health Insurance,Medicaid,,,,true,199968.37,46751.9
New York City,Manhattan,7002053,001463,NYU Langone Hospitals,50 to 69,115,F,White,Not Span/Hispanic,1,Emergency,Home or Self Care,2019,DIG021,GASTROINTESTINAL HEMORRHAGE,GIS004,GI SYSTEM ENDOSCOPY WITHOUT BIOPSY (DIAGNOSTIC),241,PEPTIC ULCER & GASTRITIS,06,DISEASES AND DISORDERS OF THE DIGESTIVE SYSTEM,1,Minor,Minor,Medical,Private Health Insurance,,,,,true,43227.73,10375.19
New York City,Manhattan,7002053,001463,NYU Langone Hospitals,70 or Older,100,M,Other Race,Spanish/Hispanic,1,Emergency,Home w/ Home Health Services,2019,DIG007,GASTRITIS AND DUODENITIS,ESA001,HEMODIALYSIS,241,PEPTIC ULCER & GASTRITIS,06,DISEASES AND DISORDERS OF THE DIGESTIVE SYSTEM,4,Extreme,Major,Medical,Medicare,Medicaid,,,,true,38234.53,8217.22
New York City,Manhattan,7002053,001463,NYU Langone Hospitals,70 or Older,100,F,White,Not Span/Hispanic,14,Emergency,Medicare Cert Long Term Care Hospital,2019,DIG021,GASTROINTESTINAL HEMORRHAGE,GIS001,ESOPHAGOGASTRODUODENOSCOPY (EGD) WITH BIOPSY,241,PEPTIC ULCER & GASTRITIS,06,DISEASES AND DISORDERS OF THE DIGESTIVE SYSTEM,2,Moderate,Moderate,Medical,Medicare,Blue Cross/Blue Shield,,,,true,199100.73,65991
New York City,Manhattan,7002053,001463,NYU Langone Hospitals,50 to 69,110,M,Other Race,Not Span/Hispanic,2,Emergency,Home or Self Care,2019,DIG021,GASTROINTESTINAL HEMORRHAGE,GNR004,ENDOSCOPIC CONTROL OF BLEEDING,241,PEPTIC ULCER & GASTRITIS,06,DISEASES AND DISORDERS OF THE DIGESTIVE SYSTEM,2,Moderate,Minor,Medical,Medicaid,,,,,true,52149.36,12243.96
New York City,Manhattan,7002053,001463,NYU Langone Hospitals,50 to 69,109,M,Other Race,Not Span/Hispanic,2,Emergency,Home or Self Care,2019,DIG021,GASTROINTESTINAL HEMORRHAGE,GIS004,GI SYSTEM ENDOSCOPY WITHOUT BIOPSY (DIAGNOSTIC),241,PEPTIC ULCER & GASTRITIS,06,DISEASES AND DISORDERS OF THE DIGESTIVE SYSTEM,1,Minor,Minor,Medical,Private Health Insurance,,,,,true,87521.81,17709.04
New York City,Manhattan,7002053,001463,NYU Langone Hospitals,50 to 69,112,F,White,Not Span/Hispanic,2,Emergency,Home or Self Care,2019,DIG021,GASTROINTESTINAL HEMORRHAGE,GIS001,ESOPHAGOGASTRODUODENOSCOPY (EGD) WITH BIOPSY,241,PEPTIC ULCER & GASTRITIS,06,DISEASES AND DISORDERS OF THE DIGESTIVE SYSTEM,2,Moderate,Minor,Medical,Medicaid,,,,,true,49078.66,11599.18
New York City,Manhattan,7002053,001463,NYU Langone Hospitals,30 to 49,OOS,M,White,Not Span/Hispanic,1,Emergency,Home or Self Care,2019,DIG021,GASTROINTESTINAL HEMORRHAGE,GIS004,GI SYSTEM ENDOSCOPY WITHOUT BIOPSY (DIAGNOSTIC),241,PEPTIC ULCER & GASTRITIS,06,DISEASES AND DISORDERS OF THE DIGESTIVE SYSTEM,1,Minor,Minor,Medical,Blue Cross/Blue Shield,,,,,true,38218.97,7911.94