Hospital Service Area,Hospital County,Operating Certificate Number,Permanent Facility Id,Facility Name,Age Group,Zip Code - 3 digits,Gender,Race,Ethnicity,Length of Stay,Type of Admission,Patient Disposition,Discharge Year,CCS Diagnosis Code,CCS Diagnosis Description,CCS Procedure Code,CCS Procedure Description,APR DRG Code,APR DRG Description,APR MDC Code,APR MDC Description,APR Severity of Illness Code,APR Severity of Illness Description,APR Risk of Mortality,APR Medical Surgical Description,Payment Typology 1,Payment Typology 2,Payment Typology 3,Birth Weight,Abortion Edit Indicator,Emergency Department Indicator,Total Charges,Total Costs
New York City,Manhattan,7002053,001463,NYU Langone Hospitals,70 or Older,112,F,White,Not Span/Hispanic,2,Emergency,Home w/ Home Health Services,2020,DIG021,GASTROINTESTINAL HEMORRHAGE,GIS004,GI SYSTEM ENDOSCOPY WITHOUT BIOPSY (DIAGNOSTIC),241,PEPTIC ULCER & GASTRITIS,06,DISEASES AND DISORDERS OF THE DIGESTIVE SYSTEM,2,Moderate,Major,Medical,Medicare,Medicaid,,,,Y,74972.52,21003.76
New York City,Manhattan,7002053,001463,NYU Langone Hospitals,70 or Older,100,F,White,Not Span/Hispanic,1,Emergency,Home or Self Care,2020,DIG007,GASTRITIS AND DUODENITIS,,,241,PEPTIC ULCER & GASTRITIS,06,DISEASES AND DISORDERS OF THE DIGESTIVE SYSTEM,2,Moderate,Minor,Medical,Medicare,,,,,Y,27042.25,8293.72
New York City,Manhattan,7002053,001463,NYU Langone Hospitals,30 to 49,112,M,Black/African American,Not Span/Hispanic,2,Emergency,Home or Self Care,2020,DIG005,GASTRODUODENAL ULCER,GIS001,ESOPHAGOGASTRODUODENOSCOPY (EGD) WITH BIOPSY,241,PEPTIC ULCER & GASTRITIS,06,DISEASES AND DISORDERS OF THE DIGESTIVE SYSTEM,2,Moderate,Minor,Medical,Private Health Insurance,,,,,Y,51105.47,14040.7
New York City,Manhattan,7002053,001463,NYU Langone Hospitals,70 or Older,112,M,White,Not Span/Hispanic,2,Emergency,Home or Self Care,2020,DIG007,GASTRITIS AND DUODENITIS,ADM001,TRANSFUSION OF BLOOD AND BLOOD PRODUCTS,241,PEPTIC ULCER & GASTRITIS,06,DISEASES AND DISORDERS OF THE DIGESTIVE SYSTEM,3,Major,Moderate,Medical,Medicare,Blue Cross/Blue Shield,,,,Y,91183.88,11857.23
New York City,Manhattan,7002053,001463,NYU Langone Hospitals,70 or Older,112,M,White,Not Span/Hispanic,1,Emergency,Home or Self Care,2020,DIG005,GASTRODUODENAL ULCER,GIS001,ESOPHAGOGASTRODUODENOSCOPY (EGD) WITH BIOPSY,241,PEPTIC ULCER & GASTRITIS,06,DISEASES AND DISORDERS OF THE DIGESTIVE SYSTEM,2,Moderate,Minor,Medical,Medicare,Private Health Insurance,,,,Y,37874.82,6896.29
New York City,Manhattan,7002053,001463,NYU Langone Hospitals,50 to 69,112,F,White,Not Span/Hispanic,1,Emergency,Home or Self Care,2020,DIG007,GASTRITIS AND DUODENITIS,GIS001,ESOPHAGOGASTRODUODENOSCOPY (EGD) WITH BIOPSY,241,PEPTIC ULCER & GASTRITIS,06,DISEASES AND DISORDERS OF THE DIGESTIVE SYSTEM,2,Moderate,Minor,Medical,Private Health Insurance,,,,,Y,48392.52,9715.85
New York City,Manhattan,7002053,001463,NYU Langone Hospitals,70 or Older,100,F,White,Not Span/Hispanic,2,Emergency,Home or Self Care,2020,DIG021,GASTROINTESTINAL HEMORRHAGE,GNR004,ENDOSCOPIC CONTROL OF BLEEDING,241,PEPTIC ULCER & GASTRITIS,06,DISEASES AND DISORDERS OF THE DIGESTIVE SYSTEM,3,Major,Moderate,Medical,Medicare,,,,,Y,76403.11,14073.63
New York City,Manhattan,7002053,001463,NYU Langone Hospitals,50 to 69,113,M,White,Not Span/Hispanic,10,Elective,Home w/ Home Health Services,2020,DIG007,GASTRITIS AND DUODENITIS,RHB002,"PHYSICAL, OCCUPATIONAL, AND RESPIRATORY THERAPY TREATMENT",241,PEPTIC ULCER & GASTRITIS,06,DISEASES AND DISORDERS OF THE DIGESTIVE SYSTEM,3,Major,Major,Medical,Private Health Insurance,Medicare,,,,N,132618.22,46373.72
New York City,Manhattan,7002053,001463,NYU Langone Hospitals,50 to 69,114,M,Other Race,Spanish/Hispanic,3,Emergency,Home or Self Care,2020,DIG007,GASTRITIS AND DUODENITIS,GIS001,ESOPHAGOGASTRODUODENOSCOPY (EGD) WITH BIOPSY,241,PEPTIC ULCER & GASTRITIS,06,DISEASES AND DISORDERS OF THE DIGESTIVE SYSTEM,2,Moderate,Moderate,Medical,Blue Cross/Blue Shield,,,,,Y,55353.28,13555.73
New York City,Manhattan,7002053,001463,NYU Langone Hospitals,50 to 69,112,M,White,Not Span/Hispanic,1,Elective,Home or Self Care,2020,DIG007,GASTRITIS AND DUODENITIS,GIS004,GI SYSTEM ENDOSCOPY WITHOUT BIOPSY (DIAGNOSTIC),241,PEPTIC ULCER & GASTRITIS,06,DISEASES AND DISORDERS OF THE DIGESTIVE SYSTEM,3,Major,Major,Medical,Medicaid,,,,,N,41381.43,7557.81
New York City,Manhattan,7002053,001463,NYU Langone Hospitals,30 to 49,100,M,Other Race,Not Span/Hispanic,1,Emergency,Home or Self Care,2020,DIG021,GASTROINTESTINAL HEMORRHAGE,GIS001,ESOPHAGOGASTRODUODENOSCOPY (EGD) WITH BIOPSY,241,PEPTIC ULCER & GASTRITIS,06,DISEASES AND DISORDERS OF THE DIGESTIVE SYSTEM,1,Minor,Minor,Medical,Blue Cross/Blue Shield,,,,,Y,29688.17,6149.4
New York City,Manhattan,7002053,001463,NYU Langone Hospitals,70 or Older,100,F,Other Race,Spanish/Hispanic,4,Emergency,Home w/ Home Health Services,2020,DIG021,GASTROINTESTINAL HEMORRHAGE,GNR004,ENDOSCOPIC CONTROL OF BLEEDING,241,PEPTIC ULCER & GASTRITIS,06,DISEASES AND DISORDERS OF THE DIGESTIVE SYSTEM,3,Major,Moderate,Medical,Medicare,Medicare,Private Health Insurance,,,Y,98824,20377.9
New York City,Manhattan,7002053,001463,NYU Langone Hospitals,70 or Older,100,M,White,Not Span/Hispanic,2,Emergency,Home or Self Care,2020,DIG021,GASTROINTESTINAL HEMORRHAGE,GNR004,ENDOSCOPIC CONTROL OF BLEEDING,241,PEPTIC ULCER & GASTRITIS,06,DISEASES AND DISORDERS OF THE DIGESTIVE SYSTEM,3,Major,Moderate,Medical,Medicare,Medicare,,,,Y,47412.73,10538.04
New York City,Manhattan,7002053,001463,NYU Langone Hospitals,70 or Older,100,M,Other Race,Not Span/Hispanic,2,Emergency,Home or Self Care,2020,DIG021,GASTROINTESTINAL HEMORRHAGE,GNR004,ENDOSCOPIC CONTROL OF BLEEDING,241,PEPTIC ULCER & GASTRITIS,06,DISEASES AND DISORDERS OF THE DIGESTIVE SYSTEM,2,Moderate,Minor,Medical,Medicare,,,,,Y,50128.73,10440.32
New York City,Manhattan,7002053,001463,NYU Langone Hospitals,70 or Older,100,F,Other Race,Not Span/Hispanic,3,Emergency,Home or Self Care,2020,DIG021,GASTROINTESTINAL HEMORRHAGE,GIS001,ESOPHAGOGASTRODUODENOSCOPY (EGD) WITH BIOPSY,241,PEPTIC ULCER & GASTRITIS,06,DISEASES AND DISORDERS OF THE DIGESTIVE SYSTEM,2,Moderate,Moderate,Medical,Medicare,Medicaid,,,,Y,74661.12,16128.4
New York City,Manhattan,7002053,001463,NYU Langone Hospitals,50 to 69,104,M,Multi-racial,Spanish/Hispanic,2,Emergency,Home or Self Care,2020,DIG021,GASTROINTESTINAL HEMORRHAGE,GIS001,ESOPHAGOGASTRODUODENOSCOPY (EGD) WITH BIOPSY,241,PEPTIC ULCER & GASTRITIS,06,DISEASES AND DISORDERS OF THE DIGESTIVE SYSTEM,3,Major,Moderate,Medical,Medicare,Medicaid,,,,Y,49838.96,10038.02
New York City,Manhattan,7002053,001463,NYU Langone Hospitals,30 to 49,100,M,Other Race,Not Span/Hispanic,6,Emergency,Home or Self Care,2020,DIG021,GASTROINTESTINAL HEMORRHAGE,GIS004,GI SYSTEM ENDOSCOPY WITHOUT BIOPSY (DIAGNOSTIC),241,PEPTIC ULCER & GASTRITIS,06,DISEASES AND DISORDERS OF THE DIGESTIVE SYSTEM,1,Minor,Minor,Medical,Blue Cross/Blue Shield,,,,,Y,83666.45,23996.48
New York City,Manhattan,7002053,001463,NYU Langone Hospitals,70 or Older,100,F,White,Not Span/Hispanic,4,Emergency,Home w/ Home Health Services,2020,DIG021,GASTROINTESTINAL HEMORRHAGE,GIS001,ESOPHAGOGASTRODUODENOSCOPY (EGD) WITH BIOPSY,241,PEPTIC ULCER & GASTRITIS,06,DISEASES AND DISORDERS OF THE DIGESTIVE SYSTEM,3,Major,Moderate,Medical,Medicare,Private Health Insurance,,,,Y,86797.21,26104.21
New York City,Manhattan,7002053,001463,NYU Langone Hospitals,50 to 69,100,F,Other Race,Not Span/Hispanic,2,Emergency,Home or Self Care,2020,DIG021,GASTROINTESTINAL HEMORRHAGE,GIS001,ESOPHAGOGASTRODUODENOSCOPY (EGD) WITH BIOPSY,241,PEPTIC ULCER & GASTRITIS,06,DISEASES AND DISORDERS OF THE DIGESTIVE SYSTEM,1,Minor,Minor,Medical,Blue Cross/Blue Shield,,,,,Y,41339.22,9762.46
New York City,Manhattan,7002053,001463,NYU Langone Hospitals,30 to 49,104,M,Other Race,Unknown,2,Emergency,Home or Self Care,2020,DIG021,GASTROINTESTINAL HEMORRHAGE,GNR004,ENDOSCOPIC CONTROL OF BLEEDING,241,PEPTIC ULCER & GASTRITIS,06,DISEASES AND DISORDERS OF THE DIGESTIVE SYSTEM,2,Moderate,Minor,Medical,Private Health Insurance,,,,,N,46049.07,10362.42
New York City,Manhattan,7002053,001463,NYU Langone Hospitals,70 or Older,100,M,Other Race,Not Span/Hispanic,5,Emergency,Home or Self Care,2020,DIG021,GASTROINTESTINAL HEMORRHAGE,GNR004,ENDOSCOPIC CONTROL OF BLEEDING,241,PEPTIC ULCER & GASTRITIS,06,DISEASES AND DISORDERS OF THE DIGESTIVE SYSTEM,2,Moderate,Minor,Medical,Medicare,Medicaid,,,,Y,83179.04,21653.49
New York City,Manhattan,7002053,001463,NYU Langone Hospitals,70 or Older,100,M,White,Not Span/Hispanic,3,Emergency,Home or Self Care,2020,DIG021,GASTROINTESTINAL HEMORRHAGE,GIS004,GI SYSTEM ENDOSCOPY WITHOUT BIOPSY (DIAGNOSTIC),241,PEPTIC ULCER & GASTRITIS,06,DISEASES AND DISORDERS OF THE DIGESTIVE SYSTEM,3,Major,Moderate,Medical,Medicare,Private Health Insurance,,,,Y,115096.94,16655.53
New York City,Manhattan,7002053,001463,NYU Langone Hospitals,50 to 69,104,M,Multi-racial,Spanish/Hispanic,3,Emergency,Home or Self Care,2020,DIG007,GASTRITIS AND DUODENITIS,GIS004,GI SYSTEM ENDOSCOPY WITHOUT BIOPSY (DIAGNOSTIC),241,PEPTIC ULCER & GASTRITIS,06,DISEASES AND DISORDERS OF THE DIGESTIVE SYSTEM,2,Moderate,Moderate,Medical,Medicare,Medicaid,,,,Y,49815.6,13211.7
New York City,Manhattan,7002053,001463,NYU Langone Hospitals,30 to 49,100,M,White,Not Span/Hispanic,4,Emergency,Home w/ Home Health Services,2020,DIG021,GASTROINTESTINAL HEMORRHAGE,ADM021,"ADMINISTRATION OF THERAPEUTIC SUBSTANCES, NEC",241,PEPTIC ULCER & GASTRITIS,06,DISEASES AND DISORDERS OF THE DIGESTIVE SYSTEM,3,Major,Major,Medical,Blue Cross/Blue Shield,,,,,Y,95748.8,26677.8
New York City,Manhattan,7002053,001463,NYU Langone Hospitals,70 or Older,100,F,White,Not Span/Hispanic,4,Emergency,Home w/ Home Health Services,2020,DIG021,GASTROINTESTINAL HEMORRHAGE,GNR004,ENDOSCOPIC CONTROL OF BLEEDING,241,PEPTIC ULCER & GASTRITIS,06,DISEASES AND DISORDERS OF THE DIGESTIVE SYSTEM,3,Major,Major,Medical,Medicare,,,,,Y,87473.63,23266.27
New York City,Manhattan,7002053,001463,NYU Langone Hospitals,30 to 49,117,M,White,Not Span/Hispanic,1,Emergency,Home or Self Care,2020,DIG007,GASTRITIS AND DUODENITIS,GIS001,ESOPHAGOGASTRODUODENOSCOPY (EGD) WITH BIOPSY,241,PEPTIC ULCER & GASTRITIS,06,DISEASES AND DISORDERS OF THE DIGESTIVE SYSTEM,3,Major,Moderate,Medical,Medicaid,,,,,Y,75354.6,18530.26
New York City,Manhattan,7002053,001463,NYU Langone Hospitals,70 or Older,100,F,White,Not Span/Hispanic,5,Emergency,Home w/ Home Health Services,2020,DIG021,GASTROINTESTINAL HEMORRHAGE,ADM021,"ADMINISTRATION OF THERAPEUTIC SUBSTANCES, NEC",241,PEPTIC ULCER & GASTRITIS,06,DISEASES AND DISORDERS OF THE DIGESTIVE SYSTEM,3,Major,Major,Medical,Medicare,Blue Cross/Blue Shield,,,,Y,82553.92,29136
New York City,Manhattan,7002053,001463,NYU Langone Hospitals,50 to 69,112,M,Other Race,Unknown,3,Emergency,Home w/ Home Health Services,2020,DIG021,GASTROINTESTINAL HEMORRHAGE,GNR004,ENDOSCOPIC CONTROL OF BLEEDING,241,PEPTIC ULCER & GASTRITIS,06,DISEASES AND DISORDERS OF THE DIGESTIVE SYSTEM,3,Major,Major,Medical,Medicaid,,,,,Y,84435.67,21367.24
New York City,Manhattan,7002053,001463,NYU Langone Hospitals,50 to 69,112,M,White,Not Span/Hispanic,4,Emergency,Home or Self Care,2020,DIG021,GASTROINTESTINAL HEMORRHAGE,GNR004,ENDOSCOPIC CONTROL OF BLEEDING,241,PEPTIC ULCER & GASTRITIS,06,DISEASES AND DISORDERS OF THE DIGESTIVE SYSTEM,3,Major,Minor,Medical,Private Health Insurance,,,,,Y,196388.56,26765.53
New York City,Manhattan,7002053,001463,NYU Langone Hospitals,70 or Older,100,F,White,Not Span/Hispanic,2,Emergency,Home or Self Care,2020,DIG021,GASTROINTESTINAL HEMORRHAGE,GIS004,GI SYSTEM ENDOSCOPY WITHOUT BIOPSY (DIAGNOSTIC),241,PEPTIC ULCER & GASTRITIS,06,DISEASES AND DISORDERS OF THE DIGESTIVE SYSTEM,1,Minor,Minor,Medical,Medicare,Medicare,,,,Y,48081.96,10609.59
New York City,Manhattan,7002053,001463,NYU Langone Hospitals,70 or Older,100,M,White,Not Span/Hispanic,7,Emergency,Skilled Nursing Home,2020,DIG007,GASTRITIS AND DUODENITIS,GIS001,ESOPHAGOGASTRODUODENOSCOPY (EGD) WITH BIOPSY,241,PEPTIC ULCER & GASTRITIS,06,DISEASES AND DISORDERS OF THE DIGESTIVE SYSTEM,2,Moderate,Major,Medical,Medicare,,,,,Y,129142.56,30515.5
New York City,Manhattan,7002053,001463,NYU Langone Hospitals,50 to 69,113,M,Other Race,Not Span/Hispanic,11,Emergency,Medicare Cert Long Term Care Hospital,2020,DIG007,GASTRITIS AND DUODENITIS,GIS004,GI SYSTEM ENDOSCOPY WITHOUT BIOPSY (DIAGNOSTIC),241,PEPTIC ULCER & GASTRITIS,06,DISEASES AND DISORDERS OF THE DIGESTIVE SYSTEM,4,Extreme,Major,Medical,Medicaid,,,,,N,237632.26,99920.62
New York City,Manhattan,7002053,001463,NYU Langone Hospitals,50 to 69,100,M,White,Not Span/Hispanic,2,Emergency,Home or Self Care,2020,DIG021,GASTROINTESTINAL HEMORRHAGE,GNR004,ENDOSCOPIC CONTROL OF BLEEDING,241,PEPTIC ULCER & GASTRITIS,06,DISEASES AND DISORDERS OF THE DIGESTIVE SYSTEM,3,Major,Major,Medical,Blue Cross/Blue Shield,,,,,Y,85997.03,16570.86
New York City,Manhattan,7002053,001463,NYU Langone Hospitals,70 or Older,112,M,Other Race,Spanish/Hispanic,12,Emergency,Skilled Nursing Home,2020,DIG021,GASTROINTESTINAL HEMORRHAGE,GNR004,ENDOSCOPIC CONTROL OF BLEEDING,241,PEPTIC ULCER & GASTRITIS,06,DISEASES AND DISORDERS OF THE DIGESTIVE SYSTEM,3,Major,Major,Medical,Medicare,Medicare,,,,Y,192036.09,50662.05
New York City,Manhattan,7002053,001463,NYU Langone Hospitals,50 to 69,101,M,White,Not Span/Hispanic,3,Emergency,Home or Self Care,2020,DIG021,GASTROINTESTINAL HEMORRHAGE,GNR004,ENDOSCOPIC CONTROL OF BLEEDING,241,PEPTIC ULCER & GASTRITIS,06,DISEASES AND DISORDERS OF THE DIGESTIVE SYSTEM,3,Major,Moderate,Medical,Medicare,,,,,Y,71920.91,14222.19
New York City,Manhattan,7002053,001463,NYU Langone Hospitals,70 or Older,104,F,Other Race,Not Span/Hispanic,1,Emergency,Home or Self Care,2020,DIG021,GASTROINTESTINAL HEMORRHAGE,GIS001,ESOPHAGOGASTRODUODENOSCOPY (EGD) WITH BIOPSY,241,PEPTIC ULCER & GASTRITIS,06,DISEASES AND DISORDERS OF THE DIGESTIVE SYSTEM,2,Moderate,Moderate,Medical,Medicare,Medicare,,,,Y,41313.7,7748.33
New York City,Manhattan,7002053,001463,NYU Langone Hospitals,30 to 49,,M,Multi-racial,Spanish/Hispanic,1,Emergency,Home or Self Care,2020,DIG021,GASTROINTESTINAL HEMORRHAGE,GIS004,GI SYSTEM ENDOSCOPY WITHOUT BIOPSY (DIAGNOSTIC),241,PEPTIC ULCER & GASTRITIS,06,DISEASES AND DISORDERS OF THE DIGESTIVE SYSTEM,2,Moderate,Minor,Medical,Medicaid,,,,,Y,32423.95,6662.51
New York City,Manhattan,7002053,001463,NYU Langone Hospitals,30 to 49,112,M,Other Race,Not Span/Hispanic,1,Emergency,Home or Self Care,2020,DIG021,GASTROINTESTINAL HEMORRHAGE,GIS001,ESOPHAGOGASTRODUODENOSCOPY (EGD) WITH BIOPSY,241,PEPTIC ULCER & GASTRITIS,06,DISEASES AND DISORDERS OF THE DIGESTIVE SYSTEM,1,Minor,Minor,Medical,Private Health Insurance,,,,,Y,60919.58,12149.97
New York City,Manhattan,7002053,001463,NYU Langone Hospitals,30 to 49,100,M,Other Race,Not Span/Hispanic,1,Emergency,Home or Self Care,2020,DIG021,GASTROINTESTINAL HEMORRHAGE,GNR004,ENDOSCOPIC CONTROL OF BLEEDING,241,PEPTIC ULCER & GASTRITIS,06,DISEASES AND DISORDERS OF THE DIGESTIVE SYSTEM,2,Moderate,Minor,Medical,Medicaid,,,,,Y,49477.85,10267.87
New York City,Manhattan,7002053,001463,NYU Langone Hospitals,50 to 69,112,M,White,Not Span/Hispanic,3,Emergency,Home or Self Care,2020,DIG021,GASTROINTESTINAL HEMORRHAGE,GIS001,ESOPHAGOGASTRODUODENOSCOPY (EGD) WITH BIOPSY,241,PEPTIC ULCER & GASTRITIS,06,DISEASES AND DISORDERS OF THE DIGESTIVE SYSTEM,1,Minor,Minor,Medical,Medicaid,,,,,Y,51141.52,13051.07
New York City,Manhattan,7002053,001463,NYU Langone Hospitals,50 to 69,113,F,White,Not Span/Hispanic,1,Emergency,Home or Self Care,2020,DIG021,GASTROINTESTINAL HEMORRHAGE,GIS001,ESOPHAGOGASTRODUODENOSCOPY (EGD) WITH BIOPSY,241,PEPTIC ULCER & GASTRITIS,06,DISEASES AND DISORDERS OF THE DIGESTIVE SYSTEM,2,Moderate,Minor,Medical,Private Health Insurance,,,,,Y,39139.48,7176.92
New York City,Manhattan,7002053,001463,NYU Langone Hospitals,70 or Older,112,F,White,Not Span/Hispanic,3,Emergency,Home w/ Home Health Services,2020,DIG021,GASTROINTESTINAL HEMORRHAGE,GIS004,GI SYSTEM ENDOSCOPY WITHOUT BIOPSY (DIAGNOSTIC),241,PEPTIC ULCER & GASTRITIS,06,DISEASES AND DISORDERS OF THE DIGESTIVE SYSTEM,2,Moderate,Moderate,Medical,Medicare,Medicare,,,,Y,55657.02,13911.06
New York City,Manhattan,7002053,001463,NYU Langone Hospitals,50 to 69,112,M,Other Race,Unknown,1,Emergency,Home w/ Home Health Services,2020,DIG008,OTHER SPECIFIED AND UNSPECIFIED DISORDERS OF STOMACH AND DUODENUM,GNR004,ENDOSCOPIC CONTROL OF BLEEDING,241,PEPTIC ULCER & GASTRITIS,06,DISEASES AND DISORDERS OF THE DIGESTIVE SYSTEM,3,Major,Major,Medical,Medicaid,,,,,Y,56745.45,11333.36
New York City,Manhattan,7002053,001463,NYU Langone Hospitals,50 to 69,112,M,White,Not Span/Hispanic,1,Emergency,Home or Self Care,2020,DIG007,GASTRITIS AND DUODENITIS,,,241,PEPTIC ULCER & GASTRITIS,06,DISEASES AND DISORDERS OF THE DIGESTIVE SYSTEM,2,Moderate,Moderate,Medical,Medicaid,,,,,Y,36423.78,10453.16
New York City,Manhattan,7002053,001463,NYU Langone Hospitals,70 or Older,OOS,M,White,Not Span/Hispanic,1,Emergency,Home w/ Home Health Services,2020,DIG007,GASTRITIS AND DUODENITIS,ESA004,NON-INVASIVE VENTILATION,241,PEPTIC ULCER & GASTRITIS,06,DISEASES AND DISORDERS OF THE DIGESTIVE SYSTEM,2,Moderate,Major,Medical,Medicare,Medicare,,,,Y,48959.34,8475.2
New York City,Manhattan,7002053,001463,NYU Langone Hospitals,50 to 69,112,M,White,Not Span/Hispanic,3,Emergency,Home or Self Care,2020,DIG021,GASTROINTESTINAL HEMORRHAGE,GIS004,GI SYSTEM ENDOSCOPY WITHOUT BIOPSY (DIAGNOSTIC),241,PEPTIC ULCER & GASTRITIS,06,DISEASES AND DISORDERS OF THE DIGESTIVE SYSTEM,2,Moderate,Moderate,Medical,Blue Cross/Blue Shield,,,,,Y,43700.15,12420.49
New York City,Manhattan,7002053,001463,NYU Langone Hospitals,50 to 69,100,F,White,Not Span/Hispanic,1,Emergency,Home or Self Care,2020,DIG021,GASTROINTESTINAL HEMORRHAGE,GNR004,ENDOSCOPIC CONTROL OF BLEEDING,241,PEPTIC ULCER & GASTRITIS,06,DISEASES AND DISORDERS OF THE DIGESTIVE SYSTEM,3,Major,Minor,Medical,Medicare,Medicare,,,,Y,58929.2,14262.08
New York City,Manhattan,7002053,001463,NYU Langone Hospitals,50 to 69,100,F,Other Race,Spanish/Hispanic,2,Emergency,Home w/ Home Health Services,2020,DIG007,GASTRITIS AND DUODENITIS,GIS004,GI SYSTEM ENDOSCOPY WITHOUT BIOPSY (DIAGNOSTIC),241,PEPTIC ULCER & GASTRITIS,06,DISEASES AND DISORDERS OF THE DIGESTIVE SYSTEM,3,Major,Major,Medical,Medicare,Medicaid,,,,Y,63182.1,11464.57
New York City,Manhattan,7002053,001463,NYU Langone Hospitals,70 or Older,100,F,Other Race,Spanish/Hispanic,9,Emergency,Skilled Nursing Home,2020,DIG021,GASTROINTESTINAL HEMORRHAGE,GNR004,ENDOSCOPIC CONTROL OF BLEEDING,241,PEPTIC ULCER & GASTRITIS,06,DISEASES AND DISORDERS OF THE DIGESTIVE SYSTEM,3,Major,Extreme,Medical,Medicare,Medicaid,,,,Y,305109.05,60807.06
New York City,Manhattan,7002053,001463,NYU Langone Hospitals,70 or Older,104,F,Black/African American,Not Span/Hispanic,4,Emergency,Home or Self Care,2020,DIG005,GASTRODUODENAL ULCER,GIS001,ESOPHAGOGASTRODUODENOSCOPY (EGD) WITH BIOPSY,241,PEPTIC ULCER & GASTRITIS,06,DISEASES AND DISORDERS OF THE DIGESTIVE SYSTEM,2,Moderate,Major,Medical,Medicare,Blue Cross/Blue Shield,,,,Y,69377,17668.85
New York City,Manhattan,7002053,001463,NYU Langone Hospitals,70 or Older,100,F,White,Not Span/Hispanic,6,Emergency,Home w/ Home Health Services,2020,DIG021,GASTROINTESTINAL HEMORRHAGE,ADM021,"ADMINISTRATION OF THERAPEUTIC SUBSTANCES, NEC",241,PEPTIC ULCER & GASTRITIS,06,DISEASES AND DISORDERS OF THE DIGESTIVE SYSTEM,3,Major,Major,Medical,Medicare,,,,,Y,150968.54,38121.83
New York City,Manhattan,7002053,001463,NYU Langone Hospitals,70 or Older,113,M,White,Not Span/Hispanic,2,Emergency,Home or Self Care,2020,DIG021,GASTROINTESTINAL HEMORRHAGE,GIS001,ESOPHAGOGASTRODUODENOSCOPY (EGD) WITH BIOPSY,241,PEPTIC ULCER & GASTRITIS,06,DISEASES AND DISORDERS OF THE DIGESTIVE SYSTEM,3,Major,Moderate,Medical,Medicare,,,,,Y,50105.09,11082.34
New York City,Manhattan,7002053,001463,NYU Langone Hospitals,50 to 69,112,M,White,Not Span/Hispanic,4,Emergency,Home or Self Care,2020,DIG021,GASTROINTESTINAL HEMORRHAGE,GNR004,ENDOSCOPIC CONTROL OF BLEEDING,241,PEPTIC ULCER & GASTRITIS,06,DISEASES AND DISORDERS OF THE DIGESTIVE SYSTEM,2,Moderate,Minor,Medical,Medicare,Blue Cross/Blue Shield,,,,Y,58106.78,16572.55
New York City,Manhattan,7002053,001463,NYU Langone Hospitals,30 to 49,112,M,Other Race,Not Span/Hispanic,1,Emergency,Home or Self Care,2020,DIG021,GASTROINTESTINAL HEMORRHAGE,GIS001,ESOPHAGOGASTRODUODENOSCOPY (EGD) WITH BIOPSY,241,PEPTIC ULCER & GASTRITIS,06,DISEASES AND DISORDERS OF THE DIGESTIVE SYSTEM,2,Moderate,Minor,Medical,Medicaid,,,,,Y,32486.63,6532.73
New York City,Manhattan,7002053,001463,NYU Langone Hospitals,30 to 49,107,M,Black/African American,Not Span/Hispanic,1,Emergency,Home or Self Care,2020,DIG007,GASTRITIS AND DUODENITIS,MAM011,ELECTROENCEPHALOGRAM (EEG),241,PEPTIC ULCER & GASTRITIS,06,DISEASES AND DISORDERS OF THE DIGESTIVE SYSTEM,2,Moderate,Moderate,Medical,Blue Cross/Blue Shield,,,,,Y,43992.45,5899.41
New York City,Manhattan,7002053,001463,NYU Langone Hospitals,70 or Older,112,M,White,Not Span/Hispanic,20,Emergency,Inpatient Rehabilitation Facility,2020,DIG021,GASTROINTESTINAL HEMORRHAGE,GIS001,ESOPHAGOGASTRODUODENOSCOPY (EGD) WITH BIOPSY,241,PEPTIC ULCER & GASTRITIS,06,DISEASES AND DISORDERS OF THE DIGESTIVE SYSTEM,4,Extreme,Extreme,Medical,Medicare,Blue Cross/Blue Shield,,,,N,401760.25,147994.61
New York City,Manhattan,7002053,001463,NYU Langone Hospitals,50 to 69,113,M,Other Race,Unknown,5,Emergency,Home w/ Home Health Services,2020,DIG007,GASTRITIS AND DUODENITIS,ADM001,TRANSFUSION OF BLOOD AND BLOOD PRODUCTS,241,PEPTIC ULCER & GASTRITIS,06,DISEASES AND DISORDERS OF THE DIGESTIVE SYSTEM,3,Major,Major,Medical,Medicaid,,,,,Y,84844.2,19788.51
New York City,Manhattan,7002053,001463,NYU Langone Hospitals,70 or Older,113,F,White,Not Span/Hispanic,2,Emergency,Home or Self Care,2020,DIG021,GASTROINTESTINAL HEMORRHAGE,GIS001,ESOPHAGOGASTRODUODENOSCOPY (EGD) WITH BIOPSY,241,PEPTIC ULCER & GASTRITIS,06,DISEASES AND DISORDERS OF THE DIGESTIVE SYSTEM,2,Moderate,Moderate,Medical,Medicare,,,,,Y,44860.99,9902.95
New York City,Manhattan,7002053,001463,NYU Langone Hospitals,50 to 69,100,F,White,Not Span/Hispanic,4,Emergency,Home or Self Care,2020,DIG007,GASTRITIS AND DUODENITIS,OTR004,ISOLATION PROCEDURES,241,PEPTIC ULCER & GASTRITIS,06,DISEASES AND DISORDERS OF THE DIGESTIVE SYSTEM,1,Minor,Minor,Medical,Private Health Insurance,,,,,Y,48030.84,14297.34
New York City,Manhattan,7002053,001463,NYU Langone Hospitals,70 or Older,113,M,White,Not Span/Hispanic,4,Emergency,Home w/ Home Health Services,2020,DIG021,GASTROINTESTINAL HEMORRHAGE,GIS016,GI SYSTEM ENDOSCOPIC THERAPEUTIC PROCEDURES,241,PEPTIC ULCER & GASTRITIS,06,DISEASES AND DISORDERS OF THE DIGESTIVE SYSTEM,3,Major,Major,Medical,Medicare,Medicaid,,,,Y,115411.03,20194.67
New York City,Manhattan,7002053,001463,NYU Langone Hospitals,70 or Older,100,F,White,Not Span/Hispanic,3,Emergency,Home w/ Home Health Services,2020,DIG021,GASTROINTESTINAL HEMORRHAGE,GNR004,ENDOSCOPIC CONTROL OF BLEEDING,241,PEPTIC ULCER & GASTRITIS,06,DISEASES AND DISORDERS OF THE DIGESTIVE SYSTEM,3,Major,Major,Medical,Medicare,Medicare,,,,Y,67407.99,15212.89
New York City,Manhattan,7002053,001463,NYU Langone Hospitals,50 to 69,100,F,Black/African American,Unknown,7,Emergency,Home w/ Home Health Services,2020,DIG007,GASTRITIS AND DUODENITIS,GIS001,ESOPHAGOGASTRODUODENOSCOPY (EGD) WITH BIOPSY,241,PEPTIC ULCER & GASTRITIS,06,DISEASES AND DISORDERS OF THE DIGESTIVE SYSTEM,3,Major,Major,Medical,Medicaid,,,,,Y,161868.14,40269.93
New York City,Manhattan,7002053,001463,NYU Langone Hospitals,30 to 49,100,F,White,Not Span/Hispanic,1,Emergency,Home or Self Care,2020,DIG007,GASTRITIS AND DUODENITIS,GIS001,ESOPHAGOGASTRODUODENOSCOPY (EGD) WITH BIOPSY,241,PEPTIC ULCER & GASTRITIS,06,DISEASES AND DISORDERS OF THE DIGESTIVE SYSTEM,2,Moderate,Major,Medical,Private Health Insurance,,,,,Y,45527.39,8113.91