Hospital Service Area,Hospital County,Operating Certificate Number,Permanent Facility Id,Facility Name,Age Group,Zip Code - 3 digits,Gender,Race,Ethnicity,Length of Stay,Type of Admission,Patient Disposition,Discharge Year,CCS Diagnosis Code,CCS Diagnosis Description,CCS Procedure Code,CCS Procedure Description,APR DRG Code,APR DRG Description,APR MDC Code,APR MDC Description,APR Severity of Illness Code,APR Severity of Illness Description,APR Risk of Mortality,APR Medical Surgical Description,Payment Typology 1,Payment Typology 2,Payment Typology 3,Birth Weight,Abortion Edit Indicator,Emergency Department Indicator,Total Charges,Total Costs
New York City,Bronx,7000006,001168,Montefiore Medical Center-Wakefield Hospital,30 to 49,104,M,Other Race,Spanish/Hispanic,5,Emergency,Home or Self Care,2020,DIG004,ESOPHAGEAL DISORDERS,GNR004,ENDOSCOPIC CONTROL OF BLEEDING,242,MAJOR ESOPHAGEAL DISORDERS,06,DISEASES AND DISORDERS OF THE DIGESTIVE SYSTEM,3,Major,Major,Medical,Private Health Insurance,,,,,Y,165440.47,26131.12
New York City,Bronx,7000006,003058,Montefiore Med Center - Jack D Weiler Hosp of A Einstein College Div,50 to 69,104,M,White,Not Span/Hispanic,36,Emergency,Medicare Cert Long Term Care Hospital,2020,DIG004,ESOPHAGEAL DISORDERS,GIS001,ESOPHAGOGASTRODUODENOSCOPY (EGD) WITH BIOPSY,242,MAJOR ESOPHAGEAL DISORDERS,06,DISEASES AND DISORDERS OF THE DIGESTIVE SYSTEM,3,Major,Major,Medical,Private Health Insurance,,,,,Y,345704.92,62411.37
New York City,Bronx,7000006,003058,Montefiore Med Center - Jack D Weiler Hosp of A Einstein College Div,30 to 49,104,M,Other Race,Spanish/Hispanic,9,Emergency,Home or Self Care,2020,CIR039,OTHER SPECIFIED DISEASES OF VEINS AND LYMPHATICS,CAR010,LIGATION AND EMBOLIZATION OF VESSELS,242,MAJOR ESOPHAGEAL DISORDERS,06,DISEASES AND DISORDERS OF THE DIGESTIVE SYSTEM,3,Major,Major,Medical,Private Health Insurance,,,,,Y,208570.54,40968.48
New York City,Bronx,7000006,001169,Montefiore Medical Center - Henry & Lucy Moses Div,0 to 17,104,F,Black/African American,Not Span/Hispanic,3,Emergency,Home or Self Care,2020,DIG004,ESOPHAGEAL DISORDERS,,,242,MAJOR ESOPHAGEAL DISORDERS,06,DISEASES AND DISORDERS OF THE DIGESTIVE SYSTEM,1,Minor,Minor,Medical,Medicaid,,,,,Y,40397.28,9922.52
New York City,Manhattan,7002032,001466,Mount Sinai West,50 to 69,100,F,Other Race,Not Span/Hispanic,2,Emergency,Home or Self Care,2020,DIG004,ESOPHAGEAL DISORDERS,RES007,AIRWAY INTUBATION,242,MAJOR ESOPHAGEAL DISORDERS,06,DISEASES AND DISORDERS OF THE DIGESTIVE SYSTEM,3,Major,Major,Medical,Private Health Insurance,Self-Pay,,,,Y,57329,14752.74
New York City,Manhattan,7002002,001439,Mount Sinai Beth Israel,50 to 69,100,M,Other Race,Unknown,3,Emergency,Home or Self Care,2020,DIG004,ESOPHAGEAL DISORDERS,GIS004,GI SYSTEM ENDOSCOPY WITHOUT BIOPSY (DIAGNOSTIC),242,MAJOR ESOPHAGEAL DISORDERS,06,DISEASES AND DISORDERS OF THE DIGESTIVE SYSTEM,2,Moderate,Moderate,Medical,Medicaid,Self-Pay,,,,N,43688.21,8910.65
New York City,Bronx,7000006,003058,Montefiore Med Center - Jack D Weiler Hosp of A Einstein College Div,50 to 69,104,M,Other Race,Spanish/Hispanic,3,Emergency,Home or Self Care,2020,CIR039,OTHER SPECIFIED DISEASES OF VEINS AND LYMPHATICS,GIS016,GI SYSTEM ENDOSCOPIC THERAPEUTIC PROCEDURES,242,MAJOR ESOPHAGEAL DISORDERS,06,DISEASES AND DISORDERS OF THE DIGESTIVE SYSTEM,3,Major,Major,Medical,Medicare,,,,,Y,58251.07,13224.31
Hudson Valley,Westchester,5901000,001039,NewYork-Presbyterian/Hudson Valley Hospital,70 or Older,105,M,White,Not Span/Hispanic,6,Emergency,Home or Self Care,2020,DIG004,ESOPHAGEAL DISORDERS,GIS001,ESOPHAGOGASTRODUODENOSCOPY (EGD) WITH BIOPSY,242,MAJOR ESOPHAGEAL DISORDERS,06,DISEASES AND DISORDERS OF THE DIGESTIVE SYSTEM,3,Major,Moderate,Medical,Medicare,Private Health Insurance,,,,Y,56130.74,24994.2
Hudson Valley,Westchester,5904001,001072,Montefiore New Rochelle Hospital,70 or Older,,M,Multi-racial,Multi-ethnic,1,Emergency,Home or Self Care,2020,DIG004,ESOPHAGEAL DISORDERS,ADM005,ADMINISTRATION OF THROMBOLYTICS AND PLATELET INHIBITORS,242,MAJOR ESOPHAGEAL DISORDERS,06,DISEASES AND DISORDERS OF THE DIGESTIVE SYSTEM,1,Minor,Minor,Medical,Medicare,Medicare,Self-Pay,,,Y,9809.81,5150.3
Hudson Valley,Westchester,5904001,001072,Montefiore New Rochelle Hospital,70 or Older,108,F,White,Unknown,2,Emergency,Home or Self Care,2020,DIG004,ESOPHAGEAL DISORDERS,ADM001,TRANSFUSION OF BLOOD AND BLOOD PRODUCTS,242,MAJOR ESOPHAGEAL DISORDERS,06,DISEASES AND DISORDERS OF THE DIGESTIVE SYSTEM,2,Moderate,Moderate,Medical,Blue Cross/Blue Shield,Medicare,Self-Pay,,,Y,30670.63,9577.38
New York City,Manhattan,7002054,003975,New York Presbyterian Hospital - Allen Hospital,50 to 69,100,M,Other Race,Not Span/Hispanic,2,Emergency,Home or Self Care,2020,DIG004,ESOPHAGEAL DISORDERS,GIS001,ESOPHAGOGASTRODUODENOSCOPY (EGD) WITH BIOPSY,242,MAJOR ESOPHAGEAL DISORDERS,06,DISEASES AND DISORDERS OF THE DIGESTIVE SYSTEM,2,Moderate,Moderate,Medical,Private Health Insurance,Medicaid,Self-Pay,,,Y,34779.9,8204.06
New York City,Manhattan,7002054,003975,New York Presbyterian Hospital - Allen Hospital,50 to 69,104,F,Black/African American,Not Span/Hispanic,5,Emergency,Skilled Nursing Home,2020,DIG004,ESOPHAGEAL DISORDERS,ADM001,TRANSFUSION OF BLOOD AND BLOOD PRODUCTS,242,MAJOR ESOPHAGEAL DISORDERS,06,DISEASES AND DISORDERS OF THE DIGESTIVE SYSTEM,2,Moderate,Major,Medical,Medicaid,Medicaid,Self-Pay,,,Y,64381.23,13528.3
New York City,Manhattan,7002054,001464,New York-Presbyterian Hospital - Columbia Presbyterian Center,30 to 49,OOS,M,White,Not Span/Hispanic,5,Emergency,Home or Self Care,2020,DIG006,GASTROINTESTINAL AND BILIARY PERFORATION,,,242,MAJOR ESOPHAGEAL DISORDERS,06,DISEASES AND DISORDERS OF THE DIGESTIVE SYSTEM,2,Moderate,Moderate,Medical,Blue Cross/Blue Shield,Self-Pay,,,,N,68377.3,15416.47
New York City,Manhattan,7002054,001464,New York-Presbyterian Hospital - Columbia Presbyterian Center,70 or Older,100,M,Other Race,Not Span/Hispanic,3,Emergency,Skilled Nursing Home,2020,DIG004,ESOPHAGEAL DISORDERS,GIS004,GI SYSTEM ENDOSCOPY WITHOUT BIOPSY (DIAGNOSTIC),242,MAJOR ESOPHAGEAL DISORDERS,06,DISEASES AND DISORDERS OF THE DIGESTIVE SYSTEM,2,Moderate,Moderate,Medical,Medicare,Medicaid,Self-Pay,,,Y,47119.6,11123.8
New York City,Manhattan,7002054,001437,New York-Presbyterian/Lower Manhattan Hospital,30 to 49,,M,White,Not Span/Hispanic,2,Emergency,Home or Self Care,2020,DIG004,ESOPHAGEAL DISORDERS,GIS004,GI SYSTEM ENDOSCOPY WITHOUT BIOPSY (DIAGNOSTIC),242,MAJOR ESOPHAGEAL DISORDERS,06,DISEASES AND DISORDERS OF THE DIGESTIVE SYSTEM,2,Moderate,Moderate,Medical,Private Health Insurance,Self-Pay,,,,Y,30913.39,7513.62
New York City,Manhattan,7002054,001458,New York-Presbyterian Hospital - New York Weill Cornell Center,30 to 49,104,M,Other Race,Not Span/Hispanic,2,Emergency,Home or Self Care,2020,DIG004,ESOPHAGEAL DISORDERS,ADM001,TRANSFUSION OF BLOOD AND BLOOD PRODUCTS,242,MAJOR ESOPHAGEAL DISORDERS,06,DISEASES AND DISORDERS OF THE DIGESTIVE SYSTEM,3,Major,Minor,Medical,"Managed Care, Unspecified",Medicaid,Self-Pay,,,Y,38150.58,8758.31
New York City,Manhattan,7002054,001458,New York-Presbyterian Hospital - New York Weill Cornell Center,50 to 69,104,M,Other Race,Spanish/Hispanic,8,Emergency,Home or Self Care,2020,DIG004,ESOPHAGEAL DISORDERS,ENT001,LARYNGOSCOPY (DIAGNOSTIC),242,MAJOR ESOPHAGEAL DISORDERS,06,DISEASES AND DISORDERS OF THE DIGESTIVE SYSTEM,4,Extreme,Extreme,Medical,Medicaid,Self-Pay,,,,Y,173736.44,63754.71
New York City,Kings,7001021,001306,New York - Presbyterian Brooklyn Methodist Hospital,70 or Older,112,M,White,Not Span/Hispanic,2,Emergency,Home or Self Care,2020,DIG004,ESOPHAGEAL DISORDERS,GIS004,GI SYSTEM ENDOSCOPY WITHOUT BIOPSY (DIAGNOSTIC),242,MAJOR ESOPHAGEAL DISORDERS,06,DISEASES AND DISORDERS OF THE DIGESTIVE SYSTEM,2,Moderate,Moderate,Medical,Medicare,Medicare,Self-Pay,,,Y,23252.31,7817.55
New York City,Kings,7001021,001306,New York - Presbyterian Brooklyn Methodist Hospital,70 or Older,112,F,Black/African American,Not Span/Hispanic,6,Emergency,Home or Self Care,2020,DIG004,ESOPHAGEAL DISORDERS,GIS001,ESOPHAGOGASTRODUODENOSCOPY (EGD) WITH BIOPSY,242,MAJOR ESOPHAGEAL DISORDERS,06,DISEASES AND DISORDERS OF THE DIGESTIVE SYSTEM,2,Moderate,Minor,Medical,Medicare,Medicare,Self-Pay,,,Y,53672.68,14850.03
New York City,Manhattan,7002054,001458,New York-Presbyterian Hospital - New York Weill Cornell Center,50 to 69,111,M,Black/African American,Not Span/Hispanic,1,Emergency,Home or Self Care,2020,DIG004,ESOPHAGEAL DISORDERS,RES007,AIRWAY INTUBATION,242,MAJOR ESOPHAGEAL DISORDERS,06,DISEASES AND DISORDERS OF THE DIGESTIVE SYSTEM,2,Moderate,Moderate,Medical,Medicare,Medicaid,Self-Pay,,,Y,32662.89,13470.09
New York City,Manhattan,7002054,001458,New York-Presbyterian Hospital - New York Weill Cornell Center,50 to 69,112,F,Black/African American,Not Span/Hispanic,5,Emergency,Home w/ Home Health Services,2020,DIG004,ESOPHAGEAL DISORDERS,CAR024,VENOUS AND ARTERIAL CATHETER PLACEMENT,242,MAJOR ESOPHAGEAL DISORDERS,06,DISEASES AND DISORDERS OF THE DIGESTIVE SYSTEM,4,Extreme,Major,Medical,Medicare,Medicaid,Self-Pay,,,Y,69918.53,16409.14
New York City,Kings,7001021,001306,New York - Presbyterian Brooklyn Methodist Hospital,18 to 29,112,F,Black/African American,Not Span/Hispanic,2,Emergency,Home or Self Care,2020,DIG004,ESOPHAGEAL DISORDERS,IMG004,FLUOROSCOPY OF NON-CIRCULATORY ORGANS,242,MAJOR ESOPHAGEAL DISORDERS,06,DISEASES AND DISORDERS OF THE DIGESTIVE SYSTEM,2,Moderate,Minor,Medical,Blue Cross/Blue Shield,Self-Pay,,,,Y,26153.61,6083.74
New York City,Bronx,7000006,003058,Montefiore Med Center - Jack D Weiler Hosp of A Einstein College Div,30 to 49,104,F,Black/African American,Not Span/Hispanic,6,Emergency,Home w/ Home Health Services,2020,DIG004,ESOPHAGEAL DISORDERS,ADM017,ADMINISTRATION OF NUTRITIONAL AND ELECTROLYTIC SUBSTANCES,242,MAJOR ESOPHAGEAL DISORDERS,06,DISEASES AND DISORDERS OF THE DIGESTIVE SYSTEM,2,Moderate,Major,Medical,Medicaid,,,,,Y,58118.97,10528.96
Capital/Adirond,Otsego,3801000,000739,A.O. Fox Memorial Hospital,50 to 69,137,F,White,Not Span/Hispanic,4,Emergency,Home or Self Care,2020,DIG004,ESOPHAGEAL DISORDERS,GIS001,ESOPHAGOGASTRODUODENOSCOPY (EGD) WITH BIOPSY,242,MAJOR ESOPHAGEAL DISORDERS,06,DISEASES AND DISORDERS OF THE DIGESTIVE SYSTEM,2,Moderate,Minor,Medical,Medicare,,,,,Y,14227.75,8776.18
Long Island,Nassau,2950002,000528,Nassau University Medical Center,70 or Older,115,F,Black/African American,Not Span/Hispanic,3,Emergency,Skilled Nursing Home,2020,DIG004,ESOPHAGEAL DISORDERS,ADM021,"ADMINISTRATION OF THERAPEUTIC SUBSTANCES, NEC",242,MAJOR ESOPHAGEAL DISORDERS,06,DISEASES AND DISORDERS OF THE DIGESTIVE SYSTEM,3,Major,Moderate,Medical,Medicaid,Self-Pay,,,,N,26425.91,9796.43
Long Island,Nassau,2950002,000528,Nassau University Medical Center,70 or Older,115,F,White,Not Span/Hispanic,6,Emergency,Home or Self Care,2020,CIR039,OTHER SPECIFIED DISEASES OF VEINS AND LYMPHATICS,GIS004,GI SYSTEM ENDOSCOPY WITHOUT BIOPSY (DIAGNOSTIC),242,MAJOR ESOPHAGEAL DISORDERS,06,DISEASES AND DISORDERS OF THE DIGESTIVE SYSTEM,3,Major,Major,Medical,Medicare,Medicare,Self-Pay,,,N,50620.39,18389.86
New York City,Bronx,7000006,003058,Montefiore Med Center - Jack D Weiler Hosp of A Einstein College Div,30 to 49,104,F,Black/African American,Not Span/Hispanic,9,Emergency,Home or Self Care,2020,DIG004,ESOPHAGEAL DISORDERS,GIS001,ESOPHAGOGASTRODUODENOSCOPY (EGD) WITH BIOPSY,242,MAJOR ESOPHAGEAL DISORDERS,06,DISEASES AND DISORDERS OF THE DIGESTIVE SYSTEM,2,Moderate,Major,Medical,Medicaid,,,,,Y,115889.19,22283.44
Western NY,Erie,1401005,000210,Erie County Medical Center,50 to 69,141,M,White,Not Span/Hispanic,2,Emergency,Home or Self Care,2020,DIG004,ESOPHAGEAL DISORDERS,GIS001,ESOPHAGOGASTRODUODENOSCOPY (EGD) WITH BIOPSY,242,MAJOR ESOPHAGEAL DISORDERS,06,DISEASES AND DISORDERS OF THE DIGESTIVE SYSTEM,2,Moderate,Moderate,Medical,Medicare,Medicare,Self-Pay,,,Y,12401.51,5809.32
New York City,Manhattan,7002024,001456,Mount Sinai Hospital,30 to 49,100,F,Other Race,Not Span/Hispanic,6,Urgent,Home or Self Care,2020,DIG004,ESOPHAGEAL DISORDERS,,,242,MAJOR ESOPHAGEAL DISORDERS,06,DISEASES AND DISORDERS OF THE DIGESTIVE SYSTEM,4,Extreme,Major,Medical,Medicaid,Medicaid,Self-Pay,,,N,78749.21,18917.46
New York City,Manhattan,7002053,001463,NYU Langone Hospitals,18 to 29,113,M,White,Not Span/Hispanic,1,Emergency,Home or Self Care,2020,DIG004,ESOPHAGEAL DISORDERS,GIS001,ESOPHAGOGASTRODUODENOSCOPY (EGD) WITH BIOPSY,242,MAJOR ESOPHAGEAL DISORDERS,06,DISEASES AND DISORDERS OF THE DIGESTIVE SYSTEM,2,Moderate,Minor,Medical,Private Health Insurance,Blue Cross/Blue Shield,,,,Y,38188.78,6977.89
New York City,Manhattan,7002024,001456,Mount Sinai Hospital,30 to 49,100,F,Black/African American,Not Span/Hispanic,16,Emergency,Left Against Medical Advice,2020,DIG004,ESOPHAGEAL DISORDERS,CAR024,VENOUS AND ARTERIAL CATHETER PLACEMENT,242,MAJOR ESOPHAGEAL DISORDERS,06,DISEASES AND DISORDERS OF THE DIGESTIVE SYSTEM,3,Major,Moderate,Medical,Medicaid,Medicaid,Self-Pay,,,Y,251851.36,72846.54
Capital/Adirond,Otsego,3824000,000746,Mary Imogene Bassett Hospital,30 to 49,133,F,White,Not Span/Hispanic,5,Urgent,Short-term Hospital,2020,CIR039,OTHER SPECIFIED DISEASES OF VEINS AND LYMPHATICS,GIS004,GI SYSTEM ENDOSCOPY WITHOUT BIOPSY (DIAGNOSTIC),242,MAJOR ESOPHAGEAL DISORDERS,06,DISEASES AND DISORDERS OF THE DIGESTIVE SYSTEM,2,Moderate,Moderate,Medical,Blue Cross/Blue Shield,,,,,N,18785.04,10933.03
New York City,Manhattan,7002024,001456,Mount Sinai Hospital,50 to 69,115,M,White,Not Span/Hispanic,10,Emergency,Home or Self Care,2020,DIG004,ESOPHAGEAL DISORDERS,GNR004,ENDOSCOPIC CONTROL OF BLEEDING,242,MAJOR ESOPHAGEAL DISORDERS,06,DISEASES AND DISORDERS OF THE DIGESTIVE SYSTEM,3,Major,Moderate,Medical,Medicare,Private Health Insurance,Self-Pay,,,Y,134612.78,34946.05
New York City,Kings,7002053,001304,NYU Langone Hospital-Brooklyn,18 to 29,112,M,White,Spanish/Hispanic,1,Emergency,Home or Self Care,2020,DIG004,ESOPHAGEAL DISORDERS,,,242,MAJOR ESOPHAGEAL DISORDERS,06,DISEASES AND DISORDERS OF THE DIGESTIVE SYSTEM,1,Minor,Minor,Medical,Medicaid,,,,,Y,19525.7,4544.42
New York City,Kings,7002053,001304,NYU Langone Hospital-Brooklyn,70 or Older,112,M,Black/African American,Not Span/Hispanic,5,Emergency,Home or Self Care,2020,DIG004,ESOPHAGEAL DISORDERS,GIS004,GI SYSTEM ENDOSCOPY WITHOUT BIOPSY (DIAGNOSTIC),242,MAJOR ESOPHAGEAL DISORDERS,06,DISEASES AND DISORDERS OF THE DIGESTIVE SYSTEM,2,Moderate,Minor,Medical,Medicaid,,,,,Y,66815.82,19587.93
Capital/Adirond,Columbia,1001000,000146,Columbia Memorial Hospital,70 or Older,125,M,White,Not Span/Hispanic,11,Elective,Short-term Hospital,2020,DIG004,ESOPHAGEAL DISORDERS,GIS004,GI SYSTEM ENDOSCOPY WITHOUT BIOPSY (DIAGNOSTIC),242,MAJOR ESOPHAGEAL DISORDERS,06,DISEASES AND DISORDERS OF THE DIGESTIVE SYSTEM,3,Major,Major,Medical,Medicare,,,,,Y,69151.79,39981.09
Hudson Valley,Westchester,5904001,001072,Montefiore New Rochelle Hospital,50 to 69,108,M,White,Not Span/Hispanic,2,Emergency,Expired,2020,DIG004,ESOPHAGEAL DISORDERS,GNR004,ENDOSCOPIC CONTROL OF BLEEDING,242,MAJOR ESOPHAGEAL DISORDERS,06,DISEASES AND DISORDERS OF THE DIGESTIVE SYSTEM,4,Extreme,Extreme,Medical,Private Health Insurance,Self-Pay,,,,N,75355.44,24479.15
Hudson Valley,Rockland,4329000,000779,Good Samaritan Hospital of Suffern,50 to 69,109,F,Other Race,Spanish/Hispanic,3,Emergency,Home or Self Care,2020,DIG004,ESOPHAGEAL DISORDERS,GNR004,ENDOSCOPIC CONTROL OF BLEEDING,242,MAJOR ESOPHAGEAL DISORDERS,06,DISEASES AND DISORDERS OF THE DIGESTIVE SYSTEM,3,Major,Minor,Medical,Blue Cross/Blue Shield,,,,,Y,99718.37,21792.09
Hudson Valley,Orange,3529000,000704,St Anthony Community Hospital,70 or Older,109,M,White,Not Span/Hispanic,2,Emergency,Home or Self Care,2020,DIG004,ESOPHAGEAL DISORDERS,GIS004,GI SYSTEM ENDOSCOPY WITHOUT BIOPSY (DIAGNOSTIC),242,MAJOR ESOPHAGEAL DISORDERS,06,DISEASES AND DISORDERS OF THE DIGESTIVE SYSTEM,3,Major,Moderate,Medical,Medicare,,,,,Y,51972.72,6797.35
New York City,Manhattan,7002053,001463,NYU Langone Hospitals,30 to 49,100,F,White,Not Span/Hispanic,1,Emergency,Home or Self Care,2020,DIG004,ESOPHAGEAL DISORDERS,GNR004,ENDOSCOPIC CONTROL OF BLEEDING,242,MAJOR ESOPHAGEAL DISORDERS,06,DISEASES AND DISORDERS OF THE DIGESTIVE SYSTEM,2,Moderate,Minor,Medical,Private Health Insurance,,,,,Y,30993.51,6435.2
New York City,Manhattan,7002024,001456,Mount Sinai Hospital,50 to 69,104,M,Other Race,Not Span/Hispanic,4,Emergency,Home or Self Care,2020,DIG004,ESOPHAGEAL DISORDERS,GIS027,"UPPER GI THERAPEUTIC PROCEDURES, NEC (ENDOSCOPIC)",242,MAJOR ESOPHAGEAL DISORDERS,06,DISEASES AND DISORDERS OF THE DIGESTIVE SYSTEM,3,Major,Major,Medical,Medicaid,Medicaid,Self-Pay,,,Y,76529.8,18702.27
New York City,Bronx,7000001,001178,BronxCare Hospital Center,50 to 69,104,M,Other Race,Spanish/Hispanic,6,Emergency,Home or Self Care,2020,DIG004,ESOPHAGEAL DISORDERS,ADM001,TRANSFUSION OF BLOOD AND BLOOD PRODUCTS,242,MAJOR ESOPHAGEAL DISORDERS,06,DISEASES AND DISORDERS OF THE DIGESTIVE SYSTEM,3,Major,Moderate,Medical,Medicaid,,,,,Y,25852.31,31739.86
New York City,Bronx,7000001,001178,BronxCare Hospital Center,50 to 69,104,F,Black/African American,Not Span/Hispanic,2,Emergency,Home or Self Care,2020,CIR039,OTHER SPECIFIED DISEASES OF VEINS AND LYMPHATICS,GIS004,GI SYSTEM ENDOSCOPY WITHOUT BIOPSY (DIAGNOSTIC),242,MAJOR ESOPHAGEAL DISORDERS,06,DISEASES AND DISORDERS OF THE DIGESTIVE SYSTEM,2,Moderate,Major,Medical,Medicaid,Medicaid,,,,Y,10795.84,12578.78
New York City,Bronx,7000001,001178,BronxCare Hospital Center,50 to 69,104,M,Other Race,Spanish/Hispanic,6,Emergency,Facility w/ Custodial/Supportive Care,2020,CIR039,OTHER SPECIFIED DISEASES OF VEINS AND LYMPHATICS,ADM001,TRANSFUSION OF BLOOD AND BLOOD PRODUCTS,242,MAJOR ESOPHAGEAL DISORDERS,06,DISEASES AND DISORDERS OF THE DIGESTIVE SYSTEM,3,Major,Major,Medical,Medicaid,,,,,Y,28123.22,25292.54
Finger Lakes,Monroe,2701001,000409,Highland Hospital,30 to 49,145,F,White,Not Span/Hispanic,6,Emergency,Home or Self Care,2020,DIG004,ESOPHAGEAL DISORDERS,GIS001,ESOPHAGOGASTRODUODENOSCOPY (EGD) WITH BIOPSY,242,MAJOR ESOPHAGEAL DISORDERS,06,DISEASES AND DISORDERS OF THE DIGESTIVE SYSTEM,1,Minor,Minor,Medical,Blue Cross/Blue Shield,,,,,Y,27997.78,8464.69
Finger Lakes,Monroe,2701001,000409,Highland Hospital,70 or Older,144,M,White,Not Span/Hispanic,4,Emergency,Home or Self Care,2020,DIG004,ESOPHAGEAL DISORDERS,GNR004,ENDOSCOPIC CONTROL OF BLEEDING,242,MAJOR ESOPHAGEAL DISORDERS,06,DISEASES AND DISORDERS OF THE DIGESTIVE SYSTEM,3,Major,Moderate,Medical,Medicare,,,,,Y,34952.6,10280.63
Finger Lakes,Monroe,2701005,000413,Strong Memorial Hospital,50 to 69,145,M,White,Not Span/Hispanic,7,Emergency,Expired,2020,DIG004,ESOPHAGEAL DISORDERS,RES007,AIRWAY INTUBATION,242,MAJOR ESOPHAGEAL DISORDERS,06,DISEASES AND DISORDERS OF THE DIGESTIVE SYSTEM,4,Extreme,Extreme,Medical,Private Health Insurance,,,,,Y,84425.8,30330.14
New York City,Bronx,7000006,003058,Montefiore Med Center - Jack D Weiler Hosp of A Einstein College Div,70 or Older,104,M,Other Race,Not Span/Hispanic,20,Emergency,Home w/ Home Health Services,2020,DIG004,ESOPHAGEAL DISORDERS,ADM017,ADMINISTRATION OF NUTRITIONAL AND ELECTROLYTIC SUBSTANCES,242,MAJOR ESOPHAGEAL DISORDERS,06,DISEASES AND DISORDERS OF THE DIGESTIVE SYSTEM,4,Extreme,Extreme,Medical,Medicare,Medicaid,,,,Y,268744.37,48055.54
Capital/Adirond,Albany,0101000,000001,Albany Medical Center Hospital,50 to 69,122,M,White,Not Span/Hispanic,5,Emergency,Home or Self Care,2020,CIR039,OTHER SPECIFIED DISEASES OF VEINS AND LYMPHATICS,GIS027,"UPPER GI THERAPEUTIC PROCEDURES, NEC (ENDOSCOPIC)",242,MAJOR ESOPHAGEAL DISORDERS,06,DISEASES AND DISORDERS OF THE DIGESTIVE SYSTEM,3,Major,Major,Medical,"Managed Care, Unspecified",,,,,Y,37388.26,10227.5
Finger Lakes,Monroe,2701003,000411,Rochester General Hospital,50 to 69,134,M,White,Not Span/Hispanic,7,Emergency,Home w/ Home Health Services,2020,DIG004,ESOPHAGEAL DISORDERS,GIS001,ESOPHAGOGASTRODUODENOSCOPY (EGD) WITH BIOPSY,242,MAJOR ESOPHAGEAL DISORDERS,06,DISEASES AND DISORDERS OF THE DIGESTIVE SYSTEM,2,Moderate,Major,Medical,Medicare,Medicaid,,,,Y,24710.62,11433.4
Capital/Adirond,Albany,0101000,000001,Albany Medical Center Hospital,50 to 69,129,M,Other Race,Unknown,7,Urgent,Court/Law Enforcement,2020,DIG004,ESOPHAGEAL DISORDERS,GIS001,ESOPHAGOGASTRODUODENOSCOPY (EGD) WITH BIOPSY,242,MAJOR ESOPHAGEAL DISORDERS,06,DISEASES AND DISORDERS OF THE DIGESTIVE SYSTEM,2,Moderate,Moderate,Medical,Department of Corrections,,,,,N,28693.48,10244.7
Capital/Adirond,Albany,0101000,000001,Albany Medical Center Hospital,50 to 69,122,F,Black/African American,Not Span/Hispanic,15,Emergency,Medicare Cert Long Term Care Hospital,2020,CIR039,OTHER SPECIFIED DISEASES OF VEINS AND LYMPHATICS,GIS027,"UPPER GI THERAPEUTIC PROCEDURES, NEC (ENDOSCOPIC)",242,MAJOR ESOPHAGEAL DISORDERS,06,DISEASES AND DISORDERS OF THE DIGESTIVE SYSTEM,3,Major,Major,Medical,Medicare,Medicaid,,,,Y,115333.97,32225.96
Finger Lakes,Monroe,2701003,000411,Rochester General Hospital,50 to 69,145,M,White,Not Span/Hispanic,3,Emergency,Home or Self Care,2020,DIG004,ESOPHAGEAL DISORDERS,GIS001,ESOPHAGOGASTRODUODENOSCOPY (EGD) WITH BIOPSY,242,MAJOR ESOPHAGEAL DISORDERS,06,DISEASES AND DISORDERS OF THE DIGESTIVE SYSTEM,2,Moderate,Moderate,Medical,Medicare,Medicaid,,,,Y,16963.63,7244.55
Finger Lakes,Monroe,2701003,000411,Rochester General Hospital,30 to 49,146,M,Other Race,Not Span/Hispanic,4,Emergency,Home or Self Care,2020,CIR039,OTHER SPECIFIED DISEASES OF VEINS AND LYMPHATICS,GIS027,"UPPER GI THERAPEUTIC PROCEDURES, NEC (ENDOSCOPIC)",242,MAJOR ESOPHAGEAL DISORDERS,06,DISEASES AND DISORDERS OF THE DIGESTIVE SYSTEM,3,Major,Moderate,Medical,Medicare,Medicaid,,,,Y,26046.22,10888.16
New York City,Bronx,7000006,001169,Montefiore Medical Center - Henry & Lucy Moses Div,18 to 29,OOS,F,White,Not Span/Hispanic,1,Emergency,Home or Self Care,2020,DIG004,ESOPHAGEAL DISORDERS,,,242,MAJOR ESOPHAGEAL DISORDERS,06,DISEASES AND DISORDERS OF THE DIGESTIVE SYSTEM,2,Moderate,Moderate,Medical,Private Health Insurance,,,,,Y,18231.61,3774.82
New York City,Manhattan,7002032,001466,Mount Sinai West,50 to 69,112,F,White,Not Span/Hispanic,23,Emergency,Home w/ Home Health Services,2020,DIG004,ESOPHAGEAL DISORDERS,GIS001,ESOPHAGOGASTRODUODENOSCOPY (EGD) WITH BIOPSY,242,MAJOR ESOPHAGEAL DISORDERS,06,DISEASES AND DISORDERS OF THE DIGESTIVE SYSTEM,3,Major,Major,Medical,Medicare,Private Health Insurance,Medicaid,,,Y,265732.15,61799.98
New York City,Manhattan,7002032,001469,Mount Sinai Morningside,50 to 69,104,F,Black/African American,Not Span/Hispanic,2,Emergency,Home or Self Care,2020,DIG004,ESOPHAGEAL DISORDERS,ADM021,"ADMINISTRATION OF THERAPEUTIC SUBSTANCES, NEC",242,MAJOR ESOPHAGEAL DISORDERS,06,DISEASES AND DISORDERS OF THE DIGESTIVE SYSTEM,2,Moderate,Minor,Medical,Medicaid,Medicaid,Self-Pay,,,N,22488.44,5190.5
New York City,Manhattan,7002032,001469,Mount Sinai Morningside,30 to 49,100,M,Black/African American,Not Span/Hispanic,1,Emergency,Home or Self Care,2020,DIG004,ESOPHAGEAL DISORDERS,IMG008,ULTRASONOGRAPHY,242,MAJOR ESOPHAGEAL DISORDERS,06,DISEASES AND DISORDERS OF THE DIGESTIVE SYSTEM,2,Moderate,Minor,Medical,Medicaid,Medicaid,Self-Pay,,,Y,16455.75,3907.85
New York City,Manhattan,7002032,001469,Mount Sinai Morningside,70 or Older,100,M,Other Race,Not Span/Hispanic,4,Emergency,Home or Self Care,2020,DIG004,ESOPHAGEAL DISORDERS,ADM001,TRANSFUSION OF BLOOD AND BLOOD PRODUCTS,242,MAJOR ESOPHAGEAL DISORDERS,06,DISEASES AND DISORDERS OF THE DIGESTIVE SYSTEM,3,Major,Major,Medical,Medicare,Blue Cross/Blue Shield,Self-Pay,,,Y,55954.87,12745.44
New York City,Manhattan,7002053,001463,NYU Langone Hospitals,50 to 69,119,F,White,Not Span/Hispanic,7,Emergency,Home w/ Home Health Services,2020,DIG004,ESOPHAGEAL DISORDERS,GIS001,ESOPHAGOGASTRODUODENOSCOPY (EGD) WITH BIOPSY,242,MAJOR ESOPHAGEAL DISORDERS,06,DISEASES AND DISORDERS OF THE DIGESTIVE SYSTEM,3,Major,Major,Medical,Medicare,Private Health Insurance,,,,Y,150226.12,37881.58