Hospital Service Area,Hospital County,Operating Certificate Number,Permanent Facility Id,Facility Name,Age Group,Zip Code - 3 digits,Gender,Race,Ethnicity,Length of Stay,Type of Admission,Patient Disposition,Discharge Year,CCS Diagnosis Code,CCS Diagnosis Description,CCS Procedure Code,CCS Procedure Description,APR DRG Code,APR DRG Description,APR MDC Code,APR MDC Description,APR Severity of Illness Code,APR Severity of Illness Description,APR Risk of Mortality,APR Medical Surgical Description,Payment Typology 1,Payment Typology 2,Payment Typology 3,Birth Weight,Abortion Edit Indicator,Emergency Department Indicator,Total Charges,Total Costs
Hudson Valley,Westchester,5904001,001072,Montefiore New Rochelle Hospital,70 or Older,108,F,White,Spanish/Hispanic,1,Emergency,Skilled Nursing Home,2017,138,Esophageal disorders,000,NO PROC,243,Other esophageal disorders,06,Diseases and Disorders of the Digestive System,2,Moderate,Moderate,Medical,Medicare,Medicare,Medicaid,,N,N,7335.00,3779.16
New York City,Bronx,7000006,001168,Montefiore Medical Center-Wakefield Hospital,50 to 69,104,F,Other Race,Spanish/Hispanic,1,Emergency,Home or Self Care,2017,138,Esophageal disorders,041,OT NON-OR THER PRC RESP,243,Other esophageal disorders,06,Diseases and Disorders of the Digestive System,1,Minor,Minor,Medical,Medicaid,,,,N,Y,18882.81,4729.34
New York City,Bronx,7000006,001169,Montefiore Medical Center - Henry & Lucy Moses Div,70 or Older,104,M,Other Race,Not Span/Hispanic,4,Emergency,Home or Self Care,2017,138,Esophageal disorders,070,UP GASTRO ENDOSC/BIOPSY,243,Other esophageal disorders,06,Diseases and Disorders of the Digestive System,3,Major,Moderate,Medical,Medicare,Private Health Insurance,,,N,Y,78168.67,22463.42
New York City,Bronx,7000006,003058,Montefiore Med Center - Jack D Weiler Hosp of A Einstein College Div,50 to 69,104,M,White,Not Span/Hispanic,1,Emergency,Home w/ Home Health Services,2017,138,Esophageal disorders,000,NO PROC,243,Other esophageal disorders,06,Diseases and Disorders of the Digestive System,3,Major,Moderate,Medical,Medicare,Private Health Insurance,,,N,Y,23413.26,5515.37
New York City,Kings,7001033,001315,Kingsbrook Jewish Medical Center,50 to 69,112,M,Black/African American,Not Span/Hispanic,1,Emergency,Home or Self Care,2017,138,Esophageal disorders,000,NO PROC,243,Other esophageal disorders,06,Diseases and Disorders of the Digestive System,2,Moderate,Minor,Medical,Private Health Insurance,Self-Pay,,,N,Y,13570.00,3545.08
New York City,Manhattan,7002024,001456,Mount Sinai Hospital,30 to 49,104,F,Black/African American,Not Span/Hispanic,4,Emergency,Home or Self Care,2017,138,Esophageal disorders,198,MAG RESONANCE IMAGING,243,Other esophageal disorders,06,Diseases and Disorders of the Digestive System,2,Moderate,Minor,Medical,Blue Cross/Blue Shield,Self-Pay,,,N,Y,34303.30,10740.23
New York City,Manhattan,7002032,001466,Mount Sinai West,70 or Older,100,M,White,Spanish/Hispanic,1,Elective,Home w/ Home Health Services,2017,138,Esophageal disorders,069,ESOPHAGEAL DILATATION,243,Other esophageal disorders,06,Diseases and Disorders of the Digestive System,3,Major,Major,Medical,Medicare,Blue Cross/Blue Shield,Self-Pay,,N,N,20177.60,7955.96
Hudson Valley,Orange,3523000,000699,Orange Regional Medical Center,50 to 69,109,M,White,Not Span/Hispanic,6,Emergency,Home or Self Care,2017,138,Esophageal disorders,070,UP GASTRO ENDOSC/BIOPSY,243,Other esophageal disorders,06,Diseases and Disorders of the Digestive System,1,Minor,Minor,Medical,Medicaid,,,,N,Y,45106.36,10534.51
Hudson Valley,Orange,3523000,000699,Orange Regional Medical Center,70 or Older,109,M,Other Race,Not Span/Hispanic,5,Emergency,Home or Self Care,2017,138,Esophageal disorders,070,UP GASTRO ENDOSC/BIOPSY,243,Other esophageal disorders,06,Diseases and Disorders of the Digestive System,2,Moderate,Moderate,Medical,Medicare,Medicaid,,,N,Y,48892.82,19491.42
New York City,Bronx,7000006,001168,Montefiore Medical Center-Wakefield Hospital,70 or Older,104,F,Black/African American,Not Span/Hispanic,1,Emergency,Home w/ Home Health Services,2017,138,Esophageal disorders,000,NO PROC,243,Other esophageal disorders,06,Diseases and Disorders of the Digestive System,2,Moderate,Moderate,Medical,Medicare,Medicaid,,,N,Y,24519.61,6240.24
New York City,Bronx,7000006,001169,Montefiore Medical Center - Henry & Lucy Moses Div,70 or Older,104,M,Black/African American,Not Span/Hispanic,6,Emergency,Home w/ Home Health Services,2017,138,Esophageal disorders,070,UP GASTRO ENDOSC/BIOPSY,243,Other esophageal disorders,06,Diseases and Disorders of the Digestive System,2,Moderate,Moderate,Medical,Medicare,Medicaid,,,N,Y,60225.31,13879.32
New York City,Bronx,7000006,001169,Montefiore Medical Center - Henry & Lucy Moses Div,70 or Older,104,M,Other Race,Spanish/Hispanic,2,Emergency,Home or Self Care,2017,138,Esophageal disorders,000,NO PROC,243,Other esophageal disorders,06,Diseases and Disorders of the Digestive System,2,Moderate,Moderate,Medical,Medicare,Medicaid,,,N,Y,22735.56,4774.93
New York City,Bronx,7000006,001169,Montefiore Medical Center - Henry & Lucy Moses Div,50 to 69,104,F,Other Race,Not Span/Hispanic,1,Emergency,Home or Self Care,2017,138,Esophageal disorders,231,OTHER THERAPEUTIC PRCS,243,Other esophageal disorders,06,Diseases and Disorders of the Digestive System,1,Minor,Minor,Medical,Private Health Insurance,,,,N,Y,12954.20,2576.35
New York City,Bronx,7000006,001169,Montefiore Medical Center - Henry & Lucy Moses Div,70 or Older,104,M,Black/African American,Not Span/Hispanic,1,Emergency,Home or Self Care,2017,138,Esophageal disorders,000,NO PROC,243,Other esophageal disorders,06,Diseases and Disorders of the Digestive System,2,Moderate,Moderate,Medical,Medicare,,,,N,Y,19383.01,4909.33
New York City,Bronx,7000006,001169,Montefiore Medical Center - Henry & Lucy Moses Div,30 to 49,100,M,Black/African American,Not Span/Hispanic,3,Emergency,Home or Self Care,2017,138,Esophageal disorders,000,NO PROC,243,Other esophageal disorders,06,Diseases and Disorders of the Digestive System,2,Moderate,Minor,Medical,Medicare,Medicaid,,,N,Y,37177.01,6194.09
New York City,Bronx,7000006,003058,Montefiore Med Center - Jack D Weiler Hosp of A Einstein College Div,70 or Older,104,M,Black/African American,Not Span/Hispanic,4,Emergency,Home or Self Care,2017,138,Esophageal disorders,000,NO PROC,243,Other esophageal disorders,06,Diseases and Disorders of the Digestive System,1,Minor,Moderate,Medical,Medicare,,,,N,Y,31759.25,6688.05
New York City,Bronx,7000006,003058,Montefiore Med Center - Jack D Weiler Hosp of A Einstein College Div,50 to 69,104,F,White,Not Span/Hispanic,1,Emergency,Home or Self Care,2017,138,Esophageal disorders,000,NO PROC,243,Other esophageal disorders,06,Diseases and Disorders of the Digestive System,1,Minor,Minor,Medical,Blue Cross/Blue Shield,,,,N,Y,18610.89,4787.03
New York City,Manhattan,7002002,001439,Mount Sinai Beth Israel,70 or Older,113,M,Other Race,Not Span/Hispanic,3,Emergency,Home w/ Home Health Services,2017,138,Esophageal disorders,070,UP GASTRO ENDOSC/BIOPSY,243,Other esophageal disorders,06,Diseases and Disorders of the Digestive System,2,Moderate,Moderate,Medical,Medicare,Medicaid,Self-Pay,,N,Y,38052.76,12093.48
New York City,Manhattan,7002024,001456,Mount Sinai Hospital,50 to 69,112,F,Other Race,Not Span/Hispanic,2,Emergency,Home or Self Care,2017,138,Esophageal disorders,070,UP GASTRO ENDOSC/BIOPSY,243,Other esophageal disorders,06,Diseases and Disorders of the Digestive System,3,Major,Moderate,Medical,Medicaid,Medicaid,Self-Pay,,N,Y,25572.85,8971.61
New York City,Manhattan,7002032,001466,Mount Sinai West,50 to 69,100,M,White,Not Span/Hispanic,2,Emergency,Home or Self Care,2017,138,Esophageal disorders,069,ESOPHAGEAL DILATATION,243,Other esophageal disorders,06,Diseases and Disorders of the Digestive System,2,Moderate,Minor,Medical,Medicare,Self-Pay,,,N,Y,24437.51,8010.59
Hudson Valley,Westchester,5904001,001072,Montefiore New Rochelle Hospital,70 or Older,108,M,Black/African American,Unknown,1,Emergency,Home or Self Care,2017,138,Esophageal disorders,000,NO PROC,243,Other esophageal disorders,06,Diseases and Disorders of the Digestive System,2,Moderate,Moderate,Medical,Medicare,Medicare,Self-Pay,,N,N,7275.00,3844.97
New York City,Bronx,7000006,001169,Montefiore Medical Center - Henry & Lucy Moses Div,70 or Older,104,M,Black/African American,Not Span/Hispanic,1,Emergency,Home or Self Care,2017,138,Esophageal disorders,000,NO PROC,243,Other esophageal disorders,06,Diseases and Disorders of the Digestive System,2,Moderate,Moderate,Medical,Medicare,Medicaid,,,N,Y,20913.78,2876.38
New York City,Bronx,7000006,001169,Montefiore Medical Center - Henry & Lucy Moses Div,50 to 69,104,M,Other Race,Not Span/Hispanic,5,Emergency,Home or Self Care,2017,138,Esophageal disorders,222,BLOOD TRANSFUSION,243,Other esophageal disorders,06,Diseases and Disorders of the Digestive System,2,Moderate,Moderate,Medical,Medicaid,,,,N,Y,71939.01,12449.73
New York City,Bronx,7000006,003058,Montefiore Med Center - Jack D Weiler Hosp of A Einstein College Div,50 to 69,104,F,Black/African American,Not Span/Hispanic,2,Emergency,Home w/ Home Health Services,2017,138,Esophageal disorders,183,ROUTINE CHEST X-RAY,243,Other esophageal disorders,06,Diseases and Disorders of the Digestive System,2,Moderate,Moderate,Medical,Medicare,Medicaid,,,N,Y,32838.02,9245.38
New York City,Kings,7001003,001288,Brooklyn Hospital Center - Downtown Campus,0 to 17,104,F,Other Race,Unknown,3,Emergency,Home or Self Care,2017,138,Esophageal disorders,000,NO PROC,243,Other esophageal disorders,06,Diseases and Disorders of the Digestive System,1,Minor,Minor,Medical,Medicaid,Medicaid,Self-Pay,03000,N,N,20522.53,4003.44
New York City,Kings,7001037,001320,University Hospital of Brooklyn,50 to 69,112,F,Black/African American,Not Span/Hispanic,1,Emergency,Home or Self Care,2017,138,Esophageal disorders,203,ELECTROGR CARDIAC MONIT,243,Other esophageal disorders,06,Diseases and Disorders of the Digestive System,1,Minor,Minor,Medical,Blue Cross/Blue Shield,Self-Pay,,,N,Y,6146.00,4119.19
New York City,Manhattan,7002024,001456,Mount Sinai Hospital,50 to 69,104,M,Black/African American,Not Span/Hispanic,3,Urgent,Home or Self Care,2017,138,Esophageal disorders,070,UP GASTRO ENDOSC/BIOPSY,243,Other esophageal disorders,06,Diseases and Disorders of the Digestive System,3,Major,Moderate,Medical,Medicare,Medicaid,Self-Pay,,N,N,28562.58,9659.66
New York City,Manhattan,7002053,001463,NYU Langone Hospitals,50 to 69,104,F,Black/African American,Not Span/Hispanic,6,Elective,Home or Self Care,2017,138,Esophageal disorders,070,UP GASTRO ENDOSC/BIOPSY,243,Other esophageal disorders,06,Diseases and Disorders of the Digestive System,2,Moderate,Minor,Medical,Medicare,,,,N,N,87351.79,24443.74
Long Island,Nassau,2950002,000528,Nassau University Medical Center,50 to 69,115,M,White,Not Span/Hispanic,16,Emergency,Skilled Nursing Home,2017,138,Esophageal disorders,098,OT NON-OR GI THER PRCS,243,Other esophageal disorders,06,Diseases and Disorders of the Digestive System,3,Major,Major,Medical,Medicare,Medicaid,Self-Pay,,N,Y,105134.53,60374.47
Long Island,Nassau,2950002,000528,Nassau University Medical Center,50 to 69,117,M,White,Not Span/Hispanic,3,Emergency,Home or Self Care,2017,138,Esophageal disorders,219,ALCO/DRUG REHAB/DETOX,243,Other esophageal disorders,06,Diseases and Disorders of the Digestive System,2,Moderate,Moderate,Medical,Medicare,Self-Pay,,,N,N,20431.65,7022.40
Long Island,Nassau,2950002,000528,Nassau University Medical Center,70 or Older,117,M,White,Not Span/Hispanic,1,Emergency,Home or Self Care,2017,138,Esophageal disorders,070,UP GASTRO ENDOSC/BIOPSY,243,Other esophageal disorders,06,Diseases and Disorders of the Digestive System,2,Moderate,Moderate,Medical,Medicare,Blue Cross/Blue Shield,Self-Pay,,N,N,8275.98,2772.36
Long Island,Nassau,2950002,000528,Nassau University Medical Center,18 to 29,115,F,White,Not Span/Hispanic,2,Emergency,Left Against Medical Advice,2017,138,Esophageal disorders,202,ELECTROCARDIOGRAM,243,Other esophageal disorders,06,Diseases and Disorders of the Digestive System,1,Minor,Minor,Medical,Medicaid,Medicaid,Self-Pay,,N,N,10926.94,3998.95
Long Island,Nassau,2950002,000528,Nassau University Medical Center,50 to 69,115,F,Black/African American,Not Span/Hispanic,3,Emergency,Home w/ Home Health Services,2017,138,Esophageal disorders,000,NO PROC,243,Other esophageal disorders,06,Diseases and Disorders of the Digestive System,1,Minor,Moderate,Medical,Medicare,Medicaid,Self-Pay,,N,N,20447.17,8604.84
New York City,Kings,7001008,001293,"New York Community Hospital of Brooklyn, Inc",50 to 69,112,M,Black/African American,Not Span/Hispanic,3,Emergency,Home or Self Care,2017,138,Esophageal disorders,227,"OT DX PRC (INTERVW,EVAL",243,Other esophageal disorders,06,Diseases and Disorders of the Digestive System,2,Moderate,Minor,Medical,Medicaid,Self-Pay,,,N,Y,12445.85,5660.93
New York City,Kings,7001008,001293,"New York Community Hospital of Brooklyn, Inc",70 or Older,112,F,White,Not Span/Hispanic,5,Emergency,Home or Self Care,2017,138,Esophageal disorders,202,ELECTROCARDIOGRAM,243,Other esophageal disorders,06,Diseases and Disorders of the Digestive System,3,Major,Moderate,Medical,Medicare,Medicare,Self-Pay,,N,Y,15091.46,7052.25
New York City,Kings,7001021,001306,New York - Presbyterian Brooklyn Methodist Hospital,50 to 69,112,F,Black/African American,Not Span/Hispanic,9,Emergency,Home or Self Care,2017,138,Esophageal disorders,222,BLOOD TRANSFUSION,243,Other esophageal disorders,06,Diseases and Disorders of the Digestive System,3,Major,Moderate,Medical,Medicaid,Medicaid,Self-Pay,,N,Y,50606.11,16652.79
New York City,Kings,7001021,001306,New York - Presbyterian Brooklyn Methodist Hospital,70 or Older,114,F,Black/African American,Not Span/Hispanic,1,Emergency,Home or Self Care,2017,138,Esophageal disorders,000,NO PROC,243,Other esophageal disorders,06,Diseases and Disorders of the Digestive System,2,Moderate,Moderate,Medical,Medicare,Medicare,Medicaid,,N,Y,10598.70,2694.46
New York City,Kings,7001021,001306,New York - Presbyterian Brooklyn Methodist Hospital,70 or Older,112,F,Black/African American,Not Span/Hispanic,1,Emergency,Home or Self Care,2017,138,Esophageal disorders,000,NO PROC,243,Other esophageal disorders,06,Diseases and Disorders of the Digestive System,1,Minor,Minor,Medical,Medicare,Medicare,Medicaid,,N,Y,11887.21,3006.85
New York City,Kings,7001021,001306,New York - Presbyterian Brooklyn Methodist Hospital,50 to 69,112,M,Other Race,Not Span/Hispanic,3,Emergency,Home or Self Care,2017,138,Esophageal disorders,000,NO PROC,243,Other esophageal disorders,06,Diseases and Disorders of the Digestive System,2,Moderate,Minor,Medical,Medicare,Medicare,Medicaid,,N,Y,20938.60,5619.94
New York City,Kings,7001021,001306,New York - Presbyterian Brooklyn Methodist Hospital,70 or Older,112,F,White,Spanish/Hispanic,1,Emergency,Left Against Medical Advice,2017,138,Esophageal disorders,000,NO PROC,243,Other esophageal disorders,06,Diseases and Disorders of the Digestive System,2,Moderate,Moderate,Medical,Medicare,Medicare,Medicaid,,N,Y,14582.96,3476.38
New York City,Kings,7001021,001306,New York - Presbyterian Brooklyn Methodist Hospital,50 to 69,112,F,Black/African American,Not Span/Hispanic,3,Emergency,Home or Self Care,2017,138,Esophageal disorders,000,NO PROC,243,Other esophageal disorders,06,Diseases and Disorders of the Digestive System,3,Major,Moderate,Medical,Medicare,Medicare,Self-Pay,,N,Y,17722.05,5242.90
New York City,Kings,7001021,001306,New York - Presbyterian Brooklyn Methodist Hospital,50 to 69,112,F,Black/African American,Not Span/Hispanic,4,Emergency,Home or Self Care,2017,138,Esophageal disorders,054,OT VASC CATH; NOT HEART,243,Other esophageal disorders,06,Diseases and Disorders of the Digestive System,3,Major,Moderate,Medical,Medicaid,Medicaid,Self-Pay,,N,Y,24281.09,7676.36
New York City,Kings,7001021,001306,New York - Presbyterian Brooklyn Methodist Hospital,70 or Older,112,F,Other Race,Not Span/Hispanic,3,Emergency,Skilled Nursing Home,2017,138,Esophageal disorders,000,NO PROC,243,Other esophageal disorders,06,Diseases and Disorders of the Digestive System,2,Moderate,Moderate,Medical,Medicaid,Medicaid,Self-Pay,,N,Y,18618.18,5614.61
New York City,Kings,7001021,001306,New York - Presbyterian Brooklyn Methodist Hospital,50 to 69,112,F,Other Race,Not Span/Hispanic,6,Emergency,Home or Self Care,2017,138,Esophageal disorders,058,HEMODIALYSIS,243,Other esophageal disorders,06,Diseases and Disorders of the Digestive System,2,Moderate,Moderate,Medical,Medicaid,Medicaid,Self-Pay,,N,Y,45875.30,13761.12
New York City,Manhattan,7002054,001437,New York-Presbyterian/Lower Manhattan Hospital,50 to 69,,M,White,Multi-ethnic,2,Emergency,Home or Self Care,2017,138,Esophageal disorders,070,UP GASTRO ENDOSC/BIOPSY,243,Other esophageal disorders,06,Diseases and Disorders of the Digestive System,2,Moderate,Moderate,Medical,Blue Cross/Blue Shield,Self-Pay,,,N,Y,28142.06,7532.58
New York City,Manhattan,7002002,001439,Mount Sinai Beth Israel,70 or Older,112,M,Black/African American,Not Span/Hispanic,2,Emergency,Home or Self Care,2017,138,Esophageal disorders,070,UP GASTRO ENDOSC/BIOPSY,243,Other esophageal disorders,06,Diseases and Disorders of the Digestive System,2,Moderate,Moderate,Medical,Medicare,Miscellaneous/Other,Self-Pay,,N,Y,19723.78,6253.94
New York City,Manhattan,7002024,001456,Mount Sinai Hospital,70 or Older,100,M,White,Not Span/Hispanic,4,Elective,Home or Self Care,2017,138,Esophageal disorders,093,OT NON-OR UP GI THER PR,243,Other esophageal disorders,06,Diseases and Disorders of the Digestive System,2,Moderate,Moderate,Medical,Medicare,Medicare,Self-Pay,,N,N,38307.93,14711.00
New York City,Manhattan,7002054,001464,New York Presbyterian Hospital - Columbia Presbyterian Center,50 to 69,OOS,F,White,Not Span/Hispanic,6,Urgent,Home or Self Care,2017,138,Esophageal disorders,000,NO PROC,243,Other esophageal disorders,06,Diseases and Disorders of the Digestive System,3,Major,Minor,Medical,Private Health Insurance,Self-Pay,,,N,N,62489.96,16439.22
New York City,Manhattan,7002054,001464,New York Presbyterian Hospital - Columbia Presbyterian Center,50 to 69,OOS,F,White,Spanish/Hispanic,7,Urgent,Home w/ Home Health Services,2017,138,Esophageal disorders,070,UP GASTRO ENDOSC/BIOPSY,243,Other esophageal disorders,06,Diseases and Disorders of the Digestive System,2,Moderate,Moderate,Medical,Private Health Insurance,Self-Pay,,,N,N,85247.04,22976.94
New York City,Manhattan,7002054,001464,New York Presbyterian Hospital - Columbia Presbyterian Center,50 to 69,100,M,Other Race,Multi-ethnic,13,Emergency,Skilled Nursing Home,2017,138,Esophageal disorders,047,DX CARDIAC CATHETERIZTN,243,Other esophageal disorders,06,Diseases and Disorders of the Digestive System,3,Major,Moderate,Medical,Medicare,Medicare,Self-Pay,,N,Y,143520.62,37051.22
New York City,Manhattan,7002054,001464,New York Presbyterian Hospital - Columbia Presbyterian Center,70 or Older,104,F,Other Race,Not Span/Hispanic,13,Emergency,Skilled Nursing Home,2017,138,Esophageal disorders,071,GASTROSTOMY; TEMP/PERM,243,Other esophageal disorders,06,Diseases and Disorders of the Digestive System,4,Extreme,Major,Medical,Medicare,Medicare,Self-Pay,,N,Y,129113.04,32722.12
New York City,Manhattan,7002054,001464,New York Presbyterian Hospital - Columbia Presbyterian Center,0 to 17,OOS,M,White,Spanish/Hispanic,5,Emergency,Home or Self Care,2017,138,Esophageal disorders,000,NO PROC,243,Other esophageal disorders,06,Diseases and Disorders of the Digestive System,2,Moderate,Minor,Medical,Blue Cross/Blue Shield,Self-Pay,,,N,Y,47744.62,13411.30
New York City,Manhattan,7002054,001464,New York Presbyterian Hospital - Columbia Presbyterian Center,50 to 69,100,M,Multi-racial,Multi-ethnic,4,Emergency,Home or Self Care,2017,138,Esophageal disorders,058,HEMODIALYSIS,243,Other esophageal disorders,06,Diseases and Disorders of the Digestive System,3,Major,Moderate,Medical,Medicare,Medicare,Medicaid,,N,Y,49698.59,13904.15
New York City,Manhattan,7002032,001466,Mount Sinai West,18 to 29,OOS,F,Other Race,Not Span/Hispanic,2,Emergency,Home or Self Care,2017,138,Esophageal disorders,070,UP GASTRO ENDOSC/BIOPSY,243,Other esophageal disorders,06,Diseases and Disorders of the Digestive System,2,Moderate,Moderate,Medical,Private Health Insurance,Self-Pay,,,N,Y,26272.72,9724.90
New York City,Manhattan,7002032,001466,Mount Sinai West,50 to 69,100,M,Black/African American,Spanish/Hispanic,3,Emergency,Home or Self Care,2017,138,Esophageal disorders,031,DX PRCS ON NOSE & MOUTH,243,Other esophageal disorders,06,Diseases and Disorders of the Digestive System,2,Moderate,Minor,Medical,Medicare,Medicare,Medicaid,,N,Y,27926.16,9372.42
New York City,Manhattan,7002032,001469,Mount Sinai St. Luke's,30 to 49,100,F,Black/African American,Spanish/Hispanic,11,Emergency,Home or Self Care,2017,138,Esophageal disorders,092,OTHER BOWEL DX PRCS,243,Other esophageal disorders,06,Diseases and Disorders of the Digestive System,2,Moderate,Minor,Medical,Medicaid,Self-Pay,,,N,Y,102742.66,30276.62
New York City,Manhattan,7002054,003975,New York Presbyterian Hospital - Allen Hospital,70 or Older,104,F,Multi-racial,Not Span/Hispanic,2,Emergency,Home or Self Care,2017,138,Esophageal disorders,000,NO PROC,243,Other esophageal disorders,06,Diseases and Disorders of the Digestive System,3,Major,Major,Medical,Medicare,Blue Cross/Blue Shield,Self-Pay,,N,Y,24713.05,6168.45
New York City,Queens,7003010,001637,New York - Presbyterian/Queens,70 or Older,114,M,White,Not Span/Hispanic,5,Emergency,Home or Self Care,2017,138,Esophageal disorders,069,ESOPHAGEAL DILATATION,243,Other esophageal disorders,06,Diseases and Disorders of the Digestive System,2,Moderate,Moderate,Medical,Medicare,Blue Cross/Blue Shield,Self-Pay,,N,Y,38151.61,11816.59
New York City,Queens,7003010,001637,New York - Presbyterian/Queens,70 or Older,113,F,Other Race,Not Span/Hispanic,6,Emergency,Skilled Nursing Home,2017,138,Esophageal disorders,093,OT NON-OR UP GI THER PR,243,Other esophageal disorders,06,Diseases and Disorders of the Digestive System,3,Major,Major,Medical,Medicaid,Medicaid,Self-Pay,,N,Y,42741.92,13192.44
Central NY,Onondaga,3301008,000636,Crouse Hospital,70 or Older,130,M,Other Race,Not Span/Hispanic,4,Emergency,Home w/ Home Health Services,2017,138,Esophageal disorders,222,BLOOD TRANSFUSION,243,Other esophageal disorders,06,Diseases and Disorders of the Digestive System,3,Major,Major,Medical,Medicare,,,,N,N,16983.86,7502.27
Hudson Valley,Rockland,4329000,000779,Good Samaritan Hospital of Suffern,50 to 69,109,M,Black/African American,Not Span/Hispanic,6,Emergency,Home or Self Care,2017,138,Esophageal disorders,070,UP GASTRO ENDOSC/BIOPSY,243,Other esophageal disorders,06,Diseases and Disorders of the Digestive System,3,Major,Moderate,Medical,Medicare,,,,N,Y,64069.37,12264.03
Hudson Valley,Rockland,4329000,000779,Good Samaritan Hospital of Suffern,50 to 69,109,M,White,Not Span/Hispanic,2,Emergency,Home or Self Care,2017,138,Esophageal disorders,047,DX CARDIAC CATHETERIZTN,243,Other esophageal disorders,06,Diseases and Disorders of the Digestive System,2,Moderate,Moderate,Medical,Private Health Insurance,,,,N,Y,55095.68,8916.65
Hudson Valley,Rockland,4329000,000779,Good Samaritan Hospital of Suffern,50 to 69,109,M,Black/African American,Not Span/Hispanic,4,Emergency,Home or Self Care,2017,138,Esophageal disorders,000,NO PROC,243,Other esophageal disorders,06,Diseases and Disorders of the Digestive System,2,Moderate,Moderate,Medical,Medicare,,,,N,Y,41460.02,11237.88
Hudson Valley,Rockland,4329000,000779,Good Samaritan Hospital of Suffern,70 or Older,109,M,White,Not Span/Hispanic,4,Emergency,Facility w/ Custodial/Supportive Care,2017,138,Esophageal disorders,098,OT NON-OR GI THER PRCS,243,Other esophageal disorders,06,Diseases and Disorders of the Digestive System,2,Moderate,Moderate,Medical,Medicare,Medicaid,,,N,Y,89391.21,14882.20