Hospital Service Area,Hospital County,Operating Certificate Number,Permanent Facility Id,Facility Name,Age Group,Zip Code - 3 digits,Gender,Race,Ethnicity,Length of Stay,Type of Admission,Patient Disposition,Discharge Year,CCS Diagnosis Code,CCS Diagnosis Description,CCS Procedure Code,CCS Procedure Description,APR DRG Code,APR DRG Description,APR MDC Code,APR MDC Description,APR Severity of Illness Code,APR Severity of Illness Description,APR Risk of Mortality,APR Medical Surgical Description,Payment Typology 1,Payment Typology 2,Payment Typology 3,Birth Weight,Abortion Edit Indicator,Emergency Department Indicator,Total Charges,Total Costs
New York City,Manhattan,7002001,001438,Bellevue Hospital Center,50 to 69,100,M,Other Race,Not Span/Hispanic,2,Emergency,Home or Self Care,2017,138,Esophageal disorders,070,UP GASTRO ENDOSC/BIOPSY,243,Other esophageal disorders,06,Diseases and Disorders of the Digestive System,2,Moderate,Minor,Medical,Medicaid,,,,N,Y,14233.68,9177.14
New York City,Manhattan,7002001,001438,Bellevue Hospital Center,50 to 69,100,M,Other Race,Not Span/Hispanic,1,Emergency,Left Against Medical Advice,2017,138,Esophageal disorders,000,NO PROC,243,Other esophageal disorders,06,Diseases and Disorders of the Digestive System,1,Minor,Minor,Medical,Medicaid,,,,N,Y,7737.88,4988.98
New York City,Manhattan,7002001,001438,Bellevue Hospital Center,30 to 49,114,M,Other Race,Not Span/Hispanic,1,Emergency,Left Against Medical Advice,2017,138,Esophageal disorders,000,NO PROC,243,Other esophageal disorders,06,Diseases and Disorders of the Digestive System,1,Minor,Minor,Medical,Medicaid,Medicaid,,,N,N,6802.99,4386.21
New York City,Manhattan,7002001,001438,Bellevue Hospital Center,50 to 69,113,M,Other Race,Not Span/Hispanic,1,Emergency,Home or Self Care,2017,138,Esophageal disorders,070,UP GASTRO ENDOSC/BIOPSY,243,Other esophageal disorders,06,Diseases and Disorders of the Digestive System,1,Minor,Minor,Medical,Self-Pay,,,,N,Y,7479.02,4822.08
New York City,Manhattan,7002001,001438,Bellevue Hospital Center,50 to 69,100,F,Other Race,Spanish/Hispanic,8,Emergency,Home or Self Care,2017,138,Esophageal disorders,070,UP GASTRO ENDOSC/BIOPSY,243,Other esophageal disorders,06,Diseases and Disorders of the Digestive System,2,Moderate,Minor,Medical,Medicaid,Medicaid,,,N,Y,44175.65,28482.16
New York City,Manhattan,7002001,001438,Bellevue Hospital Center,0 to 17,112,F,Other Race,Not Span/Hispanic,1,Emergency,Home or Self Care,2017,138,Esophageal disorders,199,ELECTROENCEPHALOGRAM,243,Other esophageal disorders,06,Diseases and Disorders of the Digestive System,1,Minor,Minor,Medical,Medicaid,Medicaid,,04100,N,Y,8389.90,5409.37
New York City,Manhattan,7002001,001438,Bellevue Hospital Center,30 to 49,100,M,Black/African American,Not Span/Hispanic,1,Emergency,Home or Self Care,2017,138,Esophageal disorders,070,UP GASTRO ENDOSC/BIOPSY,243,Other esophageal disorders,06,Diseases and Disorders of the Digestive System,1,Minor,Minor,Medical,Medicaid,Medicaid,,,N,Y,7596.43,4897.78
New York City,Manhattan,7002001,001438,Bellevue Hospital Center,70 or Older,114,M,Black/African American,Not Span/Hispanic,2,Emergency,Home or Self Care,2017,138,Esophageal disorders,000,NO PROC,243,Other esophageal disorders,06,Diseases and Disorders of the Digestive System,1,Minor,Minor,Medical,Medicaid,Medicaid,,,N,N,12810.96,8259.84
New York City,Manhattan,7002001,001438,Bellevue Hospital Center,50 to 69,104,M,Other Race,Spanish/Hispanic,4,Emergency,Home or Self Care,2017,138,Esophageal disorders,000,NO PROC,243,Other esophageal disorders,06,Diseases and Disorders of the Digestive System,2,Moderate,Moderate,Medical,Medicare,Medicare,Medicaid,,N,N,32149.02,20728.02
New York City,Manhattan,7002001,001438,Bellevue Hospital Center,50 to 69,113,F,Other Race,Not Span/Hispanic,2,Emergency,Home or Self Care,2017,138,Esophageal disorders,070,UP GASTRO ENDOSC/BIOPSY,243,Other esophageal disorders,06,Diseases and Disorders of the Digestive System,1,Minor,Minor,Medical,Self-Pay,,,,N,Y,14200.45,9155.71
New York City,Manhattan,7002001,001438,Bellevue Hospital Center,50 to 69,112,M,Black/African American,Not Span/Hispanic,1,Emergency,Home or Self Care,2017,138,Esophageal disorders,000,NO PROC,243,Other esophageal disorders,06,Diseases and Disorders of the Digestive System,2,Moderate,Minor,Medical,Medicaid,,,,N,Y,7242.68,4669.70
New York City,Manhattan,7002001,001438,Bellevue Hospital Center,50 to 69,100,M,White,Not Span/Hispanic,9,Emergency,Home or Self Care,2017,138,Esophageal disorders,098,OT NON-OR GI THER PRCS,243,Other esophageal disorders,06,Diseases and Disorders of the Digestive System,3,Major,Extreme,Medical,Medicare,Medicare,Medicaid,,N,Y,60394.25,38939.07
New York City,Manhattan,7002001,001438,Bellevue Hospital Center,30 to 49,114,M,Black/African American,Not Span/Hispanic,8,Emergency,Home or Self Care,2017,138,Esophageal disorders,193,DX ULTRASOUND HEART,243,Other esophageal disorders,06,Diseases and Disorders of the Digestive System,3,Major,Moderate,Medical,Medicare,,,,N,N,44845.00,28913.72
New York City,Manhattan,7002001,001438,Bellevue Hospital Center,30 to 49,113,M,Other Race,Not Span/Hispanic,2,Emergency,Home or Self Care,2017,138,Esophageal disorders,070,UP GASTRO ENDOSC/BIOPSY,243,Other esophageal disorders,06,Diseases and Disorders of the Digestive System,1,Minor,Minor,Medical,Private Health Insurance,Medicaid,,,N,N,12840.79,8279.07
New York City,Manhattan,7002001,001438,Bellevue Hospital Center,50 to 69,104,M,Black/African American,Not Span/Hispanic,2,Emergency,Home or Self Care,2017,138,Esophageal disorders,000,NO PROC,243,Other esophageal disorders,06,Diseases and Disorders of the Digestive System,1,Minor,Minor,Medical,Medicaid,Medicaid,,,N,Y,16152.53,10414.31
New York City,Manhattan,7002001,001438,Bellevue Hospital Center,30 to 49,113,M,Black/African American,Not Span/Hispanic,1,Emergency,Home or Self Care,2017,138,Esophageal disorders,070,UP GASTRO ENDOSC/BIOPSY,243,Other esophageal disorders,06,Diseases and Disorders of the Digestive System,1,Minor,Minor,Medical,Department of Corrections,,,,N,N,6649.00,4286.93
New York City,Manhattan,7002001,001438,Bellevue Hospital Center,18 to 29,113,M,Other Race,Not Span/Hispanic,1,Emergency,Home or Self Care,2017,138,Esophageal disorders,222,BLOOD TRANSFUSION,243,Other esophageal disorders,06,Diseases and Disorders of the Digestive System,3,Major,Moderate,Medical,Medicaid,,,,N,Y,9474.58,6108.72
New York City,Manhattan,7002001,001438,Bellevue Hospital Center,30 to 49,104,M,Black/African American,Not Span/Hispanic,1,Emergency,Home or Self Care,2017,138,Esophageal disorders,000,NO PROC,243,Other esophageal disorders,06,Diseases and Disorders of the Digestive System,1,Minor,Minor,Medical,Private Health Insurance,,,,N,Y,7231.06,4662.21
New York City,Manhattan,7002001,001438,Bellevue Hospital Center,70 or Older,114,F,Other Race,Spanish/Hispanic,4,Emergency,Home or Self Care,2017,138,Esophageal disorders,047,DX CARDIAC CATHETERIZTN,243,Other esophageal disorders,06,Diseases and Disorders of the Digestive System,3,Major,Extreme,Medical,Medicare,Medicare,Medicaid,,N,N,34660.77,22347.46
New York City,Manhattan,7002001,001438,Bellevue Hospital Center,70 or Older,112,M,Other Race,Not Span/Hispanic,1,Emergency,Home or Self Care,2017,138,Esophageal disorders,229,NONOP RMVL FOREIGN BODY,243,Other esophageal disorders,06,Diseases and Disorders of the Digestive System,2,Moderate,Minor,Medical,Medicare,Medicaid,,,N,Y,7905.91,5097.32
New York City,Manhattan,7002001,001438,Bellevue Hospital Center,30 to 49,112,M,Black/African American,Not Span/Hispanic,24,Emergency,Short-term Hospital,2017,138,Esophageal disorders,092,OTHER BOWEL DX PRCS,243,Other esophageal disorders,06,Diseases and Disorders of the Digestive System,3,Major,Major,Medical,Medicaid,,,,N,N,127251.75,82045.31
New York City,Manhattan,7002001,001438,Bellevue Hospital Center,50 to 69,113,M,Other Race,Not Span/Hispanic,1,Emergency,Home or Self Care,2017,138,Esophageal disorders,070,UP GASTRO ENDOSC/BIOPSY,243,Other esophageal disorders,06,Diseases and Disorders of the Digestive System,1,Minor,Minor,Medical,Department of Corrections,,,,N,N,6428.57,4144.81
New York City,Manhattan,7002001,001438,Bellevue Hospital Center,50 to 69,113,M,Other Race,Not Span/Hispanic,1,Emergency,Home or Self Care,2017,138,Esophageal disorders,222,BLOOD TRANSFUSION,243,Other esophageal disorders,06,Diseases and Disorders of the Digestive System,2,Moderate,Minor,Medical,Medicare,Private Health Insurance,Medicaid,,N,Y,7294.65,4703.21
New York City,Manhattan,7002001,001438,Bellevue Hospital Center,30 to 49,100,M,Other Race,Not Span/Hispanic,1,Emergency,Home or Self Care,2017,138,Esophageal disorders,070,UP GASTRO ENDOSC/BIOPSY,243,Other esophageal disorders,06,Diseases and Disorders of the Digestive System,2,Moderate,Minor,Medical,Medicaid,,,,N,Y,7321.19,4720.32
New York City,Manhattan,7002001,001438,Bellevue Hospital Center,30 to 49,104,F,Other Race,Not Span/Hispanic,2,Emergency,Home or Self Care,2017,138,Esophageal disorders,231,OTHER THERAPEUTIC PRCS,243,Other esophageal disorders,06,Diseases and Disorders of the Digestive System,1,Minor,Minor,Medical,Medicaid,Medicaid,,,N,Y,13382.59,8628.40
New York City,Manhattan,7002001,001438,Bellevue Hospital Center,18 to 29,112,M,Black/African American,Not Span/Hispanic,4,Emergency,Home or Self Care,2017,138,Esophageal disorders,179,CT SCAN ABDOMEN,243,Other esophageal disorders,06,Diseases and Disorders of the Digestive System,1,Minor,Minor,Medical,Medicaid,,,,N,Y,24394.48,15728.29
New York City,Manhattan,7002001,001438,Bellevue Hospital Center,50 to 69,OOS,M,White,Not Span/Hispanic,4,Emergency,Home or Self Care,2017,138,Esophageal disorders,098,OT NON-OR GI THER PRCS,243,Other esophageal disorders,06,Diseases and Disorders of the Digestive System,2,Moderate,Moderate,Medical,Private Health Insurance,,,,N,Y,31932.27,20588.27
New York City,Manhattan,7002001,001438,Bellevue Hospital Center,30 to 49,113,F,Other Race,Not Span/Hispanic,4,Emergency,Home or Self Care,2017,138,Esophageal disorders,179,CT SCAN ABDOMEN,243,Other esophageal disorders,06,Diseases and Disorders of the Digestive System,2,Moderate,Minor,Medical,Medicaid,Medicaid,,,N,Y,26182.68,16881.23
New York City,Manhattan,7002001,001438,Bellevue Hospital Center,50 to 69,100,F,Other Race,Not Span/Hispanic,2,Emergency,Home or Self Care,2017,138,Esophageal disorders,229,NONOP RMVL FOREIGN BODY,243,Other esophageal disorders,06,Diseases and Disorders of the Digestive System,1,Minor,Minor,Medical,Medicare,Medicare,Medicaid,,N,Y,13182.65,8499.49
New York City,Manhattan,7002001,001438,Bellevue Hospital Center,30 to 49,113,M,Other Race,Not Span/Hispanic,11,Emergency,Home or Self Care,2017,138,Esophageal disorders,070,UP GASTRO ENDOSC/BIOPSY,243,Other esophageal disorders,06,Diseases and Disorders of the Digestive System,2,Moderate,Moderate,Medical,Medicaid,,,,N,Y,61084.36,39384.02
New York City,Manhattan,7002001,001438,Bellevue Hospital Center,50 to 69,100,F,Other Race,Spanish/Hispanic,1,Emergency,Home or Self Care,2017,138,Esophageal disorders,070,UP GASTRO ENDOSC/BIOPSY,243,Other esophageal disorders,06,Diseases and Disorders of the Digestive System,1,Minor,Minor,Medical,Medicare,Medicare,Medicaid,,N,Y,7703.02,4966.51
New York City,Manhattan,7002001,001438,Bellevue Hospital Center,50 to 69,112,F,Other Race,Not Span/Hispanic,1,Emergency,Home or Self Care,2017,138,Esophageal disorders,222,BLOOD TRANSFUSION,243,Other esophageal disorders,06,Diseases and Disorders of the Digestive System,1,Minor,Minor,Medical,Medicaid,,,,N,Y,7451.33,4804.23
New York City,Manhattan,7002001,001438,Bellevue Hospital Center,50 to 69,112,M,Black/African American,Not Span/Hispanic,1,Emergency,Home or Self Care,2017,138,Esophageal disorders,193,DX ULTRASOUND HEART,243,Other esophageal disorders,06,Diseases and Disorders of the Digestive System,2,Moderate,Minor,Medical,Medicaid,Medicaid,,,N,Y,11979.17,7723.55
New York City,Manhattan,7002001,001438,Bellevue Hospital Center,30 to 49,104,F,Other Race,Spanish/Hispanic,21,Emergency,Home or Self Care,2017,138,Esophageal disorders,031,DX PRCS ON NOSE & MOUTH,243,Other esophageal disorders,06,Diseases and Disorders of the Digestive System,3,Major,Moderate,Medical,Medicaid,,,,N,Y,116924.31,75386.72
New York City,Manhattan,7002001,001438,Bellevue Hospital Center,30 to 49,114,F,Black/African American,Not Span/Hispanic,1,Emergency,Home or Self Care,2017,138,Esophageal disorders,047,DX CARDIAC CATHETERIZTN,243,Other esophageal disorders,06,Diseases and Disorders of the Digestive System,2,Moderate,Minor,Medical,Blue Cross/Blue Shield,,,,N,N,6506.59,4195.11
New York City,Manhattan,7002001,001438,Bellevue Hospital Center,30 to 49,112,M,Black/African American,Not Span/Hispanic,2,Emergency,Home or Self Care,2017,138,Esophageal disorders,185,UPPER GI X-RAY,243,Other esophageal disorders,06,Diseases and Disorders of the Digestive System,2,Moderate,Minor,Medical,Department of Corrections,,,,N,Y,16020.51,10329.19
New York City,Manhattan,7002001,001438,Bellevue Hospital Center,50 to 69,113,M,Black/African American,Not Span/Hispanic,2,Emergency,Home or Self Care,2017,138,Esophageal disorders,222,BLOOD TRANSFUSION,243,Other esophageal disorders,06,Diseases and Disorders of the Digestive System,2,Moderate,Minor,Medical,Medicaid,Medicaid,,,N,Y,14953.30,9641.11
New York City,Manhattan,7002001,001438,Bellevue Hospital Center,30 to 49,113,M,Other Race,Spanish/Hispanic,1,Emergency,Home or Self Care,2017,138,Esophageal disorders,222,BLOOD TRANSFUSION,243,Other esophageal disorders,06,Diseases and Disorders of the Digestive System,2,Moderate,Minor,Medical,Medicaid,,,,N,N,7413.76,4780.01
New York City,Manhattan,7002001,001438,Bellevue Hospital Center,50 to 69,113,M,Black/African American,Not Span/Hispanic,1,Elective,Home or Self Care,2017,138,Esophageal disorders,092,OTHER BOWEL DX PRCS,243,Other esophageal disorders,06,Diseases and Disorders of the Digestive System,1,Minor,Minor,Medical,Department of Corrections,,,,N,N,6413.41,4135.03
New York City,Manhattan,7002001,001438,Bellevue Hospital Center,30 to 49,114,F,Other Race,Not Span/Hispanic,7,Emergency,Home or Self Care,2017,138,Esophageal disorders,069,ESOPHAGEAL DILATATION,243,Other esophageal disorders,06,Diseases and Disorders of the Digestive System,2,Moderate,Major,Medical,Medicaid,,,,N,Y,37779.83,24358.47
New York City,Manhattan,7002001,001438,Bellevue Hospital Center,50 to 69,113,M,White,Not Span/Hispanic,3,Emergency,Home or Self Care,2017,138,Esophageal disorders,222,BLOOD TRANSFUSION,243,Other esophageal disorders,06,Diseases and Disorders of the Digestive System,1,Minor,Minor,Medical,Department of Corrections,,,,N,N,17491.77,11277.78
New York City,Manhattan,7002001,001438,Bellevue Hospital Center,50 to 69,113,M,Black/African American,Not Span/Hispanic,3,Emergency,Home or Self Care,2017,138,Esophageal disorders,070,UP GASTRO ENDOSC/BIOPSY,243,Other esophageal disorders,06,Diseases and Disorders of the Digestive System,2,Moderate,Moderate,Medical,Medicaid,,,,N,Y,20475.57,13201.58
New York City,Manhattan,7002001,001438,Bellevue Hospital Center,50 to 69,116,M,Black/African American,Not Span/Hispanic,7,Emergency,Home or Self Care,2017,138,Esophageal disorders,058,HEMODIALYSIS,243,Other esophageal disorders,06,Diseases and Disorders of the Digestive System,3,Major,Major,Medical,Medicaid,,,,N,Y,39092.62,25204.89
New York City,Manhattan,7002001,001438,Bellevue Hospital Center,50 to 69,113,M,White,Not Span/Hispanic,3,Emergency,Home or Self Care,2017,138,Esophageal disorders,226,OT DX RADIO & RELATED,243,Other esophageal disorders,06,Diseases and Disorders of the Digestive System,1,Minor,Minor,Medical,Medicaid,,,,N,Y,31221.97,20130.30
New York City,Manhattan,7002001,001438,Bellevue Hospital Center,70 or Older,113,F,Other Race,Not Span/Hispanic,1,Emergency,Home or Self Care,2017,138,Esophageal disorders,231,OTHER THERAPEUTIC PRCS,243,Other esophageal disorders,06,Diseases and Disorders of the Digestive System,1,Minor,Minor,Medical,Medicaid,,,,N,Y,8800.21,5673.92
New York City,Manhattan,7002001,001438,Bellevue Hospital Center,50 to 69,112,M,Other Race,Not Span/Hispanic,1,Emergency,Home or Self Care,2017,138,Esophageal disorders,222,BLOOD TRANSFUSION,243,Other esophageal disorders,06,Diseases and Disorders of the Digestive System,2,Moderate,Moderate,Medical,Medicaid,,,,N,Y,6870.41,4429.68
New York City,Manhattan,7002001,001438,Bellevue Hospital Center,50 to 69,100,M,Black/African American,Not Span/Hispanic,3,Emergency,Home or Self Care,2017,138,Esophageal disorders,000,NO PROC,243,Other esophageal disorders,06,Diseases and Disorders of the Digestive System,2,Moderate,Minor,Medical,Medicare,Medicare,Medicaid,,N,N,17489.25,11276.16
New York City,Manhattan,7002001,001438,Bellevue Hospital Center,50 to 69,100,M,White,Not Span/Hispanic,1,Emergency,Home or Self Care,2017,138,Esophageal disorders,222,BLOOD TRANSFUSION,243,Other esophageal disorders,06,Diseases and Disorders of the Digestive System,3,Major,Moderate,Medical,Medicare,Medicare,,,N,N,6654.98,4290.79
New York City,Manhattan,7002001,001438,Bellevue Hospital Center,50 to 69,112,M,Black/African American,Not Span/Hispanic,4,Emergency,Home or Self Care,2017,138,Esophageal disorders,000,NO PROC,243,Other esophageal disorders,06,Diseases and Disorders of the Digestive System,1,Minor,Minor,Medical,Medicaid,,,,N,N,28825.25,18585.02
New York City,Manhattan,7002001,001438,Bellevue Hospital Center,50 to 69,112,M,Black/African American,Not Span/Hispanic,6,Emergency,Home or Self Care,2017,138,Esophageal disorders,070,UP GASTRO ENDOSC/BIOPSY,243,Other esophageal disorders,06,Diseases and Disorders of the Digestive System,3,Major,Moderate,Medical,Medicaid,Medicaid,,,N,Y,33245.97,21435.27
New York City,Manhattan,7002001,001438,Bellevue Hospital Center,30 to 49,112,M,Other Race,Spanish/Hispanic,4,Emergency,Home or Self Care,2017,138,Esophageal disorders,070,UP GASTRO ENDOSC/BIOPSY,243,Other esophageal disorders,06,Diseases and Disorders of the Digestive System,3,Major,Moderate,Medical,Private Health Insurance,,,,N,Y,22551.21,14539.85
New York City,Manhattan,7002001,001438,Bellevue Hospital Center,50 to 69,112,M,Other Race,Not Span/Hispanic,1,Emergency,Home or Self Care,2017,138,Esophageal disorders,193,DX ULTRASOUND HEART,243,Other esophageal disorders,06,Diseases and Disorders of the Digestive System,1,Minor,Minor,Medical,Medicare,Medicare,Medicaid,,N,N,10334.30,6663.02
New York City,Manhattan,7002001,001438,Bellevue Hospital Center,50 to 69,113,M,White,Not Span/Hispanic,2,Emergency,Home or Self Care,2017,138,Esophageal disorders,000,NO PROC,243,Other esophageal disorders,06,Diseases and Disorders of the Digestive System,1,Minor,Minor,Medical,Medicaid,Medicaid,,,N,Y,20508.94,13223.10
New York City,Manhattan,7002001,001438,Bellevue Hospital Center,50 to 69,112,M,White,Not Span/Hispanic,3,Emergency,Home or Self Care,2017,138,Esophageal disorders,000,NO PROC,243,Other esophageal disorders,06,Diseases and Disorders of the Digestive System,3,Major,Moderate,Medical,Medicaid,,,,N,Y,19252.55,12413.04
New York City,Manhattan,7002001,001438,Bellevue Hospital Center,30 to 49,112,F,Other Race,Not Span/Hispanic,1,Emergency,Home or Self Care,2017,138,Esophageal disorders,070,UP GASTRO ENDOSC/BIOPSY,243,Other esophageal disorders,06,Diseases and Disorders of the Digestive System,1,Minor,Minor,Medical,Medicaid,Medicaid,,,N,N,2676.97,1725.97
New York City,Manhattan,7002001,001438,Bellevue Hospital Center,30 to 49,112,M,Black/African American,Not Span/Hispanic,8,Emergency,Home or Self Care,2017,138,Esophageal disorders,092,OTHER BOWEL DX PRCS,243,Other esophageal disorders,06,Diseases and Disorders of the Digestive System,3,Major,Moderate,Medical,Medicaid,,,,N,Y,41609.97,26827.94
