Hospital Service Area,Hospital County,Operating Certificate Number,Permanent Facility Id,Facility Name,Age Group,Zip Code - 3 digits,Gender,Race,Ethnicity,Length of Stay,Type of Admission,Patient Disposition,Discharge Year,CCS Diagnosis Code,CCS Diagnosis Description,CCS Procedure Code,CCS Procedure Description,APR DRG Code,APR DRG Description,APR MDC Code,APR MDC Description,APR Severity of Illness Code,APR Severity of Illness Description,APR Risk of Mortality,APR Medical Surgical Description,Payment Typology 1,Payment Typology 2,Payment Typology 3,Birth Weight,Abortion Edit Indicator,Emergency Department Indicator,Total Charges,Total Costs
New York City,Bronx,7000006,001169,Montefiore Medical Center - Henry & Lucy Moses Div,50 to 69,100,M,Other Race,Spanish/Hispanic,2,Emergency,Home or Self Care,2020,DIG013,DIVERTICULOSIS AND DIVERTICULITIS,,,244,DIVERTICULITIS & DIVERTICULOSIS,06,DISEASES AND DISORDERS OF THE DIGESTIVE SYSTEM,1,Minor,Minor,Medical,Private Health Insurance,,,,,Y,35146.02,5586.93
New York City,Bronx,7000006,001169,Montefiore Medical Center - Henry & Lucy Moses Div,50 to 69,104,F,Other Race,Unknown,2,Emergency,Home or Self Care,2020,DIG013,DIVERTICULOSIS AND DIVERTICULITIS,,,244,DIVERTICULITIS & DIVERTICULOSIS,06,DISEASES AND DISORDERS OF THE DIGESTIVE SYSTEM,1,Minor,Minor,Medical,Medicare,Medicaid,,,,Y,35285.56,4961.34
New York City,Bronx,7000006,001169,Montefiore Medical Center - Henry & Lucy Moses Div,70 or Older,104,M,Other Race,Spanish/Hispanic,2,Emergency,Home w/ Home Health Services,2020,DIG013,DIVERTICULOSIS AND DIVERTICULITIS,ADM001,TRANSFUSION OF BLOOD AND BLOOD PRODUCTS,244,DIVERTICULITIS & DIVERTICULOSIS,06,DISEASES AND DISORDERS OF THE DIGESTIVE SYSTEM,2,Moderate,Moderate,Medical,Medicare,Medicaid,,,,Y,40057.34,5183.51
New York City,Bronx,7000006,003058,Montefiore Med Center - Jack D Weiler Hosp of A Einstein College Div,70 or Older,104,F,Black/African American,Not Span/Hispanic,2,Emergency,Home or Self Care,2020,DIG013,DIVERTICULOSIS AND DIVERTICULITIS,ADM015,ADMINISTRATION OF ANTIBIOTICS,244,DIVERTICULITIS & DIVERTICULOSIS,06,DISEASES AND DISORDERS OF THE DIGESTIVE SYSTEM,2,Moderate,Moderate,Medical,Medicare,Private Health Insurance,,,,Y,38062.03,4590.51
New York City,Bronx,7000006,003058,Montefiore Med Center - Jack D Weiler Hosp of A Einstein College Div,50 to 69,104,M,Other Race,Spanish/Hispanic,3,Emergency,Home or Self Care,2020,DIG013,DIVERTICULOSIS AND DIVERTICULITIS,ADM017,ADMINISTRATION OF NUTRITIONAL AND ELECTROLYTIC SUBSTANCES,244,DIVERTICULITIS & DIVERTICULOSIS,06,DISEASES AND DISORDERS OF THE DIGESTIVE SYSTEM,1,Minor,Minor,Medical,Private Health Insurance,,,,,Y,51322.39,7845.84
New York City,Bronx,7000006,003058,Montefiore Med Center - Jack D Weiler Hosp of A Einstein College Div,50 to 69,104,F,Other Race,Spanish/Hispanic,4,Emergency,Home or Self Care,2020,DIG013,DIVERTICULOSIS AND DIVERTICULITIS,ADM015,ADMINISTRATION OF ANTIBIOTICS,244,DIVERTICULITIS & DIVERTICULOSIS,06,DISEASES AND DISORDERS OF THE DIGESTIVE SYSTEM,1,Minor,Minor,Medical,Medicare,,,,,Y,50992.67,8041.22
New York City,Bronx,7000006,003058,Montefiore Med Center - Jack D Weiler Hosp of A Einstein College Div,70 or Older,104,F,White,Not Span/Hispanic,3,Emergency,Home or Self Care,2020,DIG013,DIVERTICULOSIS AND DIVERTICULITIS,,,244,DIVERTICULITIS & DIVERTICULOSIS,06,DISEASES AND DISORDERS OF THE DIGESTIVE SYSTEM,1,Minor,Moderate,Medical,Medicare,Medicaid,,,,Y,35333.31,4889.67
New York City,Bronx,7000006,001169,Montefiore Medical Center - Henry & Lucy Moses Div,50 to 69,115,F,Black/African American,Not Span/Hispanic,2,Emergency,Home or Self Care,2020,DIG013,DIVERTICULOSIS AND DIVERTICULITIS,,,244,DIVERTICULITIS & DIVERTICULOSIS,06,DISEASES AND DISORDERS OF THE DIGESTIVE SYSTEM,1,Minor,Minor,Medical,Blue Cross/Blue Shield,,,,,Y,40147.02,5748.14
Hudson Valley,Westchester,5904001,001072,Montefiore New Rochelle Hospital,30 to 49,104,M,Other Race,Spanish/Hispanic,5,Emergency,Home or Self Care,2020,DIG013,DIVERTICULOSIS AND DIVERTICULITIS,ADM015,ADMINISTRATION OF ANTIBIOTICS,244,DIVERTICULITIS & DIVERTICULOSIS,06,DISEASES AND DISORDERS OF THE DIGESTIVE SYSTEM,1,Minor,Minor,Medical,Private Health Insurance,Self-Pay,,,,Y,36808.49,9138.17
Hudson Valley,Westchester,5904001,001072,Montefiore New Rochelle Hospital,30 to 49,104,F,Other Race,Spanish/Hispanic,4,Emergency,Home or Self Care,2020,DIG013,DIVERTICULOSIS AND DIVERTICULITIS,ADM015,ADMINISTRATION OF ANTIBIOTICS,244,DIVERTICULITIS & DIVERTICULOSIS,06,DISEASES AND DISORDERS OF THE DIGESTIVE SYSTEM,1,Minor,Minor,Medical,Private Health Insurance,Self-Pay,,,,Y,31934.79,7742.72
New York City,Bronx,7000006,001169,Montefiore Medical Center - Henry & Lucy Moses Div,50 to 69,105,F,Other Race,Spanish/Hispanic,4,Emergency,Home or Self Care,2020,DIG013,DIVERTICULOSIS AND DIVERTICULITIS,ADM015,ADMINISTRATION OF ANTIBIOTICS,244,DIVERTICULITIS & DIVERTICULOSIS,06,DISEASES AND DISORDERS OF THE DIGESTIVE SYSTEM,1,Minor,Minor,Medical,Medicare,,,,,Y,49680.76,7935.71
New York City,Bronx,7000006,001169,Montefiore Medical Center - Henry & Lucy Moses Div,18 to 29,104,M,Black/African American,Not Span/Hispanic,1,Emergency,Home or Self Care,2020,DIG013,DIVERTICULOSIS AND DIVERTICULITIS,ADM015,ADMINISTRATION OF ANTIBIOTICS,244,DIVERTICULITIS & DIVERTICULOSIS,06,DISEASES AND DISORDERS OF THE DIGESTIVE SYSTEM,1,Minor,Minor,Medical,Medicaid,,,,,Y,29075.14,3516.72
New York City,Manhattan,7002024,001456,Mount Sinai Hospital,70 or Older,100,F,White,Not Span/Hispanic,10,Emergency,Home w/ Home Health Services,2020,DIG013,DIVERTICULOSIS AND DIVERTICULITIS,GIS004,GI SYSTEM ENDOSCOPY WITHOUT BIOPSY (DIAGNOSTIC),244,DIVERTICULITIS & DIVERTICULOSIS,06,DISEASES AND DISORDERS OF THE DIGESTIVE SYSTEM,2,Moderate,Moderate,Medical,Medicare,Medicare,Medicaid,,,Y,265147.8,64210.5
New York City,Bronx,7000006,001169,Montefiore Medical Center - Henry & Lucy Moses Div,70 or Older,104,M,White,Not Span/Hispanic,1,Emergency,Home or Self Care,2020,DIG013,DIVERTICULOSIS AND DIVERTICULITIS,ADM015,ADMINISTRATION OF ANTIBIOTICS,244,DIVERTICULITIS & DIVERTICULOSIS,06,DISEASES AND DISORDERS OF THE DIGESTIVE SYSTEM,1,Minor,Minor,Medical,Medicare,Private Health Insurance,,,,Y,24973.81,3164.86
New York City,Bronx,7000006,001169,Montefiore Medical Center - Henry & Lucy Moses Div,50 to 69,104,F,Other Race,Spanish/Hispanic,2,Emergency,Home or Self Care,2020,DIG013,DIVERTICULOSIS AND DIVERTICULITIS,,,244,DIVERTICULITIS & DIVERTICULOSIS,06,DISEASES AND DISORDERS OF THE DIGESTIVE SYSTEM,1,Minor,Minor,Medical,Private Health Insurance,,,,,Y,38711.06,5386.42
New York City,Bronx,7000006,001168,Montefiore Medical Center-Wakefield Hospital,70 or Older,104,M,Black/African American,Not Span/Hispanic,4,Emergency,Home w/ Home Health Services,2020,DIG013,DIVERTICULOSIS AND DIVERTICULITIS,,,244,DIVERTICULITIS & DIVERTICULOSIS,06,DISEASES AND DISORDERS OF THE DIGESTIVE SYSTEM,2,Moderate,Moderate,Medical,Medicare,Medicaid,,,,Y,46512.46,7748.89
New York City,Bronx,7000006,003058,Montefiore Med Center - Jack D Weiler Hosp of A Einstein College Div,50 to 69,104,F,Black/African American,Not Span/Hispanic,3,Emergency,Home or Self Care,2020,DIG013,DIVERTICULOSIS AND DIVERTICULITIS,GIS016,GI SYSTEM ENDOSCOPIC THERAPEUTIC PROCEDURES,244,DIVERTICULITIS & DIVERTICULOSIS,06,DISEASES AND DISORDERS OF THE DIGESTIVE SYSTEM,2,Moderate,Moderate,Medical,Private Health Insurance,,,,,Y,82359.79,16291.92
New York City,Bronx,7000006,001168,Montefiore Medical Center-Wakefield Hospital,70 or Older,104,M,Black/African American,Not Span/Hispanic,2,Emergency,Home or Self Care,2020,DIG013,DIVERTICULOSIS AND DIVERTICULITIS,,,244,DIVERTICULITIS & DIVERTICULOSIS,06,DISEASES AND DISORDERS OF THE DIGESTIVE SYSTEM,3,Major,Moderate,Medical,Medicare,Medicaid,,,,Y,32016.02,5184.09
New York City,Bronx,7000006,003058,Montefiore Med Center - Jack D Weiler Hosp of A Einstein College Div,50 to 69,104,F,Other Race,Spanish/Hispanic,8,Emergency,Home or Self Care,2020,DIG013,DIVERTICULOSIS AND DIVERTICULITIS,ADM015,ADMINISTRATION OF ANTIBIOTICS,244,DIVERTICULITIS & DIVERTICULOSIS,06,DISEASES AND DISORDERS OF THE DIGESTIVE SYSTEM,2,Moderate,Minor,Medical,Private Health Insurance,Medicare,,,,Y,96587.74,13885.78
New York City,Bronx,7000006,003058,Montefiore Med Center - Jack D Weiler Hosp of A Einstein College Div,50 to 69,104,F,Other Race,Spanish/Hispanic,2,Emergency,Home or Self Care,2020,DIG013,DIVERTICULOSIS AND DIVERTICULITIS,ADM001,TRANSFUSION OF BLOOD AND BLOOD PRODUCTS,244,DIVERTICULITIS & DIVERTICULOSIS,06,DISEASES AND DISORDERS OF THE DIGESTIVE SYSTEM,1,Minor,Minor,Medical,Medicaid,,,,,Y,34021.2,4585.29
New York City,Bronx,7000006,003058,Montefiore Med Center - Jack D Weiler Hosp of A Einstein College Div,70 or Older,104,M,Black/African American,Not Span/Hispanic,4,Emergency,Home or Self Care,2020,DIG013,DIVERTICULOSIS AND DIVERTICULITIS,GIS004,GI SYSTEM ENDOSCOPY WITHOUT BIOPSY (DIAGNOSTIC),244,DIVERTICULITIS & DIVERTICULOSIS,06,DISEASES AND DISORDERS OF THE DIGESTIVE SYSTEM,3,Major,Moderate,Medical,Medicare,,,,,Y,53825.2,13237.89
New York City,Bronx,7000006,001168,Montefiore Medical Center-Wakefield Hospital,70 or Older,104,F,White,Not Span/Hispanic,1,Emergency,Home or Self Care,2020,DIG013,DIVERTICULOSIS AND DIVERTICULITIS,,,244,DIVERTICULITIS & DIVERTICULOSIS,06,DISEASES AND DISORDERS OF THE DIGESTIVE SYSTEM,1,Minor,Minor,Medical,Medicare,Private Health Insurance,,,,Y,22109.33,2974.19
New York City,Bronx,7000006,003058,Montefiore Med Center - Jack D Weiler Hosp of A Einstein College Div,70 or Older,104,M,Other Race,Spanish/Hispanic,2,Emergency,Home or Self Care,2020,DIG013,DIVERTICULOSIS AND DIVERTICULITIS,,,244,DIVERTICULITIS & DIVERTICULOSIS,06,DISEASES AND DISORDERS OF THE DIGESTIVE SYSTEM,2,Moderate,Moderate,Medical,Medicare,Private Health Insurance,,,,Y,38050.2,4582.16
New York City,Manhattan,7002032,001469,Mount Sinai Morningside,30 to 49,100,M,Other Race,Not Span/Hispanic,3,Emergency,Home or Self Care,2020,DIG013,DIVERTICULOSIS AND DIVERTICULITIS,ADM015,ADMINISTRATION OF ANTIBIOTICS,244,DIVERTICULITIS & DIVERTICULOSIS,06,DISEASES AND DISORDERS OF THE DIGESTIVE SYSTEM,1,Minor,Minor,Medical,Blue Cross/Blue Shield,Self-Pay,,,,Y,39782.59,9057.99
New York City,Kings,7002002,001324,Mount Sinai Brooklyn,30 to 49,112,M,Black/African American,Not Span/Hispanic,3,Emergency,Home or Self Care,2020,DIG013,DIVERTICULOSIS AND DIVERTICULITIS,ADM015,ADMINISTRATION OF ANTIBIOTICS,244,DIVERTICULITIS & DIVERTICULOSIS,06,DISEASES AND DISORDERS OF THE DIGESTIVE SYSTEM,2,Moderate,Minor,Medical,Blue Cross/Blue Shield,Self-Pay,,,,Y,37494.36,5036.01
New York City,Kings,7002002,001324,Mount Sinai Brooklyn,70 or Older,112,F,Black/African American,Not Span/Hispanic,6,Emergency,Home w/ Home Health Services,2020,DIG013,DIVERTICULOSIS AND DIVERTICULITIS,IMG008,ULTRASONOGRAPHY,244,DIVERTICULITIS & DIVERTICULOSIS,06,DISEASES AND DISORDERS OF THE DIGESTIVE SYSTEM,2,Moderate,Moderate,Medical,Medicare,Self-Pay,,,,Y,71360.36,8898.26
New York City,Manhattan,7002032,001469,Mount Sinai Morningside,30 to 49,100,M,Black/African American,Not Span/Hispanic,3,Urgent,Home or Self Care,2020,DIG013,DIVERTICULOSIS AND DIVERTICULITIS,GIS016,GI SYSTEM ENDOSCOPIC THERAPEUTIC PROCEDURES,244,DIVERTICULITIS & DIVERTICULOSIS,06,DISEASES AND DISORDERS OF THE DIGESTIVE SYSTEM,2,Moderate,Minor,Medical,Medicaid,Medicaid,Self-Pay,,,N,44201.49,9590.85
New York City,Kings,7002002,001324,Mount Sinai Brooklyn,70 or Older,112,F,Black/African American,Not Span/Hispanic,1,Emergency,Home or Self Care,2020,DIG013,DIVERTICULOSIS AND DIVERTICULITIS,ESA001,HEMODIALYSIS,244,DIVERTICULITIS & DIVERTICULOSIS,06,DISEASES AND DISORDERS OF THE DIGESTIVE SYSTEM,2,Moderate,Moderate,Medical,Medicare,Private Health Insurance,Self-Pay,,,Y,18346.32,3542.63
New York City,Manhattan,7002032,001469,Mount Sinai Morningside,70 or Older,100,M,Black/African American,Not Span/Hispanic,5,Emergency,Expired,2020,DIG013,DIVERTICULOSIS AND DIVERTICULITIS,ADM001,TRANSFUSION OF BLOOD AND BLOOD PRODUCTS,244,DIVERTICULITIS & DIVERTICULOSIS,06,DISEASES AND DISORDERS OF THE DIGESTIVE SYSTEM,4,Extreme,Extreme,Medical,Medicare,Medicare,Medicaid,,,Y,61080.42,12895.72
New York City,Manhattan,7002032,001469,Mount Sinai Morningside,50 to 69,100,M,Other Race,Spanish/Hispanic,5,Urgent,Home or Self Care,2020,DIG013,DIVERTICULOSIS AND DIVERTICULITIS,ADM021,"ADMINISTRATION OF THERAPEUTIC SUBSTANCES, NEC",244,DIVERTICULITIS & DIVERTICULOSIS,06,DISEASES AND DISORDERS OF THE DIGESTIVE SYSTEM,1,Minor,Minor,Medical,Medicare,Medicaid,Self-Pay,,,N,55207.05,11462.71
New York City,Manhattan,7002032,001469,Mount Sinai Morningside,50 to 69,100,M,Other Race,Not Span/Hispanic,2,Emergency,Left Against Medical Advice,2020,DIG013,DIVERTICULOSIS AND DIVERTICULITIS,IMG008,ULTRASONOGRAPHY,244,DIVERTICULITIS & DIVERTICULOSIS,06,DISEASES AND DISORDERS OF THE DIGESTIVE SYSTEM,2,Moderate,Minor,Medical,Blue Cross/Blue Shield,Self-Pay,,,,Y,35158.23,7764.97
New York City,Manhattan,7002032,001469,Mount Sinai Morningside,70 or Older,100,M,Black/African American,Not Span/Hispanic,6,Emergency,Home or Self Care,2020,DIG013,DIVERTICULOSIS AND DIVERTICULITIS,ADM001,TRANSFUSION OF BLOOD AND BLOOD PRODUCTS,244,DIVERTICULITIS & DIVERTICULOSIS,06,DISEASES AND DISORDERS OF THE DIGESTIVE SYSTEM,3,Major,Major,Medical,Medicare,Medicare,Medicaid,,,Y,73566.68,15746.75
New York City,Bronx,7000006,001169,Montefiore Medical Center - Henry & Lucy Moses Div,30 to 49,104,M,Other Race,Spanish/Hispanic,1,Emergency,Home or Self Care,2020,DIG013,DIVERTICULOSIS AND DIVERTICULITIS,ADM015,ADMINISTRATION OF ANTIBIOTICS,244,DIVERTICULITIS & DIVERTICULOSIS,06,DISEASES AND DISORDERS OF THE DIGESTIVE SYSTEM,1,Minor,Minor,Medical,Medicaid,,,,,Y,24580.27,3174.2
New York City,Manhattan,7002032,001466,Mount Sinai West,50 to 69,100,M,White,Not Span/Hispanic,2,Emergency,Home or Self Care,2020,DIG013,DIVERTICULOSIS AND DIVERTICULITIS,ADM015,ADMINISTRATION OF ANTIBIOTICS,244,DIVERTICULITIS & DIVERTICULOSIS,06,DISEASES AND DISORDERS OF THE DIGESTIVE SYSTEM,2,Moderate,Minor,Medical,Medicare,Medicaid,Self-Pay,,,Y,28828.34,6752.72
New York City,Manhattan,7002032,001466,Mount Sinai West,70 or Older,100,F,White,Not Span/Hispanic,4,Emergency,Home w/ Home Health Services,2020,DIG013,DIVERTICULOSIS AND DIVERTICULITIS,GIS004,GI SYSTEM ENDOSCOPY WITHOUT BIOPSY (DIAGNOSTIC),244,DIVERTICULITIS & DIVERTICULOSIS,06,DISEASES AND DISORDERS OF THE DIGESTIVE SYSTEM,3,Major,Major,Medical,Medicare,Medicaid,Self-Pay,,,Y,62244.84,13195.44
Hudson Valley,Westchester,5901000,001039,NewYork-Presbyterian/Hudson Valley Hospital,50 to 69,105,M,Other Race,Spanish/Hispanic,3,Emergency,Home or Self Care,2020,DIG013,DIVERTICULOSIS AND DIVERTICULITIS,ADM021,"ADMINISTRATION OF THERAPEUTIC SUBSTANCES, NEC",244,DIVERTICULITIS & DIVERTICULOSIS,06,DISEASES AND DISORDERS OF THE DIGESTIVE SYSTEM,1,Minor,Minor,Medical,Private Health Insurance,,,,,Y,25967.57,7105.79
New York City,Bronx,7000006,003058,Montefiore Med Center - Jack D Weiler Hosp of A Einstein College Div,70 or Older,104,F,White,Spanish/Hispanic,4,Emergency,Home w/ Home Health Services,2020,DIG013,DIVERTICULOSIS AND DIVERTICULITIS,ADM017,ADMINISTRATION OF NUTRITIONAL AND ELECTROLYTIC SUBSTANCES,244,DIVERTICULITIS & DIVERTICULOSIS,06,DISEASES AND DISORDERS OF THE DIGESTIVE SYSTEM,2,Moderate,Major,Medical,Medicare,Medicaid,,,,Y,44486.17,6697.06
New York City,Bronx,7000006,003058,Montefiore Med Center - Jack D Weiler Hosp of A Einstein College Div,18 to 29,104,F,Other Race,Not Span/Hispanic,4,Emergency,Home or Self Care,2020,DIG013,DIVERTICULOSIS AND DIVERTICULITIS,ADM015,ADMINISTRATION OF ANTIBIOTICS,244,DIVERTICULITIS & DIVERTICULOSIS,06,DISEASES AND DISORDERS OF THE DIGESTIVE SYSTEM,1,Minor,Minor,Medical,Medicaid,,,,,Y,63492.6,10251.09
New York City,Bronx,7000006,001169,Montefiore Medical Center - Henry & Lucy Moses Div,70 or Older,104,F,Other Race,Spanish/Hispanic,3,Emergency,Home or Self Care,2020,DIG013,DIVERTICULOSIS AND DIVERTICULITIS,,,244,DIVERTICULITIS & DIVERTICULOSIS,06,DISEASES AND DISORDERS OF THE DIGESTIVE SYSTEM,2,Moderate,Moderate,Medical,Medicare,,,,,Y,44523.41,6853.83
Hudson Valley,Westchester,5901000,001039,NewYork-Presbyterian/Hudson Valley Hospital,50 to 69,105,F,White,Not Span/Hispanic,3,Emergency,Home or Self Care,2020,DIG013,DIVERTICULOSIS AND DIVERTICULITIS,ADM015,ADMINISTRATION OF ANTIBIOTICS,244,DIVERTICULITIS & DIVERTICULOSIS,06,DISEASES AND DISORDERS OF THE DIGESTIVE SYSTEM,2,Moderate,Moderate,Medical,Blue Cross/Blue Shield,,,,,Y,24066.9,6787.13
Hudson Valley,Westchester,5901000,001039,NewYork-Presbyterian/Hudson Valley Hospital,70 or Older,125,F,White,Not Span/Hispanic,9,Emergency,Home or Self Care,2020,DIG013,DIVERTICULOSIS AND DIVERTICULITIS,ADM015,ADMINISTRATION OF ANTIBIOTICS,244,DIVERTICULITIS & DIVERTICULOSIS,06,DISEASES AND DISORDERS OF THE DIGESTIVE SYSTEM,2,Moderate,Major,Medical,Medicare,Blue Cross/Blue Shield,,,,Y,49374.07,17268.38
Hudson Valley,Westchester,5901000,001039,NewYork-Presbyterian/Hudson Valley Hospital,50 to 69,105,F,White,Not Span/Hispanic,1,Emergency,Home or Self Care,2020,DIG013,DIVERTICULOSIS AND DIVERTICULITIS,ADM021,"ADMINISTRATION OF THERAPEUTIC SUBSTANCES, NEC",244,DIVERTICULITIS & DIVERTICULOSIS,06,DISEASES AND DISORDERS OF THE DIGESTIVE SYSTEM,1,Minor,Minor,Medical,Private Health Insurance,,,,,Y,14153.41,2882.71
New York City,Bronx,7000006,001169,Montefiore Medical Center - Henry & Lucy Moses Div,50 to 69,104,M,Other Race,Unknown,2,Emergency,Home or Self Care,2020,DIG013,DIVERTICULOSIS AND DIVERTICULITIS,GIS004,GI SYSTEM ENDOSCOPY WITHOUT BIOPSY (DIAGNOSTIC),244,DIVERTICULITIS & DIVERTICULOSIS,06,DISEASES AND DISORDERS OF THE DIGESTIVE SYSTEM,1,Minor,Moderate,Medical,Private Health Insurance,,,,,Y,43309.96,10342.05
New York City,Bronx,7000006,003058,Montefiore Med Center - Jack D Weiler Hosp of A Einstein College Div,70 or Older,104,F,Other Race,Spanish/Hispanic,3,Emergency,Home w/ Home Health Services,2020,DIG013,DIVERTICULOSIS AND DIVERTICULITIS,ADM017,ADMINISTRATION OF NUTRITIONAL AND ELECTROLYTIC SUBSTANCES,244,DIVERTICULITIS & DIVERTICULOSIS,06,DISEASES AND DISORDERS OF THE DIGESTIVE SYSTEM,2,Moderate,Minor,Medical,Medicare,Medicaid,,,,Y,41612.23,10772.6
New York City,Bronx,7000006,001169,Montefiore Medical Center - Henry & Lucy Moses Div,70 or Older,104,F,Black/African American,Not Span/Hispanic,7,Emergency,Home or Self Care,2020,DIG013,DIVERTICULOSIS AND DIVERTICULITIS,GIS004,GI SYSTEM ENDOSCOPY WITHOUT BIOPSY (DIAGNOSTIC),244,DIVERTICULITIS & DIVERTICULOSIS,06,DISEASES AND DISORDERS OF THE DIGESTIVE SYSTEM,2,Moderate,Minor,Medical,Medicare,,,,,Y,123118.3,23115.3
New York City,Manhattan,7002024,001456,Mount Sinai Hospital,70 or Older,100,F,White,Not Span/Hispanic,7,Urgent,Home or Self Care,2020,DIG013,DIVERTICULOSIS AND DIVERTICULITIS,IMG006,COMPUTERIZED TOMOGRAPHY (CT) WITH CONTRAST,244,DIVERTICULITIS & DIVERTICULOSIS,06,DISEASES AND DISORDERS OF THE DIGESTIVE SYSTEM,3,Major,Major,Medical,Medicare,Private Health Insurance,Self-Pay,,,N,87265.73,20445.89
New York City,Manhattan,7002024,001456,Mount Sinai Hospital,50 to 69,100,M,Black/African American,Spanish/Hispanic,3,Urgent,Home or Self Care,2020,DIG013,DIVERTICULOSIS AND DIVERTICULITIS,GIS002,COLONOSCOPY AND PROCTOSCOPY WITH BIOPSY,244,DIVERTICULITIS & DIVERTICULOSIS,06,DISEASES AND DISORDERS OF THE DIGESTIVE SYSTEM,1,Minor,Minor,Medical,Blue Cross/Blue Shield,Self-Pay,,,,N,43396.53,10282.46
New York City,Manhattan,7002024,001456,Mount Sinai Hospital,70 or Older,100,F,Other Race,Spanish/Hispanic,4,Emergency,Home or Self Care,2020,DIG013,DIVERTICULOSIS AND DIVERTICULITIS,ADM001,TRANSFUSION OF BLOOD AND BLOOD PRODUCTS,244,DIVERTICULITIS & DIVERTICULOSIS,06,DISEASES AND DISORDERS OF THE DIGESTIVE SYSTEM,2,Moderate,Major,Medical,Medicare,Medicaid,Self-Pay,,,Y,62195.37,16016.38
New York City,Bronx,7000006,001169,Montefiore Medical Center - Henry & Lucy Moses Div,50 to 69,104,F,Black/African American,Not Span/Hispanic,2,Emergency,Home w/ Home Health Services,2020,DIG013,DIVERTICULOSIS AND DIVERTICULITIS,,,244,DIVERTICULITIS & DIVERTICULOSIS,06,DISEASES AND DISORDERS OF THE DIGESTIVE SYSTEM,3,Major,Major,Medical,Medicare,Medicaid,,,,Y,44526.58,5930.61
New York City,Bronx,7000006,001168,Montefiore Medical Center-Wakefield Hospital,70 or Older,104,F,Black/African American,Not Span/Hispanic,1,Emergency,Home or Self Care,2020,DIG013,DIVERTICULOSIS AND DIVERTICULITIS,ADM015,ADMINISTRATION OF ANTIBIOTICS,244,DIVERTICULITIS & DIVERTICULOSIS,06,DISEASES AND DISORDERS OF THE DIGESTIVE SYSTEM,2,Moderate,Minor,Medical,Medicare,,,,,Y,39865.08,5145.88
New York City,Bronx,7000006,001169,Montefiore Medical Center - Henry & Lucy Moses Div,70 or Older,104,F,Other Race,Spanish/Hispanic,4,Emergency,Home or Self Care,2020,DIG013,DIVERTICULOSIS AND DIVERTICULITIS,GIS002,COLONOSCOPY AND PROCTOSCOPY WITH BIOPSY,244,DIVERTICULITIS & DIVERTICULOSIS,06,DISEASES AND DISORDERS OF THE DIGESTIVE SYSTEM,2,Moderate,Moderate,Medical,Medicare,,,,,Y,65983.31,14671
New York City,Bronx,7000006,001168,Montefiore Medical Center-Wakefield Hospital,50 to 69,104,F,Black/African American,Not Span/Hispanic,2,Emergency,Home or Self Care,2020,DIG013,DIVERTICULOSIS AND DIVERTICULITIS,GIS004,GI SYSTEM ENDOSCOPY WITHOUT BIOPSY (DIAGNOSTIC),244,DIVERTICULITIS & DIVERTICULOSIS,06,DISEASES AND DISORDERS OF THE DIGESTIVE SYSTEM,2,Moderate,Minor,Medical,Private Health Insurance,,,,,Y,37838.88,10285.52
New York City,Bronx,7000006,003058,Montefiore Med Center - Jack D Weiler Hosp of A Einstein College Div,50 to 69,104,M,Other Race,Spanish/Hispanic,5,Emergency,Home w/ Home Health Services,2020,DIG013,DIVERTICULOSIS AND DIVERTICULITIS,ESA001,HEMODIALYSIS,244,DIVERTICULITIS & DIVERTICULOSIS,06,DISEASES AND DISORDERS OF THE DIGESTIVE SYSTEM,3,Major,Major,Medical,Medicare,Medicaid,,,,Y,47013.72,7887.05
New York City,Bronx,7000006,001168,Montefiore Medical Center-Wakefield Hospital,50 to 69,104,F,Other Race,Spanish/Hispanic,2,Emergency,Home or Self Care,2020,DIG013,DIVERTICULOSIS AND DIVERTICULITIS,ADM015,ADMINISTRATION OF ANTIBIOTICS,244,DIVERTICULITIS & DIVERTICULOSIS,06,DISEASES AND DISORDERS OF THE DIGESTIVE SYSTEM,1,Minor,Minor,Medical,Private Health Insurance,,,,,Y,38945.93,5814.74
Hudson Valley,Westchester,5904001,001072,Montefiore New Rochelle Hospital,50 to 69,105,F,White,Unknown,8,Emergency,Home or Self Care,2020,DIG013,DIVERTICULOSIS AND DIVERTICULITIS,ADM015,ADMINISTRATION OF ANTIBIOTICS,244,DIVERTICULITIS & DIVERTICULOSIS,06,DISEASES AND DISORDERS OF THE DIGESTIVE SYSTEM,2,Moderate,Moderate,Medical,Private Health Insurance,Self-Pay,,,,Y,59815.31,15162.57
Hudson Valley,Westchester,5904001,001072,Montefiore New Rochelle Hospital,70 or Older,105,M,White,Not Span/Hispanic,1,Emergency,Home or Self Care,2020,DIG013,DIVERTICULOSIS AND DIVERTICULITIS,ADM015,ADMINISTRATION OF ANTIBIOTICS,244,DIVERTICULITIS & DIVERTICULOSIS,06,DISEASES AND DISORDERS OF THE DIGESTIVE SYSTEM,2,Moderate,Moderate,Medical,Medicare,Medicare,Private Health Insurance,,,Y,14706.17,3082.23
Hudson Valley,Westchester,5903001,001061,Montefiore Mount Vernon Hospital,50 to 69,105,F,Black/African American,Unknown,3,Emergency,Home or Self Care,2020,DIG013,DIVERTICULOSIS AND DIVERTICULITIS,ADM001,TRANSFUSION OF BLOOD AND BLOOD PRODUCTS,244,DIVERTICULITIS & DIVERTICULOSIS,06,DISEASES AND DISORDERS OF THE DIGESTIVE SYSTEM,2,Moderate,Minor,Medical,Private Health Insurance,Self-Pay,,,,Y,30594.12,11861.77
New York City,Bronx,7000006,003058,Montefiore Med Center - Jack D Weiler Hosp of A Einstein College Div,70 or Older,104,M,Other Race,Spanish/Hispanic,6,Emergency,Home or Self Care,2020,DIG013,DIVERTICULOSIS AND DIVERTICULITIS,GIS004,GI SYSTEM ENDOSCOPY WITHOUT BIOPSY (DIAGNOSTIC),244,DIVERTICULITIS & DIVERTICULOSIS,06,DISEASES AND DISORDERS OF THE DIGESTIVE SYSTEM,2,Moderate,Moderate,Medical,Medicare,Medicaid,,,,Y,80734.62,17080.08