Hospital Service Area,Hospital County,Operating Certificate Number,Permanent Facility Id,Facility Name,Age Group,Zip Code - 3 digits,Gender,Race,Ethnicity,Length of Stay,Type of Admission,Patient Disposition,Discharge Year,CCS Diagnosis Code,CCS Diagnosis Description,CCS Procedure Code,CCS Procedure Description,APR DRG Code,APR DRG Description,APR MDC Code,APR MDC Description,APR Severity of Illness Code,APR Severity of Illness Description,APR Risk of Mortality,APR Medical Surgical Description,Payment Typology 1,Payment Typology 2,Payment Typology 3,Birth Weight,Abortion Edit Indicator,Emergency Department Indicator,Total Charges,Total Costs
New York City,Manhattan,7002001,001438,Bellevue Hospital Center,70 or Older,100,F,Black/African American,Not Span/Hispanic,5,Urgent,Home or Self Care,2020,DIG013,DIVERTICULOSIS AND DIVERTICULITIS,GIS004,GI SYSTEM ENDOSCOPY WITHOUT BIOPSY (DIAGNOSTIC),244,DIVERTICULITIS & DIVERTICULOSIS,06,DISEASES AND DISORDERS OF THE DIGESTIVE SYSTEM,2,Moderate,Minor,Medical,Medicare,Medicaid,,,,N,37355.8,21482.72
New York City,Manhattan,7002001,001438,Bellevue Hospital Center,18 to 29,112,M,Other Race,Spanish/Hispanic,5,Emergency,Home or Self Care,2020,DIG013,DIVERTICULOSIS AND DIVERTICULITIS,IMG007,COMPUTERIZED TOMOGRAPHY (CT) WITHOUT CONTRAST,244,DIVERTICULITIS & DIVERTICULOSIS,06,DISEASES AND DISORDERS OF THE DIGESTIVE SYSTEM,1,Minor,Minor,Medical,Private Health Insurance,,,,,Y,39186.03,22535.26
New York City,Manhattan,7002001,001438,Bellevue Hospital Center,70 or Older,100,F,Other Race,Spanish/Hispanic,4,Emergency,Home or Self Care,2020,DIG013,DIVERTICULOSIS AND DIVERTICULITIS,ADM017,ADMINISTRATION OF NUTRITIONAL AND ELECTROLYTIC SUBSTANCES,244,DIVERTICULITIS & DIVERTICULOSIS,06,DISEASES AND DISORDERS OF THE DIGESTIVE SYSTEM,1,Minor,Moderate,Medical,Medicare,,,,,Y,29038.19,16699.4
New York City,Manhattan,7002001,001438,Bellevue Hospital Center,50 to 69,112,M,Other Race,Spanish/Hispanic,3,Emergency,Home or Self Care,2020,DIG013,DIVERTICULOSIS AND DIVERTICULITIS,GIS004,GI SYSTEM ENDOSCOPY WITHOUT BIOPSY (DIAGNOSTIC),244,DIVERTICULITIS & DIVERTICULOSIS,06,DISEASES AND DISORDERS OF THE DIGESTIVE SYSTEM,1,Minor,Minor,Medical,Medicaid,,,,,Y,22921.76,13181.94
New York City,Manhattan,7002001,001438,Bellevue Hospital Center,70 or Older,100,F,Other Race,Spanish/Hispanic,7,Emergency,Home w/ Home Health Services,2020,DIG013,DIVERTICULOSIS AND DIVERTICULITIS,IMG006,COMPUTERIZED TOMOGRAPHY (CT) WITH CONTRAST,244,DIVERTICULITIS & DIVERTICULOSIS,06,DISEASES AND DISORDERS OF THE DIGESTIVE SYSTEM,1,Minor,Minor,Medical,Medicare,Medicaid,,,,Y,54396.57,31282.6
New York City,Manhattan,7002001,001438,Bellevue Hospital Center,50 to 69,100,F,Other Race,Unknown,2,Urgent,Home or Self Care,2020,DIG013,DIVERTICULOSIS AND DIVERTICULITIS,ADM015,ADMINISTRATION OF ANTIBIOTICS,244,DIVERTICULITIS & DIVERTICULOSIS,06,DISEASES AND DISORDERS OF THE DIGESTIVE SYSTEM,1,Minor,Minor,Medical,Private Health Insurance,,,,,Y,16809.15,9666.67
New York City,Manhattan,7002001,001438,Bellevue Hospital Center,30 to 49,112,M,Other Race,Spanish/Hispanic,3,Emergency,Home or Self Care,2020,DIG013,DIVERTICULOSIS AND DIVERTICULITIS,IMG006,COMPUTERIZED TOMOGRAPHY (CT) WITH CONTRAST,244,DIVERTICULITIS & DIVERTICULOSIS,06,DISEASES AND DISORDERS OF THE DIGESTIVE SYSTEM,1,Minor,Minor,Medical,Medicaid,,,,,Y,22327.08,12839.95
New York City,Manhattan,7002001,001438,Bellevue Hospital Center,70 or Older,100,F,White,Not Span/Hispanic,5,Emergency,Home or Self Care,2020,DIG013,DIVERTICULOSIS AND DIVERTICULITIS,ADM015,ADMINISTRATION OF ANTIBIOTICS,244,DIVERTICULITIS & DIVERTICULOSIS,06,DISEASES AND DISORDERS OF THE DIGESTIVE SYSTEM,2,Moderate,Moderate,Medical,Medicare,,,,,Y,35433.08,20377
New York City,Manhattan,7002001,001438,Bellevue Hospital Center,50 to 69,100,F,Black/African American,Not Span/Hispanic,5,Emergency,Home or Self Care,2020,DIG013,DIVERTICULOSIS AND DIVERTICULITIS,ADM021,"ADMINISTRATION OF THERAPEUTIC SUBSTANCES, NEC",244,DIVERTICULITIS & DIVERTICULOSIS,06,DISEASES AND DISORDERS OF THE DIGESTIVE SYSTEM,2,Moderate,Moderate,Medical,Medicare,Medicaid,,,,Y,44266.63,25457.03
New York City,Manhattan,7002001,001438,Bellevue Hospital Center,50 to 69,100,M,Other Race,Spanish/Hispanic,14,Emergency,Short-term Hospital,2020,DIG013,DIVERTICULOSIS AND DIVERTICULITIS,GIS004,GI SYSTEM ENDOSCOPY WITHOUT BIOPSY (DIAGNOSTIC),244,DIVERTICULITIS & DIVERTICULOSIS,06,DISEASES AND DISORDERS OF THE DIGESTIVE SYSTEM,3,Major,Moderate,Medical,Medicaid,,,,,Y,215310.75,123821.77
New York City,Manhattan,7002001,001438,Bellevue Hospital Center,18 to 29,113,F,Other Race,Spanish/Hispanic,4,Emergency,Home or Self Care,2020,DIG013,DIVERTICULOSIS AND DIVERTICULITIS,IMG006,COMPUTERIZED TOMOGRAPHY (CT) WITH CONTRAST,244,DIVERTICULITIS & DIVERTICULOSIS,06,DISEASES AND DISORDERS OF THE DIGESTIVE SYSTEM,1,Minor,Minor,Medical,Medicaid,,,,,Y,28935.25,16640.2
New York City,Manhattan,7002001,001438,Bellevue Hospital Center,70 or Older,113,M,Black/African American,Not Span/Hispanic,7,Emergency,Skilled Nursing Home,2020,DIG013,DIVERTICULOSIS AND DIVERTICULITIS,IMG006,COMPUTERIZED TOMOGRAPHY (CT) WITH CONTRAST,244,DIVERTICULITIS & DIVERTICULOSIS,06,DISEASES AND DISORDERS OF THE DIGESTIVE SYSTEM,3,Major,Moderate,Medical,Medicare,Medicaid,,,,Y,52478.49,30179.54
New York City,Manhattan,7002001,001438,Bellevue Hospital Center,18 to 29,113,F,Other Race,Spanish/Hispanic,1,Emergency,Home or Self Care,2020,DIG013,DIVERTICULOSIS AND DIVERTICULITIS,ADM015,ADMINISTRATION OF ANTIBIOTICS,244,DIVERTICULITIS & DIVERTICULOSIS,06,DISEASES AND DISORDERS OF THE DIGESTIVE SYSTEM,1,Minor,Minor,Medical,Medicaid,,,,,Y,9204.13,5293.15
New York City,Manhattan,7002001,001438,Bellevue Hospital Center,50 to 69,112,M,Other Race,Spanish/Hispanic,2,Emergency,Home or Self Care,2020,DIG013,DIVERTICULOSIS AND DIVERTICULITIS,IMG006,COMPUTERIZED TOMOGRAPHY (CT) WITH CONTRAST,244,DIVERTICULITIS & DIVERTICULOSIS,06,DISEASES AND DISORDERS OF THE DIGESTIVE SYSTEM,2,Moderate,Minor,Medical,Medicare,Private Health Insurance,,,,Y,17201.41,9892.26
New York City,Manhattan,7002001,001438,Bellevue Hospital Center,30 to 49,114,M,Black/African American,Not Span/Hispanic,5,Elective,Court/Law Enforcement,2020,DIG013,DIVERTICULOSIS AND DIVERTICULITIS,IMG006,COMPUTERIZED TOMOGRAPHY (CT) WITH CONTRAST,244,DIVERTICULITIS & DIVERTICULOSIS,06,DISEASES AND DISORDERS OF THE DIGESTIVE SYSTEM,3,Major,Moderate,Medical,Medicaid,,,,,N,34476.53,19826.9
New York City,Manhattan,7002001,001438,Bellevue Hospital Center,30 to 49,112,M,Other Race,Spanish/Hispanic,2,Emergency,Home or Self Care,2020,DIG013,DIVERTICULOSIS AND DIVERTICULITIS,IMG007,COMPUTERIZED TOMOGRAPHY (CT) WITHOUT CONTRAST,244,DIVERTICULITIS & DIVERTICULOSIS,06,DISEASES AND DISORDERS OF THE DIGESTIVE SYSTEM,1,Minor,Minor,Medical,Medicaid,,,,,Y,16148.07,9286.5
New York City,Manhattan,7002001,001438,Bellevue Hospital Center,70 or Older,100,F,Other Race,Spanish/Hispanic,2,Emergency,Home or Self Care,2020,DIG013,DIVERTICULOSIS AND DIVERTICULITIS,IMG006,COMPUTERIZED TOMOGRAPHY (CT) WITH CONTRAST,244,DIVERTICULITIS & DIVERTICULOSIS,06,DISEASES AND DISORDERS OF THE DIGESTIVE SYSTEM,1,Minor,Minor,Medical,Medicare,Medicaid,,,,Y,16604.19,9548.8
New York City,Manhattan,7002001,001438,Bellevue Hospital Center,50 to 69,113,F,Other Race,Spanish/Hispanic,5,Emergency,Home or Self Care,2020,DIG013,DIVERTICULOSIS AND DIVERTICULITIS,FRS015,"FEMALE REPRODUCTIVE SYSTEM PROCEDURES, NEC",244,DIVERTICULITIS & DIVERTICULOSIS,06,DISEASES AND DISORDERS OF THE DIGESTIVE SYSTEM,1,Minor,Minor,Medical,Medicaid,,,,,Y,38801.9,22314.35
New York City,Manhattan,7002001,001438,Bellevue Hospital Center,50 to 69,113,F,Other Race,Spanish/Hispanic,3,Emergency,Home or Self Care,2020,DIG013,DIVERTICULOSIS AND DIVERTICULITIS,ADM015,ADMINISTRATION OF ANTIBIOTICS,244,DIVERTICULITIS & DIVERTICULOSIS,06,DISEASES AND DISORDERS OF THE DIGESTIVE SYSTEM,1,Minor,Minor,Medical,Medicaid,,,,,Y,22196.7,12764.97
New York City,Manhattan,7002001,001438,Bellevue Hospital Center,70 or Older,100,F,Black/African American,Not Span/Hispanic,3,Emergency,Home or Self Care,2020,DIG013,DIVERTICULOSIS AND DIVERTICULITIS,ADM001,TRANSFUSION OF BLOOD AND BLOOD PRODUCTS,244,DIVERTICULITIS & DIVERTICULOSIS,06,DISEASES AND DISORDERS OF THE DIGESTIVE SYSTEM,2,Moderate,Moderate,Medical,Medicare,,,,,Y,30225.28,17382.07
New York City,Manhattan,7002001,001438,Bellevue Hospital Center,30 to 49,113,M,Other Race,Spanish/Hispanic,1,Emergency,Left Against Medical Advice,2020,DIG013,DIVERTICULOSIS AND DIVERTICULITIS,ADM015,ADMINISTRATION OF ANTIBIOTICS,244,DIVERTICULITIS & DIVERTICULOSIS,06,DISEASES AND DISORDERS OF THE DIGESTIVE SYSTEM,2,Moderate,Minor,Medical,Medicaid,,,,,Y,8705.82,5006.58
New York City,Manhattan,7002001,001438,Bellevue Hospital Center,18 to 29,113,F,Other Race,Spanish/Hispanic,3,Emergency,Home or Self Care,2020,DIG013,DIVERTICULOSIS AND DIVERTICULITIS,ADM015,ADMINISTRATION OF ANTIBIOTICS,244,DIVERTICULITIS & DIVERTICULOSIS,06,DISEASES AND DISORDERS OF THE DIGESTIVE SYSTEM,1,Minor,Minor,Medical,Medicaid,,,,,Y,24632.08,14165.52
New York City,Manhattan,7002001,001438,Bellevue Hospital Center,70 or Older,100,M,Other Race,Spanish/Hispanic,2,Emergency,Home or Self Care,2020,DIG013,DIVERTICULOSIS AND DIVERTICULITIS,GIS004,GI SYSTEM ENDOSCOPY WITHOUT BIOPSY (DIAGNOSTIC),244,DIVERTICULITIS & DIVERTICULOSIS,06,DISEASES AND DISORDERS OF THE DIGESTIVE SYSTEM,2,Moderate,Minor,Medical,Medicare,,,,,Y,21607.18,12425.94
New York City,Manhattan,7002001,001438,Bellevue Hospital Center,50 to 69,113,M,Black/African American,Unknown,1,Elective,Court/Law Enforcement,2020,DIG013,DIVERTICULOSIS AND DIVERTICULITIS,GIS004,GI SYSTEM ENDOSCOPY WITHOUT BIOPSY (DIAGNOSTIC),244,DIVERTICULITIS & DIVERTICULOSIS,06,DISEASES AND DISORDERS OF THE DIGESTIVE SYSTEM,2,Moderate,Minor,Medical,Medicaid,,,,,N,9561,5498.38
New York City,Manhattan,7002001,001438,Bellevue Hospital Center,50 to 69,111,F,Other Race,Spanish/Hispanic,8,Emergency,Home or Self Care,2020,DIG013,DIVERTICULOSIS AND DIVERTICULITIS,ADM015,ADMINISTRATION OF ANTIBIOTICS,244,DIVERTICULITIS & DIVERTICULOSIS,06,DISEASES AND DISORDERS OF THE DIGESTIVE SYSTEM,2,Moderate,Moderate,Medical,Medicaid,,,,,Y,60064.3,34542.02
New York City,Manhattan,7002001,001438,Bellevue Hospital Center,30 to 49,113,M,Other Race,Spanish/Hispanic,4,Emergency,Home or Self Care,2020,DIG013,DIVERTICULOSIS AND DIVERTICULITIS,IMG006,COMPUTERIZED TOMOGRAPHY (CT) WITH CONTRAST,244,DIVERTICULITIS & DIVERTICULOSIS,06,DISEASES AND DISORDERS OF THE DIGESTIVE SYSTEM,2,Moderate,Minor,Medical,Medicaid,,,,,Y,31319.59,18011.4
New York City,Manhattan,7002001,001438,Bellevue Hospital Center,50 to 69,100,M,White,Not Span/Hispanic,6,Emergency,Home or Self Care,2020,DIG013,DIVERTICULOSIS AND DIVERTICULITIS,IMG007,COMPUTERIZED TOMOGRAPHY (CT) WITHOUT CONTRAST,244,DIVERTICULITIS & DIVERTICULOSIS,06,DISEASES AND DISORDERS OF THE DIGESTIVE SYSTEM,2,Moderate,Moderate,Medical,Self-Pay,,,,,Y,43035.71,24749.15
New York City,Manhattan,7002001,001438,Bellevue Hospital Center,50 to 69,111,M,Other Race,Unknown,5,Emergency,Home or Self Care,2020,DIG013,DIVERTICULOSIS AND DIVERTICULITIS,GIS002,COLONOSCOPY AND PROCTOSCOPY WITH BIOPSY,244,DIVERTICULITIS & DIVERTICULOSIS,06,DISEASES AND DISORDERS OF THE DIGESTIVE SYSTEM,2,Moderate,Moderate,Medical,Medicaid,,,,,Y,53537.14,30788.35
New York City,Manhattan,7002001,001438,Bellevue Hospital Center,30 to 49,114,M,Other Race,Unknown,3,Emergency,Home or Self Care,2020,DIG013,DIVERTICULOSIS AND DIVERTICULITIS,ADM015,ADMINISTRATION OF ANTIBIOTICS,244,DIVERTICULITIS & DIVERTICULOSIS,06,DISEASES AND DISORDERS OF THE DIGESTIVE SYSTEM,2,Moderate,Minor,Medical,Medicaid,,,,,Y,22891.22,13164.37
New York City,Manhattan,7002001,001438,Bellevue Hospital Center,50 to 69,113,F,Other Race,Not Span/Hispanic,1,Emergency,Home or Self Care,2020,DIG013,DIVERTICULOSIS AND DIVERTICULITIS,GNR004,ENDOSCOPIC CONTROL OF BLEEDING,244,DIVERTICULITIS & DIVERTICULOSIS,06,DISEASES AND DISORDERS OF THE DIGESTIVE SYSTEM,1,Minor,Minor,Medical,Medicaid,,,,,Y,11473.58,6598.27
New York City,Manhattan,7002001,001438,Bellevue Hospital Center,18 to 29,104,M,Other Race,Spanish/Hispanic,15,Emergency,Home or Self Care,2020,DIG013,DIVERTICULOSIS AND DIVERTICULITIS,ADM017,ADMINISTRATION OF NUTRITIONAL AND ELECTROLYTIC SUBSTANCES,244,DIVERTICULITIS & DIVERTICULOSIS,06,DISEASES AND DISORDERS OF THE DIGESTIVE SYSTEM,2,Moderate,Moderate,Medical,Medicaid,,,,,Y,116153.45,66797.99
New York City,Manhattan,7002001,001438,Bellevue Hospital Center,30 to 49,113,M,Other Race,Spanish/Hispanic,2,Emergency,Home or Self Care,2020,DIG013,DIVERTICULOSIS AND DIVERTICULITIS,ADM015,ADMINISTRATION OF ANTIBIOTICS,244,DIVERTICULITIS & DIVERTICULOSIS,06,DISEASES AND DISORDERS OF THE DIGESTIVE SYSTEM,1,Minor,Minor,Medical,Medicaid,,,,,Y,17370.95,9989.76
New York City,Manhattan,7002001,001438,Bellevue Hospital Center,70 or Older,112,F,Other Race,Spanish/Hispanic,2,Emergency,Home w/ Home Health Services,2020,DIG013,DIVERTICULOSIS AND DIVERTICULITIS,GIS016,GI SYSTEM ENDOSCOPIC THERAPEUTIC PROCEDURES,244,DIVERTICULITIS & DIVERTICULOSIS,06,DISEASES AND DISORDERS OF THE DIGESTIVE SYSTEM,2,Moderate,Major,Medical,Medicare,Medicaid,,,,Y,24830.85,14279.82
New York City,Manhattan,7002001,001438,Bellevue Hospital Center,50 to 69,100,F,Other Race,Spanish/Hispanic,4,Emergency,Home or Self Care,2020,DIG013,DIVERTICULOSIS AND DIVERTICULITIS,IMG007,COMPUTERIZED TOMOGRAPHY (CT) WITHOUT CONTRAST,244,DIVERTICULITIS & DIVERTICULOSIS,06,DISEASES AND DISORDERS OF THE DIGESTIVE SYSTEM,1,Minor,Minor,Medical,Medicare,,,,,Y,31427.53,18073.47
New York City,Manhattan,7002001,001438,Bellevue Hospital Center,70 or Older,112,M,Other Race,Spanish/Hispanic,1,Emergency,Home or Self Care,2020,DIG013,DIVERTICULOSIS AND DIVERTICULITIS,GIS004,GI SYSTEM ENDOSCOPY WITHOUT BIOPSY (DIAGNOSTIC),244,DIVERTICULITIS & DIVERTICULOSIS,06,DISEASES AND DISORDERS OF THE DIGESTIVE SYSTEM,1,Minor,Minor,Medical,Medicare,Medicaid,,,,Y,15448.73,8884.32
New York City,Manhattan,7002001,001438,Bellevue Hospital Center,30 to 49,112,M,Other Race,Spanish/Hispanic,1,Emergency,Home or Self Care,2020,DIG013,DIVERTICULOSIS AND DIVERTICULITIS,ADM015,ADMINISTRATION OF ANTIBIOTICS,244,DIVERTICULITIS & DIVERTICULOSIS,06,DISEASES AND DISORDERS OF THE DIGESTIVE SYSTEM,1,Minor,Minor,Medical,Medicaid,,,,,Y,8635.83,4966.33
New York City,Manhattan,7002001,001438,Bellevue Hospital Center,50 to 69,100,F,White,Not Span/Hispanic,3,Emergency,Home or Self Care,2020,DIG013,DIVERTICULOSIS AND DIVERTICULITIS,GIS002,COLONOSCOPY AND PROCTOSCOPY WITH BIOPSY,244,DIVERTICULITIS & DIVERTICULOSIS,06,DISEASES AND DISORDERS OF THE DIGESTIVE SYSTEM,4,Extreme,Major,Medical,Private Health Insurance,,,,,Y,32928.45,18936.62
New York City,Manhattan,7002001,001438,Bellevue Hospital Center,30 to 49,OOS,M,Other Race,Not Span/Hispanic,3,Emergency,Home or Self Care,2020,DIG013,DIVERTICULOSIS AND DIVERTICULITIS,GIS006,PARACENTESIS,244,DIVERTICULITIS & DIVERTICULOSIS,06,DISEASES AND DISORDERS OF THE DIGESTIVE SYSTEM,1,Minor,Minor,Medical,Medicaid,,,,,Y,29780.24,17126.14
New York City,Manhattan,7002001,001438,Bellevue Hospital Center,50 to 69,112,F,Black/African American,Spanish/Hispanic,7,Elective,Home or Self Care,2020,DIG013,DIVERTICULOSIS AND DIVERTICULITIS,ADM001,TRANSFUSION OF BLOOD AND BLOOD PRODUCTS,244,DIVERTICULITIS & DIVERTICULOSIS,06,DISEASES AND DISORDERS OF THE DIGESTIVE SYSTEM,3,Major,Major,Medical,Medicare,,,,,Y,63341.39,36426.62
New York City,Manhattan,7002001,001438,Bellevue Hospital Center,50 to 69,100,M,Other Race,Not Span/Hispanic,3,Emergency,Home or Self Care,2020,DIG013,DIVERTICULOSIS AND DIVERTICULITIS,ADM015,ADMINISTRATION OF ANTIBIOTICS,244,DIVERTICULITIS & DIVERTICULOSIS,06,DISEASES AND DISORDERS OF THE DIGESTIVE SYSTEM,2,Moderate,Moderate,Medical,Medicare,,,,,Y,27539.51,15837.53
New York City,Manhattan,7002001,001438,Bellevue Hospital Center,50 to 69,100,M,Black/African American,Not Span/Hispanic,3,Emergency,Left Against Medical Advice,2020,DIG013,DIVERTICULOSIS AND DIVERTICULITIS,ADM015,ADMINISTRATION OF ANTIBIOTICS,244,DIVERTICULITIS & DIVERTICULOSIS,06,DISEASES AND DISORDERS OF THE DIGESTIVE SYSTEM,1,Minor,Minor,Medical,Medicaid,,,,,Y,23790.09,13681.3
New York City,Manhattan,7002001,001438,Bellevue Hospital Center,50 to 69,113,M,Other Race,Unknown,2,Elective,Court/Law Enforcement,2020,DIG013,DIVERTICULOSIS AND DIVERTICULITIS,GIS001,ESOPHAGOGASTRODUODENOSCOPY (EGD) WITH BIOPSY,244,DIVERTICULITIS & DIVERTICULOSIS,06,DISEASES AND DISORDERS OF THE DIGESTIVE SYSTEM,1,Minor,Minor,Medical,Medicaid,,,,,N,28687.06,16497.47
New York City,Manhattan,7002001,001438,Bellevue Hospital Center,50 to 69,112,F,Black/African American,Unknown,2,Emergency,Home or Self Care,2020,DIG013,DIVERTICULOSIS AND DIVERTICULITIS,GIS004,GI SYSTEM ENDOSCOPY WITHOUT BIOPSY (DIAGNOSTIC),244,DIVERTICULITIS & DIVERTICULOSIS,06,DISEASES AND DISORDERS OF THE DIGESTIVE SYSTEM,2,Moderate,Minor,Medical,Medicaid,,,,,Y,18891.09,10863.96
New York City,Manhattan,7002001,001438,Bellevue Hospital Center,30 to 49,104,M,Other Race,Not Span/Hispanic,16,Emergency,Home or Self Care,2020,DIG013,DIVERTICULOSIS AND DIVERTICULITIS,GIS004,GI SYSTEM ENDOSCOPY WITHOUT BIOPSY (DIAGNOSTIC),244,DIVERTICULITIS & DIVERTICULOSIS,06,DISEASES AND DISORDERS OF THE DIGESTIVE SYSTEM,3,Major,Major,Medical,Medicaid,,,,,Y,159486.88,91718.35
New York City,Manhattan,7002001,001438,Bellevue Hospital Center,50 to 69,113,M,Other Race,Spanish/Hispanic,5,Emergency,Home or Self Care,2020,DIG013,DIVERTICULOSIS AND DIVERTICULITIS,URN001,CYSTOSCOPY AND URETEROSCOPY (INCLUDING BIOPSY),244,DIVERTICULITIS & DIVERTICULOSIS,06,DISEASES AND DISORDERS OF THE DIGESTIVE SYSTEM,2,Moderate,Minor,Medical,Medicaid,,,,,Y,36239.94,20841.01
New York City,Manhattan,7002001,001438,Bellevue Hospital Center,50 to 69,113,M,Black/African American,Spanish/Hispanic,54,Emergency,Medicaid Cert Nursing Facility,2020,DIG013,DIVERTICULOSIS AND DIVERTICULITIS,GIS007,GI SYSTEM DRAINAGE (EXCLUDING PARACENTESIS),244,DIVERTICULITIS & DIVERTICULOSIS,06,DISEASES AND DISORDERS OF THE DIGESTIVE SYSTEM,4,Extreme,Extreme,Medical,Medicaid,,,,,Y,467416.58,268803.8
New York City,Manhattan,7002001,001438,Bellevue Hospital Center,70 or Older,112,F,Black/African American,Not Span/Hispanic,8,Emergency,Home w/ Home Health Services,2020,DIG013,DIVERTICULOSIS AND DIVERTICULITIS,GIS004,GI SYSTEM ENDOSCOPY WITHOUT BIOPSY (DIAGNOSTIC),244,DIVERTICULITIS & DIVERTICULOSIS,06,DISEASES AND DISORDERS OF THE DIGESTIVE SYSTEM,4,Extreme,Extreme,Medical,Medicare,,,,,Y,134429.03,77307.98
