Hospital Service Area,Hospital County,Operating Certificate Number,Permanent Facility Id,Facility Name,Age Group,Zip Code - 3 digits,Gender,Race,Ethnicity,Length of Stay,Type of Admission,Patient Disposition,Discharge Year,CCS Diagnosis Code,CCS Diagnosis Description,CCS Procedure Code,CCS Procedure Description,APR DRG Code,APR DRG Description,APR MDC Code,APR MDC Description,APR Severity of Illness Code,APR Severity of Illness Description,APR Risk of Mortality,APR Medical Surgical Description,Payment Typology 1,Payment Typology 2,Payment Typology 3,Birth Weight,Abortion Edit Indicator,Emergency Department Indicator,Total Charges,Total Costs
New York City,Manhattan,7002054,001464,New York-Presbyterian Hospital - Columbia Presbyterian Center,18 to 29,104,M,Other Race,Not Span/Hispanic,2,Emergency,Home or Self Care,2018,DIG011,REGIONAL ENTERITIS AND ULCERATIVE COLITIS,,,245,INFLAMMATORY BOWEL DISEASE,06,DISEASES AND DISORDERS OF THE DIGESTIVE SYSTEM,1,Minor,Minor,Medical,Medicaid,Medicaid,Self-Pay,,,true,74689.73,33102.68
New York City,Manhattan,7002054,001458,New York-Presbyterian Hospital - New York Weill Cornell Center,0 to 17,111,M,White,Multi-ethnic,6,Emergency,Home or Self Care,2018,DIG011,REGIONAL ENTERITIS AND ULCERATIVE COLITIS,ADM001,TRANSFUSION OF BLOOD AND BLOOD PRODUCTS,245,INFLAMMATORY BOWEL DISEASE,06,DISEASES AND DISORDERS OF THE DIGESTIVE SYSTEM,2,Moderate,Minor,Medical,"Managed Care, Unspecified",Medicaid,Self-Pay,,,true,63710.48,13975.28
Long Island,Nassau,2951001,000541,North Shore University Hospital,50 to 69,114,M,Black/African American,Not Span/Hispanic,2,Emergency,Home or Self Care,2018,DIG011,REGIONAL ENTERITIS AND ULCERATIVE COLITIS,,,245,INFLAMMATORY BOWEL DISEASE,06,DISEASES AND DISORDERS OF THE DIGESTIVE SYSTEM,1,Minor,Minor,Medical,Private Health Insurance,,,,,true,34766.36,5583.33
Finger Lakes,Monroe,2701003,000411,Rochester General Hospital,18 to 29,146,M,Black/African American,Not Span/Hispanic,1,Emergency,Home or Self Care,2018,DIG011,REGIONAL ENTERITIS AND ULCERATIVE COLITIS,,,245,INFLAMMATORY BOWEL DISEASE,06,DISEASES AND DISORDERS OF THE DIGESTIVE SYSTEM,1,Minor,Minor,Medical,Medicaid,,,,,true,8490.63,3191.16
Western NY,Erie,1401013,000218,Sisters of Charity Hospital,30 to 49,140,F,White,Not Span/Hispanic,5,Emergency,Home or Self Care,2018,DIG011,REGIONAL ENTERITIS AND ULCERATIVE COLITIS,,,245,INFLAMMATORY BOWEL DISEASE,06,DISEASES AND DISORDERS OF THE DIGESTIVE SYSTEM,3,Major,Moderate,Medical,Private Health Insurance,,,,,true,16595.56,7648.72
New York City,Queens,7003003,001629,Jamaica Hospital Medical Center,50 to 69,114,F,Other Race,Not Span/Hispanic,5,Emergency,Home or Self Care,2018,DIG011,REGIONAL ENTERITIS AND ULCERATIVE COLITIS,GIS002,COLONOSCOPY AND PROCTOSCOPY WITH BIOPSY,245,INFLAMMATORY BOWEL DISEASE,06,DISEASES AND DISORDERS OF THE DIGESTIVE SYSTEM,2,Moderate,Minor,Medical,Medicaid,,,,,true,21430.68,11521.29
New York City,Bronx,7000001,001178,BronxCare Hospital Center,30 to 49,104,M,Other Race,Spanish/Hispanic,3,Emergency,Left Against Medical Advice,2018,DIG011,REGIONAL ENTERITIS AND ULCERATIVE COLITIS,,,245,INFLAMMATORY BOWEL DISEASE,06,DISEASES AND DISORDERS OF THE DIGESTIVE SYSTEM,3,Major,Major,Medical,Medicaid,Medicaid,,,,true,11474.28,13400.6
New York City,Bronx,7000006,001168,Montefiore Medical Center-Wakefield Hospital,70 or Older,104,M,Other Race,Not Span/Hispanic,4,Emergency,Home or Self Care,2018,DIG011,REGIONAL ENTERITIS AND ULCERATIVE COLITIS,GIS002,COLONOSCOPY AND PROCTOSCOPY WITH BIOPSY,245,INFLAMMATORY BOWEL DISEASE,06,DISEASES AND DISORDERS OF THE DIGESTIVE SYSTEM,2,Moderate,Minor,Medical,Medicare,,,,,true,37951.88,9113.55
Finger Lakes,Wayne,5820000,001028,Newark-Wayne Community Hospital,50 to 69,145,F,White,Not Span/Hispanic,4,Emergency,Home or Self Care,2018,DIG011,REGIONAL ENTERITIS AND ULCERATIVE COLITIS,GIS016,GI SYSTEM ENDOSCOPIC THERAPEUTIC PROCEDURES,245,INFLAMMATORY BOWEL DISEASE,06,DISEASES AND DISORDERS OF THE DIGESTIVE SYSTEM,1,Minor,Minor,Medical,Self-Pay,,,,,true,16069.07,6978.98
Long Island,Nassau,2951001,000541,North Shore University Hospital,18 to 29,113,M,White,Not Span/Hispanic,9,Emergency,Home or Self Care,2018,DIG011,REGIONAL ENTERITIS AND ULCERATIVE COLITIS,GIS017,GASTROSTOMY,245,INFLAMMATORY BOWEL DISEASE,06,DISEASES AND DISORDERS OF THE DIGESTIVE SYSTEM,1,Minor,Minor,Medical,Private Health Insurance,,,,,true,112504.99,18423.91
Hudson Valley,Westchester,5902001,001045,White Plains Hospital Center,70 or Older,125,M,Other Race,Not Span/Hispanic,12,Emergency,Inpatient Rehabilitation Facility,2018,DIG011,REGIONAL ENTERITIS AND ULCERATIVE COLITIS,GIS004,GI SYSTEM ENDOSCOPY WITHOUT BIOPSY (DIAGNOSTIC),245,INFLAMMATORY BOWEL DISEASE,06,DISEASES AND DISORDERS OF THE DIGESTIVE SYSTEM,3,Major,Major,Medical,Medicare,,,,,true,70366,17663.8
New York City,Manhattan,7002024,001456,Mount Sinai Hospital,30 to 49,111,M,White,Not Span/Hispanic,4,Urgent,Home or Self Care,2018,DIG011,REGIONAL ENTERITIS AND ULCERATIVE COLITIS,GIS029,"LOWER GI THERAPEUTIC PROCEDURES, NEC (EXCLUDING OPEN AND LAPAROSCOPIC)",245,INFLAMMATORY BOWEL DISEASE,06,DISEASES AND DISORDERS OF THE DIGESTIVE SYSTEM,2,Moderate,Minor,Medical,Medicare,Medicaid,Self-Pay,,,false,45399.73,14715.36
New York City,Kings,7001020,001305,Maimonides Medical Center,50 to 69,112,F,White,Not Span/Hispanic,5,Emergency,Home or Self Care,2018,DIG011,REGIONAL ENTERITIS AND ULCERATIVE COLITIS,GIS004,GI SYSTEM ENDOSCOPY WITHOUT BIOPSY (DIAGNOSTIC),245,INFLAMMATORY BOWEL DISEASE,06,DISEASES AND DISORDERS OF THE DIGESTIVE SYSTEM,3,Major,Moderate,Medical,Medicare,Blue Cross/Blue Shield,Self-Pay,,,true,43295.05,12237.34
Long Island,Suffolk,5149000,000895,John T Mather Memorial Hospital of Port Jefferson New York Inc,70 or Older,117,F,White,Not Span/Hispanic,5,Emergency,Home or Self Care,2018,DIG011,REGIONAL ENTERITIS AND ULCERATIVE COLITIS,GIS002,COLONOSCOPY AND PROCTOSCOPY WITH BIOPSY,245,INFLAMMATORY BOWEL DISEASE,06,DISEASES AND DISORDERS OF THE DIGESTIVE SYSTEM,1,Minor,Moderate,Medical,Medicare,Private Health Insurance,,,,true,47144.15,10980.83
Finger Lakes,Monroe,2701005,000413,Strong Memorial Hospital,18 to 29,OOS,F,White,Not Span/Hispanic,14,Emergency,Home or Self Care,2018,DIG011,REGIONAL ENTERITIS AND ULCERATIVE COLITIS,GIS002,COLONOSCOPY AND PROCTOSCOPY WITH BIOPSY,245,INFLAMMATORY BOWEL DISEASE,06,DISEASES AND DISORDERS OF THE DIGESTIVE SYSTEM,1,Minor,Minor,Medical,Private Health Insurance,,,,,true,58793.91,26365.58
Finger Lakes,Monroe,2701005,000413,Strong Memorial Hospital,30 to 49,144,M,White,Not Span/Hispanic,1,Emergency,Left Against Medical Advice,2018,DIG011,REGIONAL ENTERITIS AND ULCERATIVE COLITIS,,,245,INFLAMMATORY BOWEL DISEASE,06,DISEASES AND DISORDERS OF THE DIGESTIVE SYSTEM,1,Minor,Minor,Medical,Medicaid,,,,,true,10458.52,3009.34
Central NY,Onondaga,3301008,000636,Crouse Hospital,30 to 49,131,M,White,Not Span/Hispanic,1,Emergency,Left Against Medical Advice,2018,DIG011,REGIONAL ENTERITIS AND ULCERATIVE COLITIS,ADM014,REGIONAL ANESTHESIA,245,INFLAMMATORY BOWEL DISEASE,06,DISEASES AND DISORDERS OF THE DIGESTIVE SYSTEM,2,Moderate,Minor,Medical,Medicare,Medicare,,,,true,5996.32,2465.29
Long Island,Nassau,2951001,000541,North Shore University Hospital,30 to 49,114,M,Black/African American,Not Span/Hispanic,3,Emergency,Home or Self Care,2018,DIG011,REGIONAL ENTERITIS AND ULCERATIVE COLITIS,,,245,INFLAMMATORY BOWEL DISEASE,06,DISEASES AND DISORDERS OF THE DIGESTIVE SYSTEM,3,Major,Moderate,Medical,Medicare,Medicaid,,,,true,43002.7,6853.33
Long Island,Nassau,2909000,000513,Mercy Hospital,30 to 49,117,F,White,Not Span/Hispanic,4,Emergency,Home or Self Care,2018,DIG011,REGIONAL ENTERITIS AND ULCERATIVE COLITIS,GIS002,COLONOSCOPY AND PROCTOSCOPY WITH BIOPSY,245,INFLAMMATORY BOWEL DISEASE,06,DISEASES AND DISORDERS OF THE DIGESTIVE SYSTEM,1,Minor,Minor,Medical,Blue Cross/Blue Shield,,,,,true,41743.42,8617.73
New York City,Manhattan,7002054,001464,New York-Presbyterian Hospital - Columbia Presbyterian Center,18 to 29,100,F,White,Spanish/Hispanic,3,Emergency,Home or Self Care,2018,DIG011,REGIONAL ENTERITIS AND ULCERATIVE COLITIS,,,245,INFLAMMATORY BOWEL DISEASE,06,DISEASES AND DISORDERS OF THE DIGESTIVE SYSTEM,2,Moderate,Minor,Medical,Blue Cross/Blue Shield,Self-Pay,,,,true,38268.88,8404.28
Central NY,Onondaga,3301007,000635,University Hospital SUNY Health Science Center,18 to 29,132,F,White,Not Span/Hispanic,2,Emergency,Home or Self Care,2018,DIG011,REGIONAL ENTERITIS AND ULCERATIVE COLITIS,ADM001,TRANSFUSION OF BLOOD AND BLOOD PRODUCTS,245,INFLAMMATORY BOWEL DISEASE,06,DISEASES AND DISORDERS OF THE DIGESTIVE SYSTEM,3,Major,Moderate,Medical,Private Health Insurance,,,,,true,23279.8,6610.02
New York City,Manhattan,7002054,001464,New York-Presbyterian Hospital - Columbia Presbyterian Center,18 to 29,100,M,White,Not Span/Hispanic,9,Emergency,Home or Self Care,2018,DIG011,REGIONAL ENTERITIS AND ULCERATIVE COLITIS,GIS004,GI SYSTEM ENDOSCOPY WITHOUT BIOPSY (DIAGNOSTIC),245,INFLAMMATORY BOWEL DISEASE,06,DISEASES AND DISORDERS OF THE DIGESTIVE SYSTEM,2,Moderate,Minor,Medical,Private Health Insurance,Self-Pay,,,,true,140062.03,41079.46
Western NY,Niagara,3121001,000583,Mount St. Mary's Hospital and Health Center,30 to 49,141,M,White,Not Span/Hispanic,3,Emergency,Home or Self Care,2018,DIG011,REGIONAL ENTERITIS AND ULCERATIVE COLITIS,,,245,INFLAMMATORY BOWEL DISEASE,06,DISEASES AND DISORDERS OF THE DIGESTIVE SYSTEM,1,Minor,Minor,Medical,Blue Cross/Blue Shield,,,,,true,6199.2,3972.84
Long Island,Nassau,2908000,000511,NYU Langone Hospital-Long Island,18 to 29,115,F,White,Not Span/Hispanic,15,Emergency,Home or Self Care,2018,DIG011,REGIONAL ENTERITIS AND ULCERATIVE COLITIS,GIS002,COLONOSCOPY AND PROCTOSCOPY WITH BIOPSY,245,INFLAMMATORY BOWEL DISEASE,06,DISEASES AND DISORDERS OF THE DIGESTIVE SYSTEM,2,Moderate,Minor,Medical,Federal/State/Local/VA,,,,,true,163018.64,33496.7
Western NY,Erie,1401005,000210,Erie County Medical Center,50 to 69,142,M,Black/African American,Not Span/Hispanic,3,Emergency,Left Against Medical Advice,2018,DIG011,REGIONAL ENTERITIS AND ULCERATIVE COLITIS,ADM001,TRANSFUSION OF BLOOD AND BLOOD PRODUCTS,245,INFLAMMATORY BOWEL DISEASE,06,DISEASES AND DISORDERS OF THE DIGESTIVE SYSTEM,3,Major,Minor,Medical,Medicaid,Medicaid,,,,true,9686.35,5349.68
New York City,Queens,7003004,001630,Long Island Jewish Medical Center,70 or Older,114,F,Other Race,Not Span/Hispanic,7,Emergency,Home w/ Home Health Services,2018,DIG011,REGIONAL ENTERITIS AND ULCERATIVE COLITIS,GIS004,GI SYSTEM ENDOSCOPY WITHOUT BIOPSY (DIAGNOSTIC),245,INFLAMMATORY BOWEL DISEASE,06,DISEASES AND DISORDERS OF THE DIGESTIVE SYSTEM,3,Major,Moderate,Medical,Medicare,Medicaid,Self-Pay,,,false,63584.78,11557.49
Capital/Adirond,Albany,0101004,000005,St. Peter's Hospital,18 to 29,122,F,Black/African American,Not Span/Hispanic,7,Emergency,Home or Self Care,2018,DIG011,REGIONAL ENTERITIS AND ULCERATIVE COLITIS,GIS005,EXPLORATION OF PERITONEAL CAVITY,245,INFLAMMATORY BOWEL DISEASE,06,DISEASES AND DISORDERS OF THE DIGESTIVE SYSTEM,2,Moderate,Minor,Medical,Private Health Insurance,,,,,true,53408.5,23774.61
Central NY,Onondaga,3301003,000630,St. Joseph's Hospital Health Center,50 to 69,130,F,White,Not Span/Hispanic,3,Emergency,Home or Self Care,2018,DIG011,REGIONAL ENTERITIS AND ULCERATIVE COLITIS,,,245,INFLAMMATORY BOWEL DISEASE,06,DISEASES AND DISORDERS OF THE DIGESTIVE SYSTEM,1,Minor,Minor,Medical,Federal/State/Local/VA,,,,,true,15967.69,5923.34
Long Island,Nassau,2952005,000552,Plainview Hospital,50 to 69,117,F,White,Not Span/Hispanic,2,Emergency,Home or Self Care,2018,DIG011,REGIONAL ENTERITIS AND ULCERATIVE COLITIS,,,245,INFLAMMATORY BOWEL DISEASE,06,DISEASES AND DISORDERS OF THE DIGESTIVE SYSTEM,1,Minor,Minor,Medical,Private Health Insurance,,,,,true,22579.28,5903.91
Long Island,Nassau,2952005,000552,Plainview Hospital,30 to 49,117,F,Black/African American,Not Span/Hispanic,2,Emergency,Home or Self Care,2018,DIG011,REGIONAL ENTERITIS AND ULCERATIVE COLITIS,GIS002,COLONOSCOPY AND PROCTOSCOPY WITH BIOPSY,245,INFLAMMATORY BOWEL DISEASE,06,DISEASES AND DISORDERS OF THE DIGESTIVE SYSTEM,2,Moderate,Minor,Medical,Private Health Insurance,,,,,true,27445.23,8634.84
Long Island,Suffolk,5149000,000895,John T Mather Memorial Hospital of Port Jefferson New York Inc,50 to 69,119,F,White,Not Span/Hispanic,13,Emergency,Home or Self Care,2018,DIG011,REGIONAL ENTERITIS AND ULCERATIVE COLITIS,GIS002,COLONOSCOPY AND PROCTOSCOPY WITH BIOPSY,245,INFLAMMATORY BOWEL DISEASE,06,DISEASES AND DISORDERS OF THE DIGESTIVE SYSTEM,2,Moderate,Minor,Medical,Blue Cross/Blue Shield,,,,,true,122122.59,29756.64
Capital/Adirond,Albany,0101000,000001,Albany Medical Center Hospital,50 to 69,121,F,White,Not Span/Hispanic,3,Emergency,Home or Self Care,2018,DIG011,REGIONAL ENTERITIS AND ULCERATIVE COLITIS,GIS004,GI SYSTEM ENDOSCOPY WITHOUT BIOPSY (DIAGNOSTIC),245,INFLAMMATORY BOWEL DISEASE,06,DISEASES AND DISORDERS OF THE DIGESTIVE SYSTEM,2,Moderate,Minor,Medical,Medicare,Medicare,,,,true,21726.58,6895.85
Capital/Adirond,Albany,0101000,000001,Albany Medical Center Hospital,0 to 17,120,F,White,Not Span/Hispanic,8,Urgent,Home or Self Care,2018,DIG011,REGIONAL ENTERITIS AND ULCERATIVE COLITIS,,,245,INFLAMMATORY BOWEL DISEASE,06,DISEASES AND DISORDERS OF THE DIGESTIVE SYSTEM,2,Moderate,Minor,Medical,Blue Cross/Blue Shield,,,,,false,32735.63,12859.56
Long Island,Suffolk,5149000,000895,John T Mather Memorial Hospital of Port Jefferson New York Inc,50 to 69,117,F,White,Not Span/Hispanic,8,Emergency,Home or Self Care,2018,DIG011,REGIONAL ENTERITIS AND ULCERATIVE COLITIS,,,245,INFLAMMATORY BOWEL DISEASE,06,DISEASES AND DISORDERS OF THE DIGESTIVE SYSTEM,3,Major,Moderate,Medical,Blue Cross/Blue Shield,Blue Cross/Blue Shield,Private Health Insurance,,,true,60813.89,15016.61
Hudson Valley,Dutchess,5957001,000180,Mid-Hudson Valley Division of Westchester Medical Center,50 to 69,125,M,White,Not Span/Hispanic,1,Emergency,Home or Self Care,2018,DIG011,REGIONAL ENTERITIS AND ULCERATIVE COLITIS,,,245,INFLAMMATORY BOWEL DISEASE,06,DISEASES AND DISORDERS OF THE DIGESTIVE SYSTEM,1,Minor,Minor,Medical,Medicare,Private Health Insurance,,,,true,24771.1,3384.8
Hudson Valley,Orange,3523000,000699,Garnet Health Medical Center,70 or Older,109,F,White,Not Span/Hispanic,8,Emergency,Inpatient Rehabilitation Facility,2018,DIG011,REGIONAL ENTERITIS AND ULCERATIVE COLITIS,,,245,INFLAMMATORY BOWEL DISEASE,06,DISEASES AND DISORDERS OF THE DIGESTIVE SYSTEM,3,Major,Major,Medical,Medicare,Blue Cross/Blue Shield,,,,true,59703.35,14448.67
New York City,Kings,7001045,001692,Woodhull Medical & Mental Health Center,18 to 29,113,M,Other Race,Spanish/Hispanic,6,Emergency,Home or Self Care,2018,DIG011,REGIONAL ENTERITIS AND ULCERATIVE COLITIS,GIS002,COLONOSCOPY AND PROCTOSCOPY WITH BIOPSY,245,INFLAMMATORY BOWEL DISEASE,06,DISEASES AND DISORDERS OF THE DIGESTIVE SYSTEM,1,Minor,Minor,Medical,Medicaid,,,,,true,37045.8,28924.73
New York City,Queens,7003000,001626,Elmhurst Hospital Center,50 to 69,113,M,Other Race,Spanish/Hispanic,5,Emergency,Home or Self Care,2018,DIG011,REGIONAL ENTERITIS AND ULCERATIVE COLITIS,GIS002,COLONOSCOPY AND PROCTOSCOPY WITH BIOPSY,245,INFLAMMATORY BOWEL DISEASE,06,DISEASES AND DISORDERS OF THE DIGESTIVE SYSTEM,1,Minor,Minor,Medical,Medicaid,,,,,true,30963.14,18422.02
Long Island,Suffolk,5154000,000924,South Shore University Hospital,50 to 69,117,F,White,Not Span/Hispanic,3,Emergency,Home or Self Care,2018,DIG011,REGIONAL ENTERITIS AND ULCERATIVE COLITIS,,,245,INFLAMMATORY BOWEL DISEASE,06,DISEASES AND DISORDERS OF THE DIGESTIVE SYSTEM,2,Moderate,Minor,Medical,Medicare,Medicare,,,,true,32019.35,6140.46
Western NY,Erie,1401005,000210,Erie County Medical Center,30 to 49,142,F,Black/African American,Not Span/Hispanic,7,Emergency,Home w/ Home Health Services,2018,DIG011,REGIONAL ENTERITIS AND ULCERATIVE COLITIS,GIS004,GI SYSTEM ENDOSCOPY WITHOUT BIOPSY (DIAGNOSTIC),245,INFLAMMATORY BOWEL DISEASE,06,DISEASES AND DISORDERS OF THE DIGESTIVE SYSTEM,3,Major,Minor,Medical,Medicaid,Medicaid,,,,true,15062.92,10948
New York City,Manhattan,7002024,001456,Mount Sinai Hospital,18 to 29,100,F,White,Not Span/Hispanic,5,Emergency,Home or Self Care,2018,DIG011,REGIONAL ENTERITIS AND ULCERATIVE COLITIS,GIS002,COLONOSCOPY AND PROCTOSCOPY WITH BIOPSY,245,INFLAMMATORY BOWEL DISEASE,06,DISEASES AND DISORDERS OF THE DIGESTIVE SYSTEM,3,Major,Moderate,Medical,Private Health Insurance,Self-Pay,,,,true,68678.22,23321.65
Capital/Adirond,Albany,0101000,000001,Albany Medical Center Hospital,0 to 17,124,M,White,Not Span/Hispanic,4,Emergency,Home or Self Care,2018,DIG011,REGIONAL ENTERITIS AND ULCERATIVE COLITIS,,,245,INFLAMMATORY BOWEL DISEASE,06,DISEASES AND DISORDERS OF THE DIGESTIVE SYSTEM,3,Major,Moderate,Medical,Private Health Insurance,,,,,true,31978.63,9120.01
New York City,Manhattan,7002053,001463,NYU Langone Hospitals,18 to 29,112,F,Other Race,Spanish/Hispanic,14,Emergency,Home or Self Care,2018,DIG011,REGIONAL ENTERITIS AND ULCERATIVE COLITIS,GNR004,ENDOSCOPIC CONTROL OF BLEEDING,245,INFLAMMATORY BOWEL DISEASE,06,DISEASES AND DISORDERS OF THE DIGESTIVE SYSTEM,3,Major,Major,Medical,Medicaid,,,,,true,164108.46,60552.74
New York City,Queens,7003004,001638,Long Island Jewish Forest Hills,30 to 49,113,M,Other Race,Spanish/Hispanic,3,Emergency,Home or Self Care,2018,DIG011,REGIONAL ENTERITIS AND ULCERATIVE COLITIS,,,245,INFLAMMATORY BOWEL DISEASE,06,DISEASES AND DISORDERS OF THE DIGESTIVE SYSTEM,2,Moderate,Minor,Medical,Medicaid,,,,,true,38131.64,6040.64
New York City,Manhattan,7002024,001456,Mount Sinai Hospital,30 to 49,112,F,White,Not Span/Hispanic,6,Emergency,Home or Self Care,2018,DIG011,REGIONAL ENTERITIS AND ULCERATIVE COLITIS,IMG006,COMPUTERIZED TOMOGRAPHY (CT) WITH CONTRAST,245,INFLAMMATORY BOWEL DISEASE,06,DISEASES AND DISORDERS OF THE DIGESTIVE SYSTEM,2,Moderate,Minor,Medical,"Managed Care, Unspecified",Medicaid,Self-Pay,,,true,73179.4,25450.88
Western NY,Erie,1401014,003067,Millard Fillmore Suburban Hospital,50 to 69,142,F,White,Not Span/Hispanic,1,Emergency,Home or Self Care,2018,DIG011,REGIONAL ENTERITIS AND ULCERATIVE COLITIS,,,245,INFLAMMATORY BOWEL DISEASE,06,DISEASES AND DISORDERS OF THE DIGESTIVE SYSTEM,2,Moderate,Minor,Medical,Medicare,Self-Pay,,,,true,13481.29,4772.83
Western NY,Niagara,3101000,000565,Eastern Niagara Hospital - Lockport Division,30 to 49,143,M,Black/African American,Not Span/Hispanic,1,Emergency,Left Against Medical Advice,2018,DIG011,REGIONAL ENTERITIS AND ULCERATIVE COLITIS,,,245,INFLAMMATORY BOWEL DISEASE,06,DISEASES AND DISORDERS OF THE DIGESTIVE SYSTEM,1,Minor,Minor,Medical,Medicaid,,,,,true,5319.74,1541.6
Capital/Adirond,Albany,0101004,000005,St. Peter's Hospital,70 or Older,122,F,White,Not Span/Hispanic,13,Emergency,Skilled Nursing Home,2018,DIG011,REGIONAL ENTERITIS AND ULCERATIVE COLITIS,GIS002,COLONOSCOPY AND PROCTOSCOPY WITH BIOPSY,245,INFLAMMATORY BOWEL DISEASE,06,DISEASES AND DISORDERS OF THE DIGESTIVE SYSTEM,3,Major,Major,Medical,Medicare,Medicare,Federal/State/Local/VA,,,true,63577.32,26934.46
Capital/Adirond,Albany,0101004,000005,St. Peter's Hospital,18 to 29,122,F,White,Not Span/Hispanic,5,Emergency,Home or Self Care,2018,DIG011,REGIONAL ENTERITIS AND ULCERATIVE COLITIS,GIS002,COLONOSCOPY AND PROCTOSCOPY WITH BIOPSY,245,INFLAMMATORY BOWEL DISEASE,06,DISEASES AND DISORDERS OF THE DIGESTIVE SYSTEM,2,Moderate,Minor,Medical,Private Health Insurance,,,,,true,27681.3,11378.19
New York City,Manhattan,7002054,001458,New York-Presbyterian Hospital - New York Weill Cornell Center,0 to 17,114,M,Black/African American,Not Span/Hispanic,7,Emergency,Home or Self Care,2018,DIG011,REGIONAL ENTERITIS AND ULCERATIVE COLITIS,GIS001,ESOPHAGOGASTRODUODENOSCOPY (EGD) WITH BIOPSY,245,INFLAMMATORY BOWEL DISEASE,06,DISEASES AND DISORDERS OF THE DIGESTIVE SYSTEM,3,Major,Minor,Medical,"Managed Care, Unspecified",Medicaid,Self-Pay,,,false,100053.59,33231.03
New York City,Bronx,7000024,001186,North Central Bronx Hospital,30 to 49,104,F,Other Race,Unknown,1,Emergency,Short-term Hospital,2018,DIG011,REGIONAL ENTERITIS AND ULCERATIVE COLITIS,,,245,INFLAMMATORY BOWEL DISEASE,06,DISEASES AND DISORDERS OF THE DIGESTIVE SYSTEM,2,Moderate,Minor,Medical,Medicare,Medicare,Medicaid,,,true,10827.31,6499.73
Central NY,Onondaga,3301008,000636,Crouse Hospital,70 or Older,132,F,White,Not Span/Hispanic,4,Emergency,Skilled Nursing Home,2018,DIG011,REGIONAL ENTERITIS AND ULCERATIVE COLITIS,ADM017,ADMINISTRATION OF NUTRITIONAL AND ELECTROLYTIC SUBSTANCES,245,INFLAMMATORY BOWEL DISEASE,06,DISEASES AND DISORDERS OF THE DIGESTIVE SYSTEM,3,Major,Major,Medical,Medicare,Medicare,Private Health Insurance,,,true,11452.14,5318.46
Southern Tier,Broome,0301001,000043,Our Lady of Lourdes Memorial Hospital,30 to 49,139,M,Black/African American,Not Span/Hispanic,4,Urgent,Home or Self Care,2018,DIG011,REGIONAL ENTERITIS AND ULCERATIVE COLITIS,SKB002,INCISION AND DRAINAGE OF SKIN,245,INFLAMMATORY BOWEL DISEASE,06,DISEASES AND DISORDERS OF THE DIGESTIVE SYSTEM,2,Moderate,Minor,Medical,Medicaid,Self-Pay,Self-Pay,,,false,17347.12,5472.23
New York City,Richmond,7004003,001740,Staten Island University Hosp-North,0 to 17,103,M,White,Not Span/Hispanic,3,Emergency,Home or Self Care,2018,DIG011,REGIONAL ENTERITIS AND ULCERATIVE COLITIS,,,245,INFLAMMATORY BOWEL DISEASE,06,DISEASES AND DISORDERS OF THE DIGESTIVE SYSTEM,2,Moderate,Minor,Medical,Medicaid,Medicaid,,,,true,22434.68,12216.78
Hudson Valley,Rockland,4329000,000779,Good Samaritan Hospital of Suffern,70 or Older,109,F,White,Not Span/Hispanic,8,Emergency,Home w/ Home Health Services,2018,DIG011,REGIONAL ENTERITIS AND ULCERATIVE COLITIS,GIS002,COLONOSCOPY AND PROCTOSCOPY WITH BIOPSY,245,INFLAMMATORY BOWEL DISEASE,06,DISEASES AND DISORDERS OF THE DIGESTIVE SYSTEM,3,Major,Moderate,Medical,Medicare,,,,,true,127962.95,19053.71
New York City,Kings,7001020,001305,Maimonides Medical Center,30 to 49,112,M,Other Race,Spanish/Hispanic,4,Emergency,Home or Self Care,2018,DIG011,REGIONAL ENTERITIS AND ULCERATIVE COLITIS,GIS002,COLONOSCOPY AND PROCTOSCOPY WITH BIOPSY,245,INFLAMMATORY BOWEL DISEASE,06,DISEASES AND DISORDERS OF THE DIGESTIVE SYSTEM,2,Moderate,Moderate,Medical,Medicaid,Self-Pay,,,,false,29092,8417.93
Long Island,Nassau,2951001,000541,North Shore University Hospital,50 to 69,114,M,Other Race,Not Span/Hispanic,3,Emergency,Home or Self Care,2018,DIG011,REGIONAL ENTERITIS AND ULCERATIVE COLITIS,GIS001,ESOPHAGOGASTRODUODENOSCOPY (EGD) WITH BIOPSY,245,INFLAMMATORY BOWEL DISEASE,06,DISEASES AND DISORDERS OF THE DIGESTIVE SYSTEM,2,Moderate,Moderate,Medical,Medicaid,Medicaid,,,,true,50278.94,10010.86
Long Island,Nassau,2951001,000541,North Shore University Hospital,70 or Older,113,F,Other Race,Not Span/Hispanic,3,Emergency,Home or Self Care,2018,DIG011,REGIONAL ENTERITIS AND ULCERATIVE COLITIS,GIS002,COLONOSCOPY AND PROCTOSCOPY WITH BIOPSY,245,INFLAMMATORY BOWEL DISEASE,06,DISEASES AND DISORDERS OF THE DIGESTIVE SYSTEM,2,Moderate,Minor,Medical,Medicare,Medicare,,,,true,55719.65,10399.19
Long Island,Nassau,2952005,000552,Plainview Hospital,30 to 49,118,M,Other Race,Not Span/Hispanic,11,Emergency,Home or Self Care,2018,DIG011,REGIONAL ENTERITIS AND ULCERATIVE COLITIS,GIS002,COLONOSCOPY AND PROCTOSCOPY WITH BIOPSY,245,INFLAMMATORY BOWEL DISEASE,06,DISEASES AND DISORDERS OF THE DIGESTIVE SYSTEM,2,Moderate,Minor,Medical,Private Health Insurance,,,,,true,94460.37,35360.54
New York City,Manhattan,7002001,001438,Bellevue Hospital Center,30 to 49,113,M,Black/African American,Not Span/Hispanic,5,Emergency,Home or Self Care,2018,DIG011,REGIONAL ENTERITIS AND ULCERATIVE COLITIS,IMG006,COMPUTERIZED TOMOGRAPHY (CT) WITH CONTRAST,245,INFLAMMATORY BOWEL DISEASE,06,DISEASES AND DISORDERS OF THE DIGESTIVE SYSTEM,1,Minor,Minor,Medical,Private Health Insurance,,,,,true,29567.57,19650.61