Hospital Service Area,Hospital County,Operating Certificate Number,Permanent Facility Id,Facility Name,Age Group,Zip Code - 3 digits,Gender,Race,Ethnicity,Length of Stay,Type of Admission,Patient Disposition,Discharge Year,CCS Diagnosis Code,CCS Diagnosis Description,CCS Procedure Code,CCS Procedure Description,APR DRG Code,APR DRG Description,APR MDC Code,APR MDC Description,APR Severity of Illness Code,APR Severity of Illness Description,APR Risk of Mortality,APR Medical Surgical Description,Payment Typology 1,Payment Typology 2,Payment Typology 3,Birth Weight,Abortion Edit Indicator,Emergency Department Indicator,Total Charges,Total Costs
Long Island,Suffolk,5123000,000885,Long Island Community Hospital,70 or Older,119,F,White,Not Span/Hispanic,8,Emergency,Home w/ Home Health Services,2019,DIG011,REGIONAL ENTERITIS AND ULCERATIVE COLITIS,GIS002,COLONOSCOPY AND PROCTOSCOPY WITH BIOPSY,245,INFLAMMATORY BOWEL DISEASE,06,DISEASES AND DISORDERS OF THE DIGESTIVE SYSTEM,2,Moderate,Moderate,Medical,Medicare,Medicare,,,,true,61729.28,12412.75
Long Island,Suffolk,5123000,000885,Long Island Community Hospital,50 to 69,117,M,White,Not Span/Hispanic,5,Emergency,Home or Self Care,2019,DIG011,REGIONAL ENTERITIS AND ULCERATIVE COLITIS,,,245,INFLAMMATORY BOWEL DISEASE,06,DISEASES AND DISORDERS OF THE DIGESTIVE SYSTEM,2,Moderate,Minor,Medical,Blue Cross/Blue Shield,,,,,true,33466.3,7175.34
Long Island,Suffolk,5123000,000885,Long Island Community Hospital,18 to 29,117,F,White,Not Span/Hispanic,14,Emergency,Home or Self Care,2019,DIG011,REGIONAL ENTERITIS AND ULCERATIVE COLITIS,GIS002,COLONOSCOPY AND PROCTOSCOPY WITH BIOPSY,245,INFLAMMATORY BOWEL DISEASE,06,DISEASES AND DISORDERS OF THE DIGESTIVE SYSTEM,2,Moderate,Minor,Medical,Private Health Insurance,Medicaid,,,,true,93739.34,19682.45
Long Island,Suffolk,5123000,000885,Long Island Community Hospital,50 to 69,117,F,Black/African American,Not Span/Hispanic,6,Emergency,Home or Self Care,2019,DIG011,REGIONAL ENTERITIS AND ULCERATIVE COLITIS,GIS002,COLONOSCOPY AND PROCTOSCOPY WITH BIOPSY,245,INFLAMMATORY BOWEL DISEASE,06,DISEASES AND DISORDERS OF THE DIGESTIVE SYSTEM,2,Moderate,Minor,Medical,Private Health Insurance,Medicaid,,,,true,62145.78,11293.29
Long Island,Suffolk,5123000,000885,Long Island Community Hospital,50 to 69,119,M,White,Not Span/Hispanic,4,Emergency,Home or Self Care,2019,DIG011,REGIONAL ENTERITIS AND ULCERATIVE COLITIS,,,245,INFLAMMATORY BOWEL DISEASE,06,DISEASES AND DISORDERS OF THE DIGESTIVE SYSTEM,2,Moderate,Moderate,Medical,Private Health Insurance,Medicaid,,,,true,38612.7,5887.54
Long Island,Suffolk,5123000,000885,Long Island Community Hospital,50 to 69,117,F,Other Race,Not Span/Hispanic,3,Emergency,Home w/ Home Health Services,2019,DIG011,REGIONAL ENTERITIS AND ULCERATIVE COLITIS,,,245,INFLAMMATORY BOWEL DISEASE,06,DISEASES AND DISORDERS OF THE DIGESTIVE SYSTEM,1,Minor,Minor,Medical,Private Health Insurance,,,,,true,28304.59,4211.13
Long Island,Suffolk,5123000,000885,Long Island Community Hospital,70 or Older,117,M,White,Not Span/Hispanic,3,Emergency,Home w/ Home Health Services,2019,DIG011,REGIONAL ENTERITIS AND ULCERATIVE COLITIS,,,245,INFLAMMATORY BOWEL DISEASE,06,DISEASES AND DISORDERS OF THE DIGESTIVE SYSTEM,3,Major,Major,Medical,Medicare,Medicaid,,,,true,37711.6,5469.74
Long Island,Suffolk,5123000,000885,Long Island Community Hospital,70 or Older,119,F,White,Not Span/Hispanic,5,Emergency,Home or Self Care,2019,DIG011,REGIONAL ENTERITIS AND ULCERATIVE COLITIS,,,245,INFLAMMATORY BOWEL DISEASE,06,DISEASES AND DISORDERS OF THE DIGESTIVE SYSTEM,2,Moderate,Minor,Medical,Medicare,Medicare,Blue Cross/Blue Shield,,,true,39308.33,6933.61
Long Island,Suffolk,5123000,000885,Long Island Community Hospital,50 to 69,117,M,White,Not Span/Hispanic,2,Emergency,Home or Self Care,2019,DIG011,REGIONAL ENTERITIS AND ULCERATIVE COLITIS,,,245,INFLAMMATORY BOWEL DISEASE,06,DISEASES AND DISORDERS OF THE DIGESTIVE SYSTEM,1,Minor,Minor,Medical,Blue Cross/Blue Shield,,,,,true,25511.81,3183.79
Long Island,Suffolk,5123000,000885,Long Island Community Hospital,70 or Older,119,M,White,Not Span/Hispanic,2,Emergency,Home w/ Home Health Services,2019,DIG011,REGIONAL ENTERITIS AND ULCERATIVE COLITIS,,,245,INFLAMMATORY BOWEL DISEASE,06,DISEASES AND DISORDERS OF THE DIGESTIVE SYSTEM,2,Moderate,Moderate,Medical,Medicare,Medicare,Blue Cross/Blue Shield,,,true,32302.38,4000.14
Long Island,Suffolk,5123000,000885,Long Island Community Hospital,30 to 49,117,M,Other Race,Not Span/Hispanic,1,Emergency,Home or Self Care,2019,DIG011,REGIONAL ENTERITIS AND ULCERATIVE COLITIS,,,245,INFLAMMATORY BOWEL DISEASE,06,DISEASES AND DISORDERS OF THE DIGESTIVE SYSTEM,2,Moderate,Minor,Medical,Medicaid,,,,,true,23194.99,2149.87
Long Island,Suffolk,5123000,000885,Long Island Community Hospital,30 to 49,117,M,White,Not Span/Hispanic,3,Emergency,Home or Self Care,2019,DIG011,REGIONAL ENTERITIS AND ULCERATIVE COLITIS,ESA001,HEMODIALYSIS,245,INFLAMMATORY BOWEL DISEASE,06,DISEASES AND DISORDERS OF THE DIGESTIVE SYSTEM,3,Major,Major,Medical,Private Health Insurance,Medicaid,,,,true,32579.24,5289.8
Long Island,Suffolk,5123000,000885,Long Island Community Hospital,70 or Older,119,M,Other Race,Not Span/Hispanic,10,Emergency,Skilled Nursing Home,2019,DIG011,REGIONAL ENTERITIS AND ULCERATIVE COLITIS,OTR004,ISOLATION PROCEDURES,245,INFLAMMATORY BOWEL DISEASE,06,DISEASES AND DISORDERS OF THE DIGESTIVE SYSTEM,3,Major,Major,Medical,Medicare,Medicare,,,,true,82811.74,15356.58
Long Island,Suffolk,5123000,000885,Long Island Community Hospital,18 to 29,117,F,White,Not Span/Hispanic,4,Emergency,Home or Self Care,2019,DIG011,REGIONAL ENTERITIS AND ULCERATIVE COLITIS,,,245,INFLAMMATORY BOWEL DISEASE,06,DISEASES AND DISORDERS OF THE DIGESTIVE SYSTEM,2,Moderate,Minor,Medical,Private Health Insurance,,,,,true,57901.05,6128.66
Long Island,Suffolk,5123000,000885,Long Island Community Hospital,30 to 49,117,M,White,Not Span/Hispanic,6,Emergency,Home or Self Care,2019,DIG011,REGIONAL ENTERITIS AND ULCERATIVE COLITIS,,,245,INFLAMMATORY BOWEL DISEASE,06,DISEASES AND DISORDERS OF THE DIGESTIVE SYSTEM,1,Minor,Minor,Medical,Blue Cross/Blue Shield,,,,,true,44464.65,7983.96
Long Island,Suffolk,5123000,000885,Long Island Community Hospital,70 or Older,117,F,White,Not Span/Hispanic,5,Emergency,Skilled Nursing Home,2019,DIG011,REGIONAL ENTERITIS AND ULCERATIVE COLITIS,,,245,INFLAMMATORY BOWEL DISEASE,06,DISEASES AND DISORDERS OF THE DIGESTIVE SYSTEM,3,Major,Moderate,Medical,Medicare,,,,,true,38343.3,7249.71
Long Island,Suffolk,5123000,000885,Long Island Community Hospital,30 to 49,117,F,White,Not Span/Hispanic,3,Emergency,Home or Self Care,2019,DIG011,REGIONAL ENTERITIS AND ULCERATIVE COLITIS,GIS007,GI SYSTEM DRAINAGE (EXCLUDING PARACENTESIS),245,INFLAMMATORY BOWEL DISEASE,06,DISEASES AND DISORDERS OF THE DIGESTIVE SYSTEM,2,Moderate,Minor,Medical,Blue Cross/Blue Shield,,,,,true,33636.76,4764.92
Long Island,Suffolk,5123000,000885,Long Island Community Hospital,50 to 69,117,M,White,Not Span/Hispanic,4,Emergency,Home or Self Care,2019,DIG011,REGIONAL ENTERITIS AND ULCERATIVE COLITIS,,,245,INFLAMMATORY BOWEL DISEASE,06,DISEASES AND DISORDERS OF THE DIGESTIVE SYSTEM,2,Moderate,Minor,Medical,Private Health Insurance,,,,,true,42952.72,6140.46
Long Island,Suffolk,5123000,000885,Long Island Community Hospital,50 to 69,119,M,White,Not Span/Hispanic,11,Emergency,Home or Self Care,2019,DIG011,REGIONAL ENTERITIS AND ULCERATIVE COLITIS,,,245,INFLAMMATORY BOWEL DISEASE,06,DISEASES AND DISORDERS OF THE DIGESTIVE SYSTEM,2,Moderate,Moderate,Medical,Private Health Insurance,Medicaid,,,,true,80693.54,15555.8
Long Island,Suffolk,5123000,000885,Long Island Community Hospital,30 to 49,117,F,White,Not Span/Hispanic,4,Emergency,Home or Self Care,2019,DIG011,REGIONAL ENTERITIS AND ULCERATIVE COLITIS,ADM001,TRANSFUSION OF BLOOD AND BLOOD PRODUCTS,245,INFLAMMATORY BOWEL DISEASE,06,DISEASES AND DISORDERS OF THE DIGESTIVE SYSTEM,2,Moderate,Minor,Medical,Private Health Insurance,,,,,true,40902.91,6237.04
Long Island,Suffolk,5123000,000885,Long Island Community Hospital,50 to 69,117,M,White,Not Span/Hispanic,5,Emergency,Home or Self Care,2019,DIG011,REGIONAL ENTERITIS AND ULCERATIVE COLITIS,,,245,INFLAMMATORY BOWEL DISEASE,06,DISEASES AND DISORDERS OF THE DIGESTIVE SYSTEM,2,Moderate,Moderate,Medical,Private Health Insurance,,,,,true,42732.74,6937.85
Long Island,Suffolk,5123000,000885,Long Island Community Hospital,50 to 69,119,F,White,Not Span/Hispanic,18,Emergency,Home w/ Home Health Services,2019,DIG011,REGIONAL ENTERITIS AND ULCERATIVE COLITIS,CAR029,"CARDIOVASCULAR DEVICE PROCEDURES, NEC",245,INFLAMMATORY BOWEL DISEASE,06,DISEASES AND DISORDERS OF THE DIGESTIVE SYSTEM,4,Extreme,Major,Medical,Medicare,Medicare,Medicaid,,,true,154617.87,28826.08
Long Island,Suffolk,5123000,000885,Long Island Community Hospital,30 to 49,117,M,White,Not Span/Hispanic,4,Emergency,Home or Self Care,2019,DIG011,REGIONAL ENTERITIS AND ULCERATIVE COLITIS,GIS007,GI SYSTEM DRAINAGE (EXCLUDING PARACENTESIS),245,INFLAMMATORY BOWEL DISEASE,06,DISEASES AND DISORDERS OF THE DIGESTIVE SYSTEM,1,Minor,Minor,Medical,Blue Cross/Blue Shield,,,,,true,34421.98,5440.45
Long Island,Suffolk,5123000,000885,Long Island Community Hospital,70 or Older,117,F,White,Not Span/Hispanic,5,Emergency,Home w/ Home Health Services,2019,DIG011,REGIONAL ENTERITIS AND ULCERATIVE COLITIS,,,245,INFLAMMATORY BOWEL DISEASE,06,DISEASES AND DISORDERS OF THE DIGESTIVE SYSTEM,3,Major,Moderate,Medical,Medicare,Medicare,Blue Cross/Blue Shield,,,true,47433.63,7629.75
Long Island,Suffolk,5123000,000885,Long Island Community Hospital,30 to 49,117,M,White,Not Span/Hispanic,7,Emergency,Home or Self Care,2019,DIG011,REGIONAL ENTERITIS AND ULCERATIVE COLITIS,GIS007,GI SYSTEM DRAINAGE (EXCLUDING PARACENTESIS),245,INFLAMMATORY BOWEL DISEASE,06,DISEASES AND DISORDERS OF THE DIGESTIVE SYSTEM,1,Minor,Minor,Medical,Blue Cross/Blue Shield,,,,,true,53299.58,9743.47
Long Island,Suffolk,5123000,000885,Long Island Community Hospital,30 to 49,119,M,White,Not Span/Hispanic,4,Emergency,Home or Self Care,2019,DIG011,REGIONAL ENTERITIS AND ULCERATIVE COLITIS,,,245,INFLAMMATORY BOWEL DISEASE,06,DISEASES AND DISORDERS OF THE DIGESTIVE SYSTEM,3,Major,Moderate,Medical,Private Health Insurance,,,,,true,47094.13,6575.53
Long Island,Suffolk,5123000,000885,Long Island Community Hospital,70 or Older,117,F,White,Not Span/Hispanic,2,Emergency,Home w/ Home Health Services,2019,DIG011,REGIONAL ENTERITIS AND ULCERATIVE COLITIS,,,245,INFLAMMATORY BOWEL DISEASE,06,DISEASES AND DISORDERS OF THE DIGESTIVE SYSTEM,2,Moderate,Minor,Medical,Medicare,Medicare,Private Health Insurance,,,true,25530.84,3179.79
Long Island,Suffolk,5123000,000885,Long Island Community Hospital,50 to 69,119,F,White,Not Span/Hispanic,1,Emergency,Home or Self Care,2019,DIG011,REGIONAL ENTERITIS AND ULCERATIVE COLITIS,,,245,INFLAMMATORY BOWEL DISEASE,06,DISEASES AND DISORDERS OF THE DIGESTIVE SYSTEM,2,Moderate,Minor,Medical,Medicare,Medicare,Private Health Insurance,,,true,38281.64,2961.5
Long Island,Suffolk,5123000,000885,Long Island Community Hospital,50 to 69,117,F,White,Not Span/Hispanic,12,Emergency,Home or Self Care,2019,DIG011,REGIONAL ENTERITIS AND ULCERATIVE COLITIS,GIS002,COLONOSCOPY AND PROCTOSCOPY WITH BIOPSY,245,INFLAMMATORY BOWEL DISEASE,06,DISEASES AND DISORDERS OF THE DIGESTIVE SYSTEM,1,Minor,Minor,Medical,Blue Cross/Blue Shield,,,,,true,136321.53,28064.27
Long Island,Suffolk,5123000,000885,Long Island Community Hospital,70 or Older,117,F,White,Not Span/Hispanic,8,Emergency,Home w/ Home Health Services,2019,DIG011,REGIONAL ENTERITIS AND ULCERATIVE COLITIS,GIS002,COLONOSCOPY AND PROCTOSCOPY WITH BIOPSY,245,INFLAMMATORY BOWEL DISEASE,06,DISEASES AND DISORDERS OF THE DIGESTIVE SYSTEM,2,Moderate,Moderate,Medical,Medicare,Medicare,Private Health Insurance,,,true,89711.1,15275.95
Long Island,Suffolk,5123000,000885,Long Island Community Hospital,70 or Older,117,F,White,Not Span/Hispanic,2,Emergency,Home or Self Care,2019,DIG011,REGIONAL ENTERITIS AND ULCERATIVE COLITIS,,,245,INFLAMMATORY BOWEL DISEASE,06,DISEASES AND DISORDERS OF THE DIGESTIVE SYSTEM,1,Minor,Minor,Medical,Medicare,Medicare,Private Health Insurance,,,true,25519.49,3071.22
Long Island,Suffolk,5123000,000885,Long Island Community Hospital,70 or Older,117,F,White,Not Span/Hispanic,2,Emergency,Home or Self Care,2019,DIG011,REGIONAL ENTERITIS AND ULCERATIVE COLITIS,,,245,INFLAMMATORY BOWEL DISEASE,06,DISEASES AND DISORDERS OF THE DIGESTIVE SYSTEM,2,Moderate,Moderate,Medical,Medicare,Medicare,Blue Cross/Blue Shield,,,true,26215.47,3182.48
Long Island,Suffolk,5123000,000885,Long Island Community Hospital,50 to 69,117,M,White,Not Span/Hispanic,11,Emergency,Skilled Nursing Home,2019,DIG011,REGIONAL ENTERITIS AND ULCERATIVE COLITIS,ADM001,TRANSFUSION OF BLOOD AND BLOOD PRODUCTS,245,INFLAMMATORY BOWEL DISEASE,06,DISEASES AND DISORDERS OF THE DIGESTIVE SYSTEM,2,Moderate,Minor,Medical,Medicare,Medicaid,,,,true,75916.17,14846.12
Long Island,Suffolk,5123000,000885,Long Island Community Hospital,70 or Older,117,F,White,Not Span/Hispanic,4,Emergency,Home or Self Care,2019,DIG011,REGIONAL ENTERITIS AND ULCERATIVE COLITIS,GIS002,COLONOSCOPY AND PROCTOSCOPY WITH BIOPSY,245,INFLAMMATORY BOWEL DISEASE,06,DISEASES AND DISORDERS OF THE DIGESTIVE SYSTEM,2,Moderate,Moderate,Medical,Medicare,,,,,true,47514.21,8787.82
Long Island,Suffolk,5123000,000885,Long Island Community Hospital,30 to 49,119,M,White,Not Span/Hispanic,4,Emergency,Home or Self Care,2019,DIG011,REGIONAL ENTERITIS AND ULCERATIVE COLITIS,,,245,INFLAMMATORY BOWEL DISEASE,06,DISEASES AND DISORDERS OF THE DIGESTIVE SYSTEM,2,Moderate,Minor,Medical,Private Health Insurance,Medicaid,,,,true,25262.98,5426.32
Long Island,Suffolk,5123000,000885,Long Island Community Hospital,50 to 69,117,M,White,Not Span/Hispanic,4,Emergency,Home or Self Care,2019,DIG011,REGIONAL ENTERITIS AND ULCERATIVE COLITIS,,,245,INFLAMMATORY BOWEL DISEASE,06,DISEASES AND DISORDERS OF THE DIGESTIVE SYSTEM,2,Moderate,Minor,Medical,Private Health Insurance,,,,,true,30538.27,6145.91
Long Island,Suffolk,5123000,000885,Long Island Community Hospital,50 to 69,117,F,White,Not Span/Hispanic,3,Emergency,Home or Self Care,2019,DIG011,REGIONAL ENTERITIS AND ULCERATIVE COLITIS,,,245,INFLAMMATORY BOWEL DISEASE,06,DISEASES AND DISORDERS OF THE DIGESTIVE SYSTEM,3,Major,Major,Medical,Medicare,Medicare,Medicaid,,,true,47980.58,7030
Long Island,Suffolk,5123000,000885,Long Island Community Hospital,50 to 69,119,F,White,Not Span/Hispanic,2,Emergency,Home or Self Care,2019,DIG011,REGIONAL ENTERITIS AND ULCERATIVE COLITIS,,,245,INFLAMMATORY BOWEL DISEASE,06,DISEASES AND DISORDERS OF THE DIGESTIVE SYSTEM,2,Moderate,Moderate,Medical,Private Health Insurance,Medicaid,,,,true,19768.42,3028.78
Long Island,Suffolk,5123000,000885,Long Island Community Hospital,70 or Older,117,F,White,Not Span/Hispanic,4,Emergency,Home or Self Care,2019,DIG011,REGIONAL ENTERITIS AND ULCERATIVE COLITIS,OTR004,ISOLATION PROCEDURES,245,INFLAMMATORY BOWEL DISEASE,06,DISEASES AND DISORDERS OF THE DIGESTIVE SYSTEM,1,Minor,Moderate,Medical,Medicare,Medicare,Medicaid,,,true,33583.69,5660.23
Long Island,Suffolk,5123000,000885,Long Island Community Hospital,30 to 49,119,F,White,Not Span/Hispanic,4,Emergency,Home or Self Care,2019,DIG011,REGIONAL ENTERITIS AND ULCERATIVE COLITIS,GIS001,ESOPHAGOGASTRODUODENOSCOPY (EGD) WITH BIOPSY,245,INFLAMMATORY BOWEL DISEASE,06,DISEASES AND DISORDERS OF THE DIGESTIVE SYSTEM,2,Moderate,Minor,Medical,Private Health Insurance,Medicaid,,,,true,60255.7,9267.46
Long Island,Suffolk,5123000,000885,Long Island Community Hospital,70 or Older,117,F,White,Not Span/Hispanic,4,Emergency,Home or Self Care,2019,DIG011,REGIONAL ENTERITIS AND ULCERATIVE COLITIS,,,245,INFLAMMATORY BOWEL DISEASE,06,DISEASES AND DISORDERS OF THE DIGESTIVE SYSTEM,1,Minor,Minor,Medical,Medicare,Medicare,Blue Cross/Blue Shield,,,true,41435.93,6237.52
Long Island,Suffolk,5123000,000885,Long Island Community Hospital,30 to 49,117,F,White,Not Span/Hispanic,3,Emergency,Home or Self Care,2019,DIG011,REGIONAL ENTERITIS AND ULCERATIVE COLITIS,,,245,INFLAMMATORY BOWEL DISEASE,06,DISEASES AND DISORDERS OF THE DIGESTIVE SYSTEM,1,Minor,Minor,Medical,Private Health Insurance,Medicaid,,,,true,30575.35,4290.14
Long Island,Suffolk,5123000,000885,Long Island Community Hospital,18 to 29,119,F,White,Not Span/Hispanic,4,Emergency,Home or Self Care,2019,DIG011,REGIONAL ENTERITIS AND ULCERATIVE COLITIS,,,245,INFLAMMATORY BOWEL DISEASE,06,DISEASES AND DISORDERS OF THE DIGESTIVE SYSTEM,2,Moderate,Minor,Medical,Private Health Insurance,,,,,true,32510.14,5646.66
Long Island,Suffolk,5123000,000885,Long Island Community Hospital,50 to 69,119,F,White,Not Span/Hispanic,1,Emergency,Home or Self Care,2019,DIG011,REGIONAL ENTERITIS AND ULCERATIVE COLITIS,,,245,INFLAMMATORY BOWEL DISEASE,06,DISEASES AND DISORDERS OF THE DIGESTIVE SYSTEM,3,Major,Moderate,Medical,Medicare,Medicaid,Medicare,,,true,21438.89,2224.8
Long Island,Suffolk,5123000,000885,Long Island Community Hospital,18 to 29,OOS,M,Black/African American,Not Span/Hispanic,12,Emergency,Home or Self Care,2019,DIG011,REGIONAL ENTERITIS AND ULCERATIVE COLITIS,,,245,INFLAMMATORY BOWEL DISEASE,06,DISEASES AND DISORDERS OF THE DIGESTIVE SYSTEM,1,Minor,Minor,Medical,Self-Pay,,,,,true,84138.48,16372.1
