Hospital Service Area,Hospital County,Operating Certificate Number,Permanent Facility Id,Facility Name,Age Group,Zip Code - 3 digits,Gender,Race,Ethnicity,Length of Stay,Type of Admission,Patient Disposition,Discharge Year,CCS Diagnosis Code,CCS Diagnosis Description,CCS Procedure Code,CCS Procedure Description,APR DRG Code,APR DRG Description,APR MDC Code,APR MDC Description,APR Severity of Illness Code,APR Severity of Illness Description,APR Risk of Mortality,APR Medical Surgical Description,Payment Typology 1,Payment Typology 2,Payment Typology 3,Birth Weight,Abortion Edit Indicator,Emergency Department Indicator,Total Charges,Total Costs
Long Island,Suffolk,5123000,000885,Brookhaven Memorial Hospital Medical Center Inc,50 to 69,119,F,White,Not Span/Hispanic,6,Emergency,Home or Self Care,2017,114,Peripheral and visceral atherosclerosis,222,BLOOD TRANSFUSION,246,Gastrointestinal vascular insufficiency,06,Diseases and Disorders of the Digestive System,2,Moderate,Moderate,Medical,Private Health Insurance,,,,N,Y,78500.42,11234.98
Long Island,Suffolk,5123000,000885,Brookhaven Memorial Hospital Medical Center Inc,50 to 69,117,F,White,Not Span/Hispanic,5,Emergency,Home or Self Care,2017,114,Peripheral and visceral atherosclerosis,058,HEMODIALYSIS,246,Gastrointestinal vascular insufficiency,06,Diseases and Disorders of the Digestive System,3,Major,Major,Medical,Private Health Insurance,Medicare,,,N,Y,60793.35,8340.60
Long Island,Suffolk,5123000,000885,Brookhaven Memorial Hospital Medical Center Inc,70 or Older,117,F,Black/African American,Not Span/Hispanic,23,Emergency,Skilled Nursing Home,2017,114,Peripheral and visceral atherosclerosis,216,RESP INTUB/MECH VENTIL,246,Gastrointestinal vascular insufficiency,06,Diseases and Disorders of the Digestive System,4,Extreme,Extreme,Medical,Medicare,Medicare,,,N,Y,274548.16,53547.89
Long Island,Suffolk,5123000,000885,Brookhaven Memorial Hospital Medical Center Inc,70 or Older,117,F,White,Not Span/Hispanic,4,Emergency,Home or Self Care,2017,114,Peripheral and visceral atherosclerosis,000,NO PROC,246,Gastrointestinal vascular insufficiency,06,Diseases and Disorders of the Digestive System,3,Major,Moderate,Medical,Medicare,Medicare,Private Health Insurance,,N,Y,37011.17,5676.38
Long Island,Suffolk,5123000,000885,Brookhaven Memorial Hospital Medical Center Inc,70 or Older,119,F,Other Race,Not Span/Hispanic,8,Emergency,Home w/ Home Health Services,2017,114,Peripheral and visceral atherosclerosis,222,BLOOD TRANSFUSION,246,Gastrointestinal vascular insufficiency,06,Diseases and Disorders of the Digestive System,3,Major,Moderate,Medical,Medicare,,,,N,Y,160300.99,34760.16
Long Island,Suffolk,5123000,000885,Brookhaven Memorial Hospital Medical Center Inc,50 to 69,119,F,White,Not Span/Hispanic,5,Emergency,Home w/ Home Health Services,2017,114,Peripheral and visceral atherosclerosis,222,BLOOD TRANSFUSION,246,Gastrointestinal vascular insufficiency,06,Diseases and Disorders of the Digestive System,3,Major,Moderate,Medical,Medicare,Medicare,Medicaid,,N,Y,64864.62,10591.13
Long Island,Suffolk,5123000,000885,Brookhaven Memorial Hospital Medical Center Inc,70 or Older,119,F,White,Not Span/Hispanic,6,Emergency,Home or Self Care,2017,114,Peripheral and visceral atherosclerosis,000,NO PROC,246,Gastrointestinal vascular insufficiency,06,Diseases and Disorders of the Digestive System,1,Minor,Minor,Medical,Medicare,Medicare,Blue Cross/Blue Shield,,N,Y,64070.00,9579.33
Long Island,Suffolk,5123000,000885,Brookhaven Memorial Hospital Medical Center Inc,70 or Older,117,F,White,Not Span/Hispanic,8,Emergency,Home or Self Care,2017,114,Peripheral and visceral atherosclerosis,000,NO PROC,246,Gastrointestinal vascular insufficiency,06,Diseases and Disorders of the Digestive System,2,Moderate,Major,Medical,Medicare,,,,N,Y,70482.74,11403.02
Long Island,Suffolk,5123000,000885,Brookhaven Memorial Hospital Medical Center Inc,50 to 69,119,F,White,Not Span/Hispanic,9,Emergency,Home or Self Care,2017,114,Peripheral and visceral atherosclerosis,219,ALCO/DRUG REHAB/DETOX,246,Gastrointestinal vascular insufficiency,06,Diseases and Disorders of the Digestive System,2,Moderate,Minor,Medical,Private Health Insurance,,,,N,Y,100939.32,13231.28
Long Island,Suffolk,5123000,000885,Brookhaven Memorial Hospital Medical Center Inc,50 to 69,119,F,White,Not Span/Hispanic,1,Emergency,Home or Self Care,2017,114,Peripheral and visceral atherosclerosis,092,OTHER BOWEL DX PRCS,246,Gastrointestinal vascular insufficiency,06,Diseases and Disorders of the Digestive System,1,Minor,Minor,Medical,Private Health Insurance,,,,N,Y,43368.98,5771.14
Long Island,Suffolk,5123000,000885,Brookhaven Memorial Hospital Medical Center Inc,50 to 69,119,M,White,Not Span/Hispanic,1,Emergency,Short-term Hospital,2017,114,Peripheral and visceral atherosclerosis,000,NO PROC,246,Gastrointestinal vascular insufficiency,06,Diseases and Disorders of the Digestive System,2,Moderate,Major,Medical,Private Health Insurance,Medicaid,,,N,Y,26194.79,2842.74
Long Island,Suffolk,5123000,000885,Brookhaven Memorial Hospital Medical Center Inc,50 to 69,119,M,White,Not Span/Hispanic,1,Emergency,Short-term Hospital,2017,114,Peripheral and visceral atherosclerosis,000,NO PROC,246,Gastrointestinal vascular insufficiency,06,Diseases and Disorders of the Digestive System,2,Moderate,Major,Medical,Private Health Insurance,Medicaid,,,N,Y,26194.79,2842.74
Long Island,Suffolk,5123000,000885,Brookhaven Memorial Hospital Medical Center Inc,70 or Older,119,F,White,Not Span/Hispanic,12,Emergency,Home or Self Care,2017,114,Peripheral and visceral atherosclerosis,076,COLONOSCOPY AND BIOPSY,246,Gastrointestinal vascular insufficiency,06,Diseases and Disorders of the Digestive System,2,Moderate,Minor,Medical,Medicare,Medicare,Medicaid,,N,Y,91911.10,17290.00
Long Island,Suffolk,5123000,000885,Brookhaven Memorial Hospital Medical Center Inc,70 or Older,117,F,White,Not Span/Hispanic,6,Emergency,Home w/ Home Health Services,2017,114,Peripheral and visceral atherosclerosis,000,NO PROC,246,Gastrointestinal vascular insufficiency,06,Diseases and Disorders of the Digestive System,2,Moderate,Moderate,Medical,Medicare,Medicare,Private Health Insurance,,N,Y,54016.34,8124.38
Long Island,Suffolk,5123000,000885,Brookhaven Memorial Hospital Medical Center Inc,70 or Older,117,M,White,Not Span/Hispanic,5,Emergency,Home or Self Care,2017,114,Peripheral and visceral atherosclerosis,070,UP GASTRO ENDOSC/BIOPSY,246,Gastrointestinal vascular insufficiency,06,Diseases and Disorders of the Digestive System,2,Moderate,Major,Medical,Medicare,Medicare,,,N,Y,62009.42,9520.65
Long Island,Suffolk,5123000,000885,Brookhaven Memorial Hospital Medical Center Inc,50 to 69,119,F,White,Not Span/Hispanic,3,Emergency,Home or Self Care,2017,114,Peripheral and visceral atherosclerosis,000,NO PROC,246,Gastrointestinal vascular insufficiency,06,Diseases and Disorders of the Digestive System,2,Moderate,Minor,Medical,Private Health Insurance,,,,N,Y,38251.02,5021.11
Long Island,Suffolk,5123000,000885,Brookhaven Memorial Hospital Medical Center Inc,50 to 69,119,M,White,Not Span/Hispanic,5,Emergency,Home or Self Care,2017,114,Peripheral and visceral atherosclerosis,000,NO PROC,246,Gastrointestinal vascular insufficiency,06,Diseases and Disorders of the Digestive System,2,Moderate,Moderate,Medical,Medicare,Medicare,,,N,Y,46179.78,7103.44
