Hospital Service Area,Hospital County,Operating Certificate Number,Permanent Facility Id,Facility Name,Age Group,Zip Code - 3 digits,Gender,Race,Ethnicity,Length of Stay,Type of Admission,Patient Disposition,Discharge Year,CCS Diagnosis Code,CCS Diagnosis Description,CCS Procedure Code,CCS Procedure Description,APR DRG Code,APR DRG Description,APR MDC Code,APR MDC Description,APR Severity of Illness Code,APR Severity of Illness Description,APR Risk of Mortality,APR Medical Surgical Description,Payment Typology 1,Payment Typology 2,Payment Typology 3,Birth Weight,Abortion Edit Indicator,Emergency Department Indicator,Total Charges,Total Costs
New York City,Kings,7002053,001304,NYU Langone Hospital-Brooklyn,70 or Older,112,F,Other Race,Spanish/Hispanic,6,Emergency,Home w/ Home Health Services,2018,DIG025,OTHER SPECIFIED AND UNSPECIFIED GASTROINTESTINAL DISORDERS,,,246,GASTROINTESTINAL VASCULAR INSUFFICIENCY,06,DISEASES AND DISORDERS OF THE DIGESTIVE SYSTEM,2,Moderate,Major,Medical,Medicaid,,,,,true,75324.6,29435.76
Finger Lakes,Monroe,2701003,000411,Rochester General Hospital,30 to 49,145,F,White,Not Span/Hispanic,2,Emergency,Home or Self Care,2018,DIG025,OTHER SPECIFIED AND UNSPECIFIED GASTROINTESTINAL DISORDERS,ESA001,HEMODIALYSIS,246,GASTROINTESTINAL VASCULAR INSUFFICIENCY,06,DISEASES AND DISORDERS OF THE DIGESTIVE SYSTEM,3,Major,Major,Medical,Medicare,Medicaid,,,,true,13360.32,4790.86
Long Island,Nassau,2951001,000541,North Shore University Hospital,50 to 69,110,M,Other Race,Not Span/Hispanic,4,Emergency,Home or Self Care,2018,DIG025,OTHER SPECIFIED AND UNSPECIFIED GASTROINTESTINAL DISORDERS,,,246,GASTROINTESTINAL VASCULAR INSUFFICIENCY,06,DISEASES AND DISORDERS OF THE DIGESTIVE SYSTEM,2,Moderate,Moderate,Medical,Medicaid,Medicaid,,,,true,64966.54,9456.96
New York City,Manhattan,7002017,001450,Lenox Hill Hospital,70 or Older,100,F,Other Race,Spanish/Hispanic,3,Emergency,Home w/ Home Health Services,2018,DIG025,OTHER SPECIFIED AND UNSPECIFIED GASTROINTESTINAL DISORDERS,GIS002,COLONOSCOPY AND PROCTOSCOPY WITH BIOPSY,246,GASTROINTESTINAL VASCULAR INSUFFICIENCY,06,DISEASES AND DISORDERS OF THE DIGESTIVE SYSTEM,1,Minor,Minor,Medical,Medicare,Medicaid,,,,true,37736.17,7649.59
Finger Lakes,Monroe,2701001,000409,Highland Hospital,70 or Older,146,F,White,Not Span/Hispanic,23,Emergency,Skilled Nursing Home,2018,DIG025,OTHER SPECIFIED AND UNSPECIFIED GASTROINTESTINAL DISORDERS,,,246,GASTROINTESTINAL VASCULAR INSUFFICIENCY,06,DISEASES AND DISORDERS OF THE DIGESTIVE SYSTEM,4,Extreme,Extreme,Medical,Medicare,,,,,true,44907.43,16010.42
New York City,Manhattan,7002054,001464,New York-Presbyterian Hospital - Columbia Presbyterian Center,50 to 69,104,M,Multi-racial,Not Span/Hispanic,7,Emergency,Home or Self Care,2018,DIG025,OTHER SPECIFIED AND UNSPECIFIED GASTROINTESTINAL DISORDERS,ESA001,HEMODIALYSIS,246,GASTROINTESTINAL VASCULAR INSUFFICIENCY,06,DISEASES AND DISORDERS OF THE DIGESTIVE SYSTEM,3,Major,Major,Medical,Medicaid,Medicaid,Self-Pay,,,false,91681.48,21553.24
Long Island,Nassau,2951001,000541,North Shore University Hospital,70 or Older,115,F,White,Not Span/Hispanic,6,Emergency,Home or Self Care,2018,DIG025,OTHER SPECIFIED AND UNSPECIFIED GASTROINTESTINAL DISORDERS,CAR021,"ARTERY, VEIN, AND GREAT VESSEL PROCEDURES, NEC",246,GASTROINTESTINAL VASCULAR INSUFFICIENCY,06,DISEASES AND DISORDERS OF THE DIGESTIVE SYSTEM,2,Moderate,Moderate,Medical,Medicare,Private Health Insurance,Medicaid,,,true,80735.91,15184.17
Long Island,Nassau,2952006,000551,St. Joseph Hospital,70 or Older,117,F,White,Not Span/Hispanic,2,Emergency,Home or Self Care,2018,DIG025,OTHER SPECIFIED AND UNSPECIFIED GASTROINTESTINAL DISORDERS,ADM015,ADMINISTRATION OF ANTIBIOTICS,246,GASTROINTESTINAL VASCULAR INSUFFICIENCY,06,DISEASES AND DISORDERS OF THE DIGESTIVE SYSTEM,1,Minor,Minor,Medical,Medicare,Medicare,Medicaid,,,true,19589.15,2946.39
New York City,Manhattan,7002009,001445,Harlem Hospital Center,50 to 69,100,F,Black/African American,Not Span/Hispanic,2,Emergency,Home or Self Care,2018,DIG025,OTHER SPECIFIED AND UNSPECIFIED GASTROINTESTINAL DISORDERS,,,246,GASTROINTESTINAL VASCULAR INSUFFICIENCY,06,DISEASES AND DISORDERS OF THE DIGESTIVE SYSTEM,2,Moderate,Minor,Medical,Medicaid,Medicaid,Medicaid,,,true,12290.21,9133.24
Central NY,Onondaga,3301003,000630,St. Joseph's Hospital Health Center,50 to 69,130,F,White,Not Span/Hispanic,3,Emergency,Home or Self Care,2018,DIG025,OTHER SPECIFIED AND UNSPECIFIED GASTROINTESTINAL DISORDERS,GIS002,COLONOSCOPY AND PROCTOSCOPY WITH BIOPSY,246,GASTROINTESTINAL VASCULAR INSUFFICIENCY,06,DISEASES AND DISORDERS OF THE DIGESTIVE SYSTEM,2,Moderate,Minor,Medical,Medicare,,,,,true,14419.46,5796.32
New York City,Queens,7003003,001629,Jamaica Hospital Medical Center,50 to 69,114,M,White,Not Span/Hispanic,4,Emergency,Home or Self Care,2018,DIG025,OTHER SPECIFIED AND UNSPECIFIED GASTROINTESTINAL DISORDERS,GIS016,GI SYSTEM ENDOSCOPIC THERAPEUTIC PROCEDURES,246,GASTROINTESTINAL VASCULAR INSUFFICIENCY,06,DISEASES AND DISORDERS OF THE DIGESTIVE SYSTEM,2,Moderate,Minor,Medical,Medicaid,,,,,true,21023.1,10596.92
New York City,Queens,7002024,001639,Mount Sinai Hospital - Mount Sinai Hospital of Queens,30 to 49,113,F,White,Spanish/Hispanic,2,Emergency,Home or Self Care,2018,DIG025,OTHER SPECIFIED AND UNSPECIFIED GASTROINTESTINAL DISORDERS,MAM015,"MEASUREMENT AND MONITORING, NEC",246,GASTROINTESTINAL VASCULAR INSUFFICIENCY,06,DISEASES AND DISORDERS OF THE DIGESTIVE SYSTEM,1,Minor,Minor,Medical,Medicaid,Medicaid,,,,true,12097.39,4136.13
New York City,Manhattan,7002054,001458,New York-Presbyterian Hospital - New York Weill Cornell Center,70 or Older,100,F,White,Not Span/Hispanic,7,Emergency,Home w/ Home Health Services,2018,DIG025,OTHER SPECIFIED AND UNSPECIFIED GASTROINTESTINAL DISORDERS,,,246,GASTROINTESTINAL VASCULAR INSUFFICIENCY,06,DISEASES AND DISORDERS OF THE DIGESTIVE SYSTEM,3,Major,Major,Medical,Medicare,Private Health Insurance,Self-Pay,,,true,76751.48,17061.67
Long Island,Nassau,2952006,000551,St. Joseph Hospital,70 or Older,117,F,White,Not Span/Hispanic,4,Emergency,Short-term Hospital,2018,DIG025,OTHER SPECIFIED AND UNSPECIFIED GASTROINTESTINAL DISORDERS,OTR004,ISOLATION PROCEDURES,246,GASTROINTESTINAL VASCULAR INSUFFICIENCY,06,DISEASES AND DISORDERS OF THE DIGESTIVE SYSTEM,2,Moderate,Moderate,Medical,Medicare,Medicare,,,,true,35547.37,5793.65
New York City,Richmond,7004010,001738,Richmond University Medical Center,50 to 69,103,M,Other Race,Spanish/Hispanic,4,Emergency,Home or Self Care,2018,DIG025,OTHER SPECIFIED AND UNSPECIFIED GASTROINTESTINAL DISORDERS,IMG002,FLUOROSCOPIC ANGIOGRAPHY (EXCLUDING CORONARY),246,GASTROINTESTINAL VASCULAR INSUFFICIENCY,06,DISEASES AND DISORDERS OF THE DIGESTIVE SYSTEM,1,Minor,Major,Medical,Medicaid,Medicaid,Self-Pay,,,true,30432.29,9121.81
Western NY,Erie,1401014,003067,Millard Fillmore Suburban Hospital,50 to 69,141,F,White,Not Span/Hispanic,9,Emergency,Home or Self Care,2018,DIG025,OTHER SPECIFIED AND UNSPECIFIED GASTROINTESTINAL DISORDERS,GIS002,COLONOSCOPY AND PROCTOSCOPY WITH BIOPSY,246,GASTROINTESTINAL VASCULAR INSUFFICIENCY,06,DISEASES AND DISORDERS OF THE DIGESTIVE SYSTEM,3,Major,Major,Medical,Medicare,Blue Cross/Blue Shield,Self-Pay,,,true,26876.34,13362.79
Capital/Adirond,Warren,5601000,001005,Glens Falls Hospital,30 to 49,128,F,White,Not Span/Hispanic,4,Emergency,Home or Self Care,2018,DIG025,OTHER SPECIFIED AND UNSPECIFIED GASTROINTESTINAL DISORDERS,GIS002,COLONOSCOPY AND PROCTOSCOPY WITH BIOPSY,246,GASTROINTESTINAL VASCULAR INSUFFICIENCY,06,DISEASES AND DISORDERS OF THE DIGESTIVE SYSTEM,1,Minor,Minor,Medical,Private Health Insurance,,,,,true,19495.45,4256.23
New York City,Queens,7003004,001630,Long Island Jewish Medical Center,30 to 49,114,M,Other Race,Not Span/Hispanic,3,Emergency,Home or Self Care,2018,DIG025,OTHER SPECIFIED AND UNSPECIFIED GASTROINTESTINAL DISORDERS,,,246,GASTROINTESTINAL VASCULAR INSUFFICIENCY,06,DISEASES AND DISORDERS OF THE DIGESTIVE SYSTEM,3,Major,Major,Medical,Private Health Insurance,Self-Pay,,,,false,53843.81,26292.11
New York City,Manhattan,7002054,001458,New York-Presbyterian Hospital - New York Weill Cornell Center,70 or Older,112,F,White,Not Span/Hispanic,1,Emergency,Home or Self Care,2018,DIG025,OTHER SPECIFIED AND UNSPECIFIED GASTROINTESTINAL DISORDERS,,,246,GASTROINTESTINAL VASCULAR INSUFFICIENCY,06,DISEASES AND DISORDERS OF THE DIGESTIVE SYSTEM,2,Moderate,Major,Medical,Medicare,Self-Pay,,,,true,16917.35,3766.97
Western NY,Erie,1401014,003067,Millard Fillmore Suburban Hospital,70 or Older,142,F,White,Not Span/Hispanic,5,Urgent,Home w/ Home Health Services,2018,DIG025,OTHER SPECIFIED AND UNSPECIFIED GASTROINTESTINAL DISORDERS,,,246,GASTROINTESTINAL VASCULAR INSUFFICIENCY,06,DISEASES AND DISORDERS OF THE DIGESTIVE SYSTEM,2,Moderate,Major,Medical,Medicare,Self-Pay,,,,true,14606.93,6873.29
New York City,Manhattan,7002002,001439,Mount Sinai Beth Israel,70 or Older,100,F,Other Race,Unknown,3,Emergency,Home w/ Home Health Services,2018,DIG025,OTHER SPECIFIED AND UNSPECIFIED GASTROINTESTINAL DISORDERS,IMG006,COMPUTERIZED TOMOGRAPHY (CT) WITH CONTRAST,246,GASTROINTESTINAL VASCULAR INSUFFICIENCY,06,DISEASES AND DISORDERS OF THE DIGESTIVE SYSTEM,2,Moderate,Major,Medical,Medicare,Miscellaneous/Other,Medicaid,,,false,33097.69,6119.43
Western NY,Erie,1401014,000207,Buffalo General Medical Center,50 to 69,140,M,White,Not Span/Hispanic,2,Urgent,Home or Self Care,2018,DIG025,OTHER SPECIFIED AND UNSPECIFIED GASTROINTESTINAL DISORDERS,,,246,GASTROINTESTINAL VASCULAR INSUFFICIENCY,06,DISEASES AND DISORDERS OF THE DIGESTIVE SYSTEM,3,Major,Major,Medical,Private Health Insurance,Self-Pay,,,,true,14912.94,4706.75
Capital/Adirond,Otsego,3801000,000739,A.O. Fox Memorial Hospital,50 to 69,138,F,White,Not Span/Hispanic,18,Emergency,Home or Self Care,2018,DIG025,OTHER SPECIFIED AND UNSPECIFIED GASTROINTESTINAL DISORDERS,ADM017,ADMINISTRATION OF NUTRITIONAL AND ELECTROLYTIC SUBSTANCES,246,GASTROINTESTINAL VASCULAR INSUFFICIENCY,06,DISEASES AND DISORDERS OF THE DIGESTIVE SYSTEM,2,Moderate,Moderate,Medical,Medicare,,,,,true,36283.3,25679.71
Hudson Valley,Westchester,5922000,001122,New York - Presbyterian Hospital,70 or Older,104,F,Other Race,Not Span/Hispanic,9,Emergency,Home w/ Home Health Services,2018,DIG025,OTHER SPECIFIED AND UNSPECIFIED GASTROINTESTINAL DISORDERS,,,246,GASTROINTESTINAL VASCULAR INSUFFICIENCY,06,DISEASES AND DISORDERS OF THE DIGESTIVE SYSTEM,1,Minor,Moderate,Medical,Medicare,,,,,true,40544,15939.84
New York City,Queens,7003000,001626,Elmhurst Hospital Center,50 to 69,113,M,Other Race,Not Span/Hispanic,2,Emergency,Home or Self Care,2018,DIG025,OTHER SPECIFIED AND UNSPECIFIED GASTROINTESTINAL DISORDERS,,,246,GASTROINTESTINAL VASCULAR INSUFFICIENCY,06,DISEASES AND DISORDERS OF THE DIGESTIVE SYSTEM,2,Moderate,Major,Medical,Medicaid,Medicaid,,,,true,15664.9,9320.08
New York City,Manhattan,7002054,001437,New York-Presbyterian/Lower Manhattan Hospital,18 to 29,104,M,Other Race,Spanish/Hispanic,3,Emergency,Home w/ Home Health Services,2018,DIG025,OTHER SPECIFIED AND UNSPECIFIED GASTROINTESTINAL DISORDERS,ADM021,"ADMINISTRATION OF THERAPEUTIC SUBSTANCES, NEC",246,GASTROINTESTINAL VASCULAR INSUFFICIENCY,06,DISEASES AND DISORDERS OF THE DIGESTIVE SYSTEM,3,Major,Moderate,Medical,"Managed Care, Unspecified",Medicaid,Self-Pay,,,true,37440.14,8569.54
Central NY,Oswego,3702000,000727,Oswego Hospital,70 or Older,131,F,White,Not Span/Hispanic,5,Emergency,Home or Self Care,2018,DIG025,OTHER SPECIFIED AND UNSPECIFIED GASTROINTESTINAL DISORDERS,GIS001,ESOPHAGOGASTRODUODENOSCOPY (EGD) WITH BIOPSY,246,GASTROINTESTINAL VASCULAR INSUFFICIENCY,06,DISEASES AND DISORDERS OF THE DIGESTIVE SYSTEM,2,Moderate,Moderate,Medical,Medicare,Medicare,,,,true,19129.35,8113.13
Hudson Valley,Westchester,5901000,001039,NewYork-Presbyterian/Hudson Valley Hospital,70 or Older,105,F,White,Not Span/Hispanic,5,Emergency,Home w/ Home Health Services,2018,DIG025,OTHER SPECIFIED AND UNSPECIFIED GASTROINTESTINAL DISORDERS,IMG003,FLUOROSCOPIC GUIDANCE FOR CIRCULATORY SYSTEM PROCEDURES,246,GASTROINTESTINAL VASCULAR INSUFFICIENCY,06,DISEASES AND DISORDERS OF THE DIGESTIVE SYSTEM,2,Moderate,Minor,Medical,Medicare,,,,,true,53618.64,20629.33
Finger Lakes,Monroe,2701003,000411,Rochester General Hospital,50 to 69,144,M,White,Not Span/Hispanic,7,Emergency,Home or Self Care,2018,DIG025,OTHER SPECIFIED AND UNSPECIFIED GASTROINTESTINAL DISORDERS,,,246,GASTROINTESTINAL VASCULAR INSUFFICIENCY,06,DISEASES AND DISORDERS OF THE DIGESTIVE SYSTEM,3,Major,Major,Medical,Private Health Insurance,,,,,true,24745.77,11347.33
Capital/Adirond,Clinton,0901001,000135,The University of Vermont Health Network - Champlain Valley Physicians Hospital,70 or Older,129,F,White,Not Span/Hispanic,3,Emergency,Home or Self Care,2018,DIG025,OTHER SPECIFIED AND UNSPECIFIED GASTROINTESTINAL DISORDERS,GIS002,COLONOSCOPY AND PROCTOSCOPY WITH BIOPSY,246,GASTROINTESTINAL VASCULAR INSUFFICIENCY,06,DISEASES AND DISORDERS OF THE DIGESTIVE SYSTEM,2,Moderate,Moderate,Medical,Medicare,Medicare,Private Health Insurance,,,true,24473.45,8543.09
Western NY,Cattaraugus,0401001,000066,Olean General Hospital,50 to 69,147,M,White,Not Span/Hispanic,13,Emergency,Expired,2018,DIG025,OTHER SPECIFIED AND UNSPECIFIED GASTROINTESTINAL DISORDERS,CAR024,VENOUS AND ARTERIAL CATHETER PLACEMENT,246,GASTROINTESTINAL VASCULAR INSUFFICIENCY,06,DISEASES AND DISORDERS OF THE DIGESTIVE SYSTEM,3,Major,Major,Medical,Medicare,,,,,true,37398.85,16450.05
Hudson Valley,Westchester,5932000,001129,Phelps Hospital,30 to 49,105,F,White,Not Span/Hispanic,2,Emergency,Home or Self Care,2018,DIG025,OTHER SPECIFIED AND UNSPECIFIED GASTROINTESTINAL DISORDERS,,,246,GASTROINTESTINAL VASCULAR INSUFFICIENCY,06,DISEASES AND DISORDERS OF THE DIGESTIVE SYSTEM,2,Moderate,Major,Medical,Blue Cross/Blue Shield,Private Health Insurance,,,,true,24570.34,6380.03
Central NY,Onondaga,3301007,000635,University Hospital SUNY Health Science Center,70 or Older,133,F,White,Not Span/Hispanic,3,Emergency,Home or Self Care,2018,DIG025,OTHER SPECIFIED AND UNSPECIFIED GASTROINTESTINAL DISORDERS,IMG008,ULTRASONOGRAPHY,246,GASTROINTESTINAL VASCULAR INSUFFICIENCY,06,DISEASES AND DISORDERS OF THE DIGESTIVE SYSTEM,2,Moderate,Moderate,Medical,Medicare,Private Health Insurance,,,,false,20913.06,5969.21
Long Island,Nassau,2951001,000541,North Shore University Hospital,70 or Older,114,F,Black/African American,Not Span/Hispanic,2,Emergency,Home or Self Care,2018,DIG025,OTHER SPECIFIED AND UNSPECIFIED GASTROINTESTINAL DISORDERS,,,246,GASTROINTESTINAL VASCULAR INSUFFICIENCY,06,DISEASES AND DISORDERS OF THE DIGESTIVE SYSTEM,2,Moderate,Moderate,Medical,Medicare,Blue Cross/Blue Shield,,,,true,40364.1,8048.97
Long Island,Nassau,2951001,000541,North Shore University Hospital,50 to 69,113,F,Black/African American,Not Span/Hispanic,5,Emergency,Home or Self Care,2018,DIG025,OTHER SPECIFIED AND UNSPECIFIED GASTROINTESTINAL DISORDERS,,,246,GASTROINTESTINAL VASCULAR INSUFFICIENCY,06,DISEASES AND DISORDERS OF THE DIGESTIVE SYSTEM,1,Minor,Minor,Medical,Blue Cross/Blue Shield,,,,,true,54327.14,8918.42
Long Island,Nassau,7003004,000518,Long Island Jewish Valley Stream,70 or Older,114,F,Black/African American,Not Span/Hispanic,3,Emergency,Home or Self Care,2018,DIG025,OTHER SPECIFIED AND UNSPECIFIED GASTROINTESTINAL DISORDERS,,,246,GASTROINTESTINAL VASCULAR INSUFFICIENCY,06,DISEASES AND DISORDERS OF THE DIGESTIVE SYSTEM,2,Moderate,Moderate,Medical,Medicare,Private Health Insurance,,,,true,45424.93,8388.59
Finger Lakes,Ontario,3402000,000671,Geneva General Hospital,50 to 69,144,F,White,Not Span/Hispanic,6,Urgent,Home or Self Care,2018,DIG025,OTHER SPECIFIED AND UNSPECIFIED GASTROINTESTINAL DISORDERS,,,246,GASTROINTESTINAL VASCULAR INSUFFICIENCY,06,DISEASES AND DISORDERS OF THE DIGESTIVE SYSTEM,2,Moderate,Major,Medical,Medicare,,,,,true,19788.62,6760.62
Western NY,Wyoming,6027000,001153,Wyoming County Community Hospital,50 to 69,145,F,White,Not Span/Hispanic,2,Emergency,Home or Self Care,2018,DIG025,OTHER SPECIFIED AND UNSPECIFIED GASTROINTESTINAL DISORDERS,,,246,GASTROINTESTINAL VASCULAR INSUFFICIENCY,06,DISEASES AND DISORDERS OF THE DIGESTIVE SYSTEM,1,Minor,Minor,Medical,Blue Cross/Blue Shield,,,,,true,4715.65,2601.33
Long Island,Suffolk,5154001,000925,Good Samaritan Hospital Medical Center,70 or Older,117,M,White,Not Span/Hispanic,4,Emergency,Home or Self Care,2018,DIG025,OTHER SPECIFIED AND UNSPECIFIED GASTROINTESTINAL DISORDERS,GIS002,COLONOSCOPY AND PROCTOSCOPY WITH BIOPSY,246,GASTROINTESTINAL VASCULAR INSUFFICIENCY,06,DISEASES AND DISORDERS OF THE DIGESTIVE SYSTEM,3,Major,Major,Medical,Medicare,Private Health Insurance,,,,true,37987.67,6590.67
Capital/Adirond,Columbia,1001000,000146,Columbia Memorial Hospital,70 or Older,125,M,White,Not Span/Hispanic,6,Elective,Skilled Nursing Home,2018,DIG025,OTHER SPECIFIED AND UNSPECIFIED GASTROINTESTINAL DISORDERS,,,246,GASTROINTESTINAL VASCULAR INSUFFICIENCY,06,DISEASES AND DISORDERS OF THE DIGESTIVE SYSTEM,3,Major,Major,Medical,Medicare,,,,,true,22656.46,7439.4
Hudson Valley,Westchester,5922000,001122,New York - Presbyterian Hospital,70 or Older,105,F,White,Not Span/Hispanic,12,Emergency,Home w/ Home Health Services,2018,DIG025,OTHER SPECIFIED AND UNSPECIFIED GASTROINTESTINAL DISORDERS,,,246,GASTROINTESTINAL VASCULAR INSUFFICIENCY,06,DISEASES AND DISORDERS OF THE DIGESTIVE SYSTEM,2,Moderate,Major,Medical,Medicare,Medicare,,,,true,135653.83,57975.67
Western NY,Wyoming,6027000,001153,Wyoming County Community Hospital,70 or Older,145,M,White,Not Span/Hispanic,2,Emergency,Home or Self Care,2018,DIG025,OTHER SPECIFIED AND UNSPECIFIED GASTROINTESTINAL DISORDERS,,,246,GASTROINTESTINAL VASCULAR INSUFFICIENCY,06,DISEASES AND DISORDERS OF THE DIGESTIVE SYSTEM,3,Major,Major,Medical,Medicare,,,,,true,5757.4,3596.18
New York City,Manhattan,7002054,003975,New York Presbyterian Hospital - Allen Hospital,50 to 69,100,M,Black/African American,Spanish/Hispanic,8,Emergency,Expired,2018,DIG025,OTHER SPECIFIED AND UNSPECIFIED GASTROINTESTINAL DISORDERS,GNR004,ENDOSCOPIC CONTROL OF BLEEDING,246,GASTROINTESTINAL VASCULAR INSUFFICIENCY,06,DISEASES AND DISORDERS OF THE DIGESTIVE SYSTEM,4,Extreme,Extreme,Medical,Medicare,Medicare,Medicaid,,,false,203949.46,75894.11
Long Island,Suffolk,5151001,000245,Stony Brook University Hospital,50 to 69,117,F,White,Not Span/Hispanic,3,Emergency,Home or Self Care,2018,DIG025,OTHER SPECIFIED AND UNSPECIFIED GASTROINTESTINAL DISORDERS,GIS002,COLONOSCOPY AND PROCTOSCOPY WITH BIOPSY,246,GASTROINTESTINAL VASCULAR INSUFFICIENCY,06,DISEASES AND DISORDERS OF THE DIGESTIVE SYSTEM,2,Moderate,Moderate,Medical,Private Health Insurance,,,,,true,38921.57,10792.87
Western NY,Erie,1401013,000292,Sisters of Charity Hospital - St. Joseph Campus,70 or Older,141,F,White,Not Span/Hispanic,7,Emergency,Home w/ Home Health Services,2018,DIG025,OTHER SPECIFIED AND UNSPECIFIED GASTROINTESTINAL DISORDERS,GIS016,GI SYSTEM ENDOSCOPIC THERAPEUTIC PROCEDURES,246,GASTROINTESTINAL VASCULAR INSUFFICIENCY,06,DISEASES AND DISORDERS OF THE DIGESTIVE SYSTEM,2,Moderate,Moderate,Medical,Medicare,Medicare,Private Health Insurance,,,true,27915.17,12219.23
New York City,Queens,7003003,001629,Jamaica Hospital Medical Center,50 to 69,103,M,Other Race,Not Span/Hispanic,4,Emergency,Home or Self Care,2018,DIG025,OTHER SPECIFIED AND UNSPECIFIED GASTROINTESTINAL DISORDERS,GIS002,COLONOSCOPY AND PROCTOSCOPY WITH BIOPSY,246,GASTROINTESTINAL VASCULAR INSUFFICIENCY,06,DISEASES AND DISORDERS OF THE DIGESTIVE SYSTEM,3,Major,Extreme,Medical,Medicare,Medicaid,,,,true,32400.64,13746.47
New York City,Manhattan,7002053,001463,NYU Langone Hospitals,50 to 69,100,F,White,Not Span/Hispanic,2,Emergency,Home or Self Care,2018,DIG025,OTHER SPECIFIED AND UNSPECIFIED GASTROINTESTINAL DISORDERS,OTR004,ISOLATION PROCEDURES,246,GASTROINTESTINAL VASCULAR INSUFFICIENCY,06,DISEASES AND DISORDERS OF THE DIGESTIVE SYSTEM,2,Moderate,Minor,Medical,Medicare,,,,,true,45322.31,13215.9
Finger Lakes,Ontario,3421000,000676,Clifton Springs Hospital and Clinic,30 to 49,145,F,White,Not Span/Hispanic,1,Emergency,Home or Self Care,2018,DIG025,OTHER SPECIFIED AND UNSPECIFIED GASTROINTESTINAL DISORDERS,GIS002,COLONOSCOPY AND PROCTOSCOPY WITH BIOPSY,246,GASTROINTESTINAL VASCULAR INSUFFICIENCY,06,DISEASES AND DISORDERS OF THE DIGESTIVE SYSTEM,2,Moderate,Minor,Medical,Blue Cross/Blue Shield,,,,,true,8137.98,2978.07
New York City,Queens,7003003,001629,Jamaica Hospital Medical Center,70 or Older,,F,White,Not Span/Hispanic,5,Emergency,Home or Self Care,2018,DIG025,OTHER SPECIFIED AND UNSPECIFIED GASTROINTESTINAL DISORDERS,ADM015,ADMINISTRATION OF ANTIBIOTICS,246,GASTROINTESTINAL VASCULAR INSUFFICIENCY,06,DISEASES AND DISORDERS OF THE DIGESTIVE SYSTEM,2,Moderate,Major,Medical,Medicare,,,,,true,22648,10657.46
Western NY,Erie,1401014,000207,Buffalo General Medical Center,50 to 69,140,M,White,Not Span/Hispanic,1,Emergency,Home or Self Care,2018,DIG025,OTHER SPECIFIED AND UNSPECIFIED GASTROINTESTINAL DISORDERS,,,246,GASTROINTESTINAL VASCULAR INSUFFICIENCY,06,DISEASES AND DISORDERS OF THE DIGESTIVE SYSTEM,1,Minor,Minor,Medical,Medicaid,Self-Pay,,,,true,4011.45,1618.03
Finger Lakes,Wayne,5820000,001028,Newark-Wayne Community Hospital,30 to 49,146,F,Multi-racial,Not Span/Hispanic,3,Emergency,Home or Self Care,2018,DIG025,OTHER SPECIFIED AND UNSPECIFIED GASTROINTESTINAL DISORDERS,GNR004,ENDOSCOPIC CONTROL OF BLEEDING,246,GASTROINTESTINAL VASCULAR INSUFFICIENCY,06,DISEASES AND DISORDERS OF THE DIGESTIVE SYSTEM,1,Minor,Major,Medical,Medicaid,,,,,true,15359.4,6431.08
Central NY,Madison,2601001,000397,Oneida Health Hospital,70 or Older,134,F,White,Not Span/Hispanic,5,Emergency,Skilled Nursing Home,2018,DIG025,OTHER SPECIFIED AND UNSPECIFIED GASTROINTESTINAL DISORDERS,ADM015,ADMINISTRATION OF ANTIBIOTICS,246,GASTROINTESTINAL VASCULAR INSUFFICIENCY,06,DISEASES AND DISORDERS OF THE DIGESTIVE SYSTEM,2,Moderate,Major,Medical,Medicare,Medicare,Private Health Insurance,,,true,15208.89,6929.57
Central NY,Tompkins,5401001,000977,Cayuga Medical Center at Ithaca,70 or Older,137,M,White,Not Span/Hispanic,2,Emergency,Home or Self Care,2018,DIG025,OTHER SPECIFIED AND UNSPECIFIED GASTROINTESTINAL DISORDERS,GIS001,ESOPHAGOGASTRODUODENOSCOPY (EGD) WITH BIOPSY,246,GASTROINTESTINAL VASCULAR INSUFFICIENCY,06,DISEASES AND DISORDERS OF THE DIGESTIVE SYSTEM,3,Major,Major,Medical,Medicare,Private Health Insurance,Self-Pay,,,true,10760.85,5512.78
Long Island,Suffolk,5154001,000925,Good Samaritan Hospital Medical Center,70 or Older,117,M,White,Not Span/Hispanic,6,Emergency,Short-term Hospital,2018,DIG025,OTHER SPECIFIED AND UNSPECIFIED GASTROINTESTINAL DISORDERS,,,246,GASTROINTESTINAL VASCULAR INSUFFICIENCY,06,DISEASES AND DISORDERS OF THE DIGESTIVE SYSTEM,3,Major,Extreme,Medical,Medicare,Medicare,,,,true,66081,11550.95
Western NY,Niagara,3101000,000565,Eastern Niagara Hospital - Lockport Division,70 or Older,141,F,White,Not Span/Hispanic,4,Emergency,Home or Self Care,2018,DIG025,OTHER SPECIFIED AND UNSPECIFIED GASTROINTESTINAL DISORDERS,GIS002,COLONOSCOPY AND PROCTOSCOPY WITH BIOPSY,246,GASTROINTESTINAL VASCULAR INSUFFICIENCY,06,DISEASES AND DISORDERS OF THE DIGESTIVE SYSTEM,2,Moderate,Moderate,Medical,Medicare,Blue Cross/Blue Shield,,,,true,13241.98,4798.37
Long Island,Nassau,2953000,000563,St. Francis Hospital & Heart Center,50 to 69,117,F,White,Not Span/Hispanic,1,Emergency,Home or Self Care,2018,DIG025,OTHER SPECIFIED AND UNSPECIFIED GASTROINTESTINAL DISORDERS,,,246,GASTROINTESTINAL VASCULAR INSUFFICIENCY,06,DISEASES AND DISORDERS OF THE DIGESTIVE SYSTEM,1,Minor,Minor,Medical,Blue Cross/Blue Shield,,,,,true,16188,2811.54
Capital/Adirond,Rensselaer,4102002,000756,Samaritan Hospital,70 or Older,121,F,White,Not Span/Hispanic,9,Emergency,Home or Self Care,2018,DIG025,OTHER SPECIFIED AND UNSPECIFIED GASTROINTESTINAL DISORDERS,RES001,BRONCHOSCOPY (DIAGNOSTIC),246,GASTROINTESTINAL VASCULAR INSUFFICIENCY,06,DISEASES AND DISORDERS OF THE DIGESTIVE SYSTEM,3,Major,Major,Medical,Medicare,,,,,true,48779.56,10117.25