Hospital Service Area,Hospital County,Operating Certificate Number,Permanent Facility Id,Facility Name,Age Group,Zip Code - 3 digits,Gender,Race,Ethnicity,Length of Stay,Type of Admission,Patient Disposition,Discharge Year,CCS Diagnosis Code,CCS Diagnosis Description,CCS Procedure Code,CCS Procedure Description,APR DRG Code,APR DRG Description,APR MDC Code,APR MDC Description,APR Severity of Illness Code,APR Severity of Illness Description,APR Risk of Mortality,APR Medical Surgical Description,Payment Typology 1,Payment Typology 2,Payment Typology 3,Birth Weight,Abortion Edit Indicator,Emergency Department Indicator,Total Charges,Total Costs
New York City,Kings,7002053,001304,NYU Langone Hospital-Brooklyn,50 to 69,112,M,Other Race,Not Span/Hispanic,2,Emergency,Home or Self Care,2019,DIG025,OTHER SPECIFIED AND UNSPECIFIED GASTROINTESTINAL DISORDERS,GIS002,COLONOSCOPY AND PROCTOSCOPY WITH BIOPSY,246,GASTROINTESTINAL VASCULAR INSUFFICIENCY,06,DISEASES AND DISORDERS OF THE DIGESTIVE SYSTEM,3,Major,Major,Medical,Medicare,Blue Cross/Blue Shield,,,,true,51360.89,11721.87
New York City,Kings,7002053,001304,NYU Langone Hospital-Brooklyn,70 or Older,112,M,Other Race,Not Span/Hispanic,1,Emergency,Home w/ Home Health Services,2019,DIG025,OTHER SPECIFIED AND UNSPECIFIED GASTROINTESTINAL DISORDERS,GIS002,COLONOSCOPY AND PROCTOSCOPY WITH BIOPSY,246,GASTROINTESTINAL VASCULAR INSUFFICIENCY,06,DISEASES AND DISORDERS OF THE DIGESTIVE SYSTEM,1,Minor,Major,Medical,Medicare,Medicaid,,,,true,47438.8,9427.84
New York City,Kings,7002053,001304,NYU Langone Hospital-Brooklyn,70 or Older,103,F,Other Race,Spanish/Hispanic,2,Emergency,Home or Self Care,2019,DIG025,OTHER SPECIFIED AND UNSPECIFIED GASTROINTESTINAL DISORDERS,GIS002,COLONOSCOPY AND PROCTOSCOPY WITH BIOPSY,246,GASTROINTESTINAL VASCULAR INSUFFICIENCY,06,DISEASES AND DISORDERS OF THE DIGESTIVE SYSTEM,3,Major,Major,Medical,Medicaid,,,,,true,52240.08,12059.39
New York City,Kings,7002053,001304,NYU Langone Hospital-Brooklyn,70 or Older,112,F,White,Not Span/Hispanic,3,Emergency,Home or Self Care,2019,DIG025,OTHER SPECIFIED AND UNSPECIFIED GASTROINTESTINAL DISORDERS,ADM015,ADMINISTRATION OF ANTIBIOTICS,246,GASTROINTESTINAL VASCULAR INSUFFICIENCY,06,DISEASES AND DISORDERS OF THE DIGESTIVE SYSTEM,3,Major,Moderate,Medical,Medicare,,,,,true,68823.69,16025.76
New York City,Kings,7002053,001304,NYU Langone Hospital-Brooklyn,70 or Older,112,F,Other Race,Not Span/Hispanic,1,Emergency,Home w/ Home Health Services,2019,DIG025,OTHER SPECIFIED AND UNSPECIFIED GASTROINTESTINAL DISORDERS,,,246,GASTROINTESTINAL VASCULAR INSUFFICIENCY,06,DISEASES AND DISORDERS OF THE DIGESTIVE SYSTEM,2,Moderate,Minor,Medical,Medicare,Medicaid,,,,true,25850.74,6203.06
New York City,Kings,7002053,001304,NYU Langone Hospital-Brooklyn,70 or Older,112,F,White,Not Span/Hispanic,9,Emergency,Skilled Nursing Home,2019,DIG025,OTHER SPECIFIED AND UNSPECIFIED GASTROINTESTINAL DISORDERS,ADM021,"ADMINISTRATION OF THERAPEUTIC SUBSTANCES, NEC",246,GASTROINTESTINAL VASCULAR INSUFFICIENCY,06,DISEASES AND DISORDERS OF THE DIGESTIVE SYSTEM,4,Extreme,Extreme,Medical,Medicare,,,,,true,133176.1,38895.06
New York City,Kings,7002053,001304,NYU Langone Hospital-Brooklyn,70 or Older,112,F,White,Spanish/Hispanic,2,Emergency,Home or Self Care,2019,DIG025,OTHER SPECIFIED AND UNSPECIFIED GASTROINTESTINAL DISORDERS,IMG006,COMPUTERIZED TOMOGRAPHY (CT) WITH CONTRAST,246,GASTROINTESTINAL VASCULAR INSUFFICIENCY,06,DISEASES AND DISORDERS OF THE DIGESTIVE SYSTEM,1,Minor,Major,Medical,Medicare,Medicaid,,,,true,36658.39,9718.2
New York City,Kings,7002053,001304,NYU Langone Hospital-Brooklyn,70 or Older,112,F,White,Not Span/Hispanic,3,Emergency,Home or Self Care,2019,DIG025,OTHER SPECIFIED AND UNSPECIFIED GASTROINTESTINAL DISORDERS,GIS002,COLONOSCOPY AND PROCTOSCOPY WITH BIOPSY,246,GASTROINTESTINAL VASCULAR INSUFFICIENCY,06,DISEASES AND DISORDERS OF THE DIGESTIVE SYSTEM,3,Major,Moderate,Medical,Medicare,,,,,true,66870.72,16562.64
New York City,Kings,7002053,001304,NYU Langone Hospital-Brooklyn,70 or Older,112,F,Other Race,Not Span/Hispanic,2,Emergency,Home or Self Care,2019,DIG025,OTHER SPECIFIED AND UNSPECIFIED GASTROINTESTINAL DISORDERS,GIS002,COLONOSCOPY AND PROCTOSCOPY WITH BIOPSY,246,GASTROINTESTINAL VASCULAR INSUFFICIENCY,06,DISEASES AND DISORDERS OF THE DIGESTIVE SYSTEM,2,Moderate,Major,Medical,Medicare,Medicaid,,,,true,97021.01,23601.44
New York City,Kings,7002053,001304,NYU Langone Hospital-Brooklyn,70 or Older,OOS,F,White,Not Span/Hispanic,4,Emergency,Home or Self Care,2019,DIG025,OTHER SPECIFIED AND UNSPECIFIED GASTROINTESTINAL DISORDERS,,,246,GASTROINTESTINAL VASCULAR INSUFFICIENCY,06,DISEASES AND DISORDERS OF THE DIGESTIVE SYSTEM,3,Major,Major,Medical,Private Health Insurance,Medicare,,,,true,49399.11,16126.72
New York City,Kings,7002053,001304,NYU Langone Hospital-Brooklyn,70 or Older,OOS,F,White,Spanish/Hispanic,2,Emergency,Home or Self Care,2019,DIG025,OTHER SPECIFIED AND UNSPECIFIED GASTROINTESTINAL DISORDERS,,,246,GASTROINTESTINAL VASCULAR INSUFFICIENCY,06,DISEASES AND DISORDERS OF THE DIGESTIVE SYSTEM,1,Minor,Minor,Medical,Blue Cross/Blue Shield,,,,,true,35516.27,9919.38
New York City,Kings,7002053,001304,NYU Langone Hospital-Brooklyn,50 to 69,112,F,White,Not Span/Hispanic,4,Emergency,Home or Self Care,2019,DIG025,OTHER SPECIFIED AND UNSPECIFIED GASTROINTESTINAL DISORDERS,,,246,GASTROINTESTINAL VASCULAR INSUFFICIENCY,06,DISEASES AND DISORDERS OF THE DIGESTIVE SYSTEM,2,Moderate,Minor,Medical,Medicare,,,,,true,62914.89,18453.28
New York City,Kings,7002053,001304,NYU Langone Hospital-Brooklyn,30 to 49,112,F,Other Race,Spanish/Hispanic,1,Emergency,Home or Self Care,2019,DIG025,OTHER SPECIFIED AND UNSPECIFIED GASTROINTESTINAL DISORDERS,,,246,GASTROINTESTINAL VASCULAR INSUFFICIENCY,06,DISEASES AND DISORDERS OF THE DIGESTIVE SYSTEM,1,Minor,Major,Medical,Medicaid,,,,,true,43206.64,12914.49
New York City,Kings,7002053,001304,NYU Langone Hospital-Brooklyn,50 to 69,112,M,White,Not Span/Hispanic,1,Emergency,Home or Self Care,2019,DIG025,OTHER SPECIFIED AND UNSPECIFIED GASTROINTESTINAL DISORDERS,,,246,GASTROINTESTINAL VASCULAR INSUFFICIENCY,06,DISEASES AND DISORDERS OF THE DIGESTIVE SYSTEM,1,Minor,Major,Medical,Blue Cross/Blue Shield,,,,,true,26985.29,6599.85
New York City,Kings,7002053,001304,NYU Langone Hospital-Brooklyn,70 or Older,112,M,Other Race,Unknown,1,Emergency,Expired,2019,DIG025,OTHER SPECIFIED AND UNSPECIFIED GASTROINTESTINAL DISORDERS,RES007,AIRWAY INTUBATION,246,GASTROINTESTINAL VASCULAR INSUFFICIENCY,06,DISEASES AND DISORDERS OF THE DIGESTIVE SYSTEM,4,Extreme,Extreme,Medical,Medicare,Medicaid,,,,true,20082.67,5584.08
