Hospital Service Area,Hospital County,Operating Certificate Number,Permanent Facility Id,Facility Name,Age Group,Zip Code - 3 digits,Gender,Race,Ethnicity,Length of Stay,Type of Admission,Patient Disposition,Discharge Year,CCS Diagnosis Code,CCS Diagnosis Description,CCS Procedure Code,CCS Procedure Description,APR DRG Code,APR DRG Description,APR MDC Code,APR MDC Description,APR Severity of Illness Code,APR Severity of Illness Description,APR Risk of Mortality,APR Medical Surgical Description,Payment Typology 1,Payment Typology 2,Payment Typology 3,Birth Weight,Abortion Edit Indicator,Emergency Department Indicator,Total Charges,Total Costs
Long Island,Nassau,2908000,000511,NYU Winthrop Hospital,18 to 29,117,M,White,Spanish/Hispanic,9,Elective,Home w/ Home Health Services,2017,145,Intestinal obstruction without hernia,222,BLOOD TRANSFUSION,247,Intestinal obstruction,06,Diseases and Disorders of the Digestive System,3,Major,Minor,Medical,Medicaid,,,,N,N,199874.62,41063.64
Long Island,Nassau,2908000,000511,NYU Winthrop Hospital,50 to 69,110,F,White,Spanish/Hispanic,10,Emergency,Skilled Nursing Home,2017,145,Intestinal obstruction without hernia,058,HEMODIALYSIS,247,Intestinal obstruction,06,Diseases and Disorders of the Digestive System,3,Major,Major,Medical,Medicare,Medicare,Medicaid,,N,Y,88470.75,17233.01
Long Island,Nassau,2908000,000511,NYU Winthrop Hospital,50 to 69,117,F,White,Not Span/Hispanic,3,Emergency,Home or Self Care,2017,145,Intestinal obstruction without hernia,000,NO PROC,247,Intestinal obstruction,06,Diseases and Disorders of the Digestive System,1,Minor,Minor,Medical,Private Health Insurance,,,,N,Y,25531.60,5192.61
Long Island,Nassau,2908000,000511,NYU Winthrop Hospital,30 to 49,117,M,White,Not Span/Hispanic,3,Emergency,Home or Self Care,2017,145,Intestinal obstruction without hernia,000,NO PROC,247,Intestinal obstruction,06,Diseases and Disorders of the Digestive System,2,Moderate,Moderate,Medical,Blue Cross/Blue Shield,Medicaid,,,N,Y,33445.52,5807.26
Long Island,Nassau,2908000,000511,NYU Winthrop Hospital,70 or Older,110,M,White,Not Span/Hispanic,4,Emergency,Home or Self Care,2017,145,Intestinal obstruction without hernia,000,NO PROC,247,Intestinal obstruction,06,Diseases and Disorders of the Digestive System,1,Minor,Moderate,Medical,Medicare,Medicare,Private Health Insurance,,N,Y,35171.77,7493.18
Long Island,Nassau,2908000,000511,NYU Winthrop Hospital,70 or Older,115,F,White,Not Span/Hispanic,4,Emergency,Home w/ Home Health Services,2017,145,Intestinal obstruction without hernia,000,NO PROC,247,Intestinal obstruction,06,Diseases and Disorders of the Digestive System,1,Minor,Minor,Medical,Medicare,Medicare,Blue Cross/Blue Shield,,N,Y,35603.61,7844.13
Long Island,Nassau,2908000,000511,NYU Winthrop Hospital,70 or Older,113,F,White,Spanish/Hispanic,3,Emergency,Home or Self Care,2017,145,Intestinal obstruction without hernia,000,NO PROC,247,Intestinal obstruction,06,Diseases and Disorders of the Digestive System,1,Minor,Minor,Medical,Medicare,Medicare,,,N,Y,32316.46,6616.54
Long Island,Nassau,2908000,000511,NYU Winthrop Hospital,50 to 69,115,F,Black/African American,Not Span/Hispanic,2,Emergency,Home or Self Care,2017,145,Intestinal obstruction without hernia,000,NO PROC,247,Intestinal obstruction,06,Diseases and Disorders of the Digestive System,1,Minor,Minor,Medical,Blue Cross/Blue Shield,,,,N,Y,22026.04,4117.05
Long Island,Nassau,2908000,000511,NYU Winthrop Hospital,50 to 69,115,M,White,Not Span/Hispanic,3,Emergency,Home or Self Care,2017,145,Intestinal obstruction without hernia,000,NO PROC,247,Intestinal obstruction,06,Diseases and Disorders of the Digestive System,2,Moderate,Minor,Medical,Medicare,Medicare,,,N,Y,43749.48,11508.30
Long Island,Nassau,2908000,000511,NYU Winthrop Hospital,70 or Older,117,F,White,Unknown,4,Emergency,Home or Self Care,2017,145,Intestinal obstruction without hernia,221,NASOGASTRIC TUBE,247,Intestinal obstruction,06,Diseases and Disorders of the Digestive System,2,Moderate,Moderate,Medical,Medicare,Medicare,Medicaid,,N,Y,38647.46,8238.05
Long Island,Nassau,2908000,000511,NYU Winthrop Hospital,70 or Older,114,F,White,Spanish/Hispanic,3,Emergency,Home or Self Care,2017,145,Intestinal obstruction without hernia,221,NASOGASTRIC TUBE,247,Intestinal obstruction,06,Diseases and Disorders of the Digestive System,1,Minor,Moderate,Medical,Medicare,Medicaid,,,N,Y,39686.91,7976.01
Long Island,Nassau,2908000,000511,NYU Winthrop Hospital,50 to 69,115,M,White,Not Span/Hispanic,5,Emergency,Home or Self Care,2017,145,Intestinal obstruction without hernia,054,OT VASC CATH; NOT HEART,247,Intestinal obstruction,06,Diseases and Disorders of the Digestive System,2,Moderate,Minor,Medical,Private Health Insurance,,,,N,Y,50979.76,11959.52
Long Island,Nassau,2908000,000511,NYU Winthrop Hospital,70 or Older,115,M,White,Not Span/Hispanic,1,Emergency,Home or Self Care,2017,145,Intestinal obstruction without hernia,000,NO PROC,247,Intestinal obstruction,06,Diseases and Disorders of the Digestive System,1,Minor,Minor,Medical,Medicare,Medicare,Private Health Insurance,,N,Y,24827.77,4211.53
Long Island,Nassau,2908000,000511,NYU Winthrop Hospital,30 to 49,115,F,White,Not Span/Hispanic,5,Emergency,Home or Self Care,2017,145,Intestinal obstruction without hernia,000,NO PROC,247,Intestinal obstruction,06,Diseases and Disorders of the Digestive System,2,Moderate,Minor,Medical,Blue Cross/Blue Shield,,,,N,Y,53061.18,11494.70
Long Island,Nassau,2908000,000511,NYU Winthrop Hospital,70 or Older,115,F,Black/African American,Not Span/Hispanic,6,Emergency,Skilled Nursing Home,2017,145,Intestinal obstruction without hernia,229,NONOP RMVL FOREIGN BODY,247,Intestinal obstruction,06,Diseases and Disorders of the Digestive System,3,Major,Moderate,Medical,Medicare,Medicare,Medicaid,,N,Y,52986.19,12219.57
Long Island,Nassau,2908000,000511,NYU Winthrop Hospital,50 to 69,115,M,White,Not Span/Hispanic,6,Emergency,Home or Self Care,2017,145,Intestinal obstruction without hernia,000,NO PROC,247,Intestinal obstruction,06,Diseases and Disorders of the Digestive System,1,Minor,Minor,Medical,Private Health Insurance,Medicare,,,N,Y,36424.78,8100.49
Long Island,Nassau,2908000,000511,NYU Winthrop Hospital,50 to 69,117,F,White,Not Span/Hispanic,2,Emergency,Home or Self Care,2017,145,Intestinal obstruction without hernia,000,NO PROC,247,Intestinal obstruction,06,Diseases and Disorders of the Digestive System,1,Minor,Minor,Medical,Blue Cross/Blue Shield,,,,N,Y,34791.22,7653.37
Long Island,Nassau,2908000,000511,NYU Winthrop Hospital,70 or Older,115,F,White,Not Span/Hispanic,3,Emergency,Home w/ Home Health Services,2017,145,Intestinal obstruction without hernia,221,NASOGASTRIC TUBE,247,Intestinal obstruction,06,Diseases and Disorders of the Digestive System,1,Minor,Moderate,Medical,Medicare,Medicare,Private Health Insurance,,N,Y,36537.55,7176.10
Long Island,Nassau,2908000,000511,NYU Winthrop Hospital,70 or Older,115,F,White,Not Span/Hispanic,1,Emergency,Home or Self Care,2017,145,Intestinal obstruction without hernia,221,NASOGASTRIC TUBE,247,Intestinal obstruction,06,Diseases and Disorders of the Digestive System,2,Moderate,Minor,Medical,Medicare,Medicare,Blue Cross/Blue Shield,,N,Y,24755.11,4341.07
Long Island,Nassau,2908000,000511,NYU Winthrop Hospital,50 to 69,115,F,Black/African American,Not Span/Hispanic,5,Emergency,Home or Self Care,2017,145,Intestinal obstruction without hernia,000,NO PROC,247,Intestinal obstruction,06,Diseases and Disorders of the Digestive System,2,Moderate,Minor,Medical,Blue Cross/Blue Shield,,,,N,Y,42720.60,8516.85
Long Island,Nassau,2908000,000511,NYU Winthrop Hospital,70 or Older,115,M,White,Not Span/Hispanic,3,Emergency,Home or Self Care,2017,145,Intestinal obstruction without hernia,000,NO PROC,247,Intestinal obstruction,06,Diseases and Disorders of the Digestive System,2,Moderate,Moderate,Medical,Medicare,Medicare,Private Health Insurance,,N,Y,24139.76,4684.91
Long Island,Nassau,2908000,000511,NYU Winthrop Hospital,30 to 49,117,M,White,Not Span/Hispanic,2,Emergency,Home or Self Care,2017,145,Intestinal obstruction without hernia,000,NO PROC,247,Intestinal obstruction,06,Diseases and Disorders of the Digestive System,1,Minor,Minor,Medical,Blue Cross/Blue Shield,,,,N,Y,32546.65,6148.92
Long Island,Nassau,2908000,000511,NYU Winthrop Hospital,50 to 69,115,M,White,Not Span/Hispanic,3,Emergency,Home or Self Care,2017,145,Intestinal obstruction without hernia,000,NO PROC,247,Intestinal obstruction,06,Diseases and Disorders of the Digestive System,1,Minor,Minor,Medical,Private Health Insurance,,,,N,Y,38826.14,7908.24
Long Island,Nassau,2908000,000511,NYU Winthrop Hospital,30 to 49,115,F,White,Not Span/Hispanic,1,Emergency,Home or Self Care,2017,145,Intestinal obstruction without hernia,000,NO PROC,247,Intestinal obstruction,06,Diseases and Disorders of the Digestive System,1,Minor,Minor,Medical,Medicaid,Medicaid,,,N,Y,26715.97,4630.85
Long Island,Nassau,2908000,000511,NYU Winthrop Hospital,70 or Older,113,M,White,Not Span/Hispanic,12,Emergency,Skilled Nursing Home,2017,145,Intestinal obstruction without hernia,216,RESP INTUB/MECH VENTIL,247,Intestinal obstruction,06,Diseases and Disorders of the Digestive System,3,Major,Major,Medical,Medicare,Medicare,,,N,Y,208954.72,46481.64
Long Island,Nassau,2908000,000511,NYU Winthrop Hospital,50 to 69,115,F,Black/African American,Not Span/Hispanic,4,Emergency,Home w/ Home Health Services,2017,145,Intestinal obstruction without hernia,000,NO PROC,247,Intestinal obstruction,06,Diseases and Disorders of the Digestive System,1,Minor,Minor,Medical,Medicare,Medicare,,,N,Y,39875.03,8545.84
Long Island,Nassau,2908000,000511,NYU Winthrop Hospital,70 or Older,115,F,Black/African American,Not Span/Hispanic,5,Emergency,Home w/ Home Health Services,2017,145,Intestinal obstruction without hernia,221,NASOGASTRIC TUBE,247,Intestinal obstruction,06,Diseases and Disorders of the Digestive System,2,Moderate,Moderate,Medical,Private Health Insurance,Medicare,Medicare,,N,Y,42426.34,9103.57
Long Island,Nassau,2908000,000511,NYU Winthrop Hospital,50 to 69,115,M,White,Not Span/Hispanic,2,Emergency,Home or Self Care,2017,145,Intestinal obstruction without hernia,000,NO PROC,247,Intestinal obstruction,06,Diseases and Disorders of the Digestive System,2,Moderate,Minor,Medical,Medicaid,Medicaid,,,N,Y,27911.84,5247.95
Long Island,Nassau,2908000,000511,NYU Winthrop Hospital,18 to 29,110,F,White,Not Span/Hispanic,1,Emergency,Home or Self Care,2017,145,Intestinal obstruction without hernia,000,NO PROC,247,Intestinal obstruction,06,Diseases and Disorders of the Digestive System,1,Minor,Minor,Medical,Private Health Insurance,Self-Pay,,,N,Y,21468.78,3782.18
Long Island,Nassau,2908000,000511,NYU Winthrop Hospital,70 or Older,110,F,White,Not Span/Hispanic,4,Emergency,Home or Self Care,2017,145,Intestinal obstruction without hernia,000,NO PROC,247,Intestinal obstruction,06,Diseases and Disorders of the Digestive System,1,Minor,Moderate,Medical,Medicare,Medicare,,,N,Y,40016.31,8459.05
Long Island,Nassau,2908000,000511,NYU Winthrop Hospital,70 or Older,115,F,White,Not Span/Hispanic,8,Emergency,Skilled Nursing Home,2017,145,Intestinal obstruction without hernia,000,NO PROC,247,Intestinal obstruction,06,Diseases and Disorders of the Digestive System,2,Moderate,Moderate,Medical,Medicare,Medicare,Blue Cross/Blue Shield,,N,Y,72208.08,14420.37
Long Island,Nassau,2908000,000511,NYU Winthrop Hospital,70 or Older,115,M,Black/African American,Not Span/Hispanic,2,Emergency,Home w/ Home Health Services,2017,145,Intestinal obstruction without hernia,000,NO PROC,247,Intestinal obstruction,06,Diseases and Disorders of the Digestive System,2,Moderate,Moderate,Medical,Medicare,Medicare,Blue Cross/Blue Shield,,N,Y,26558.38,4895.49
Long Island,Nassau,2908000,000511,NYU Winthrop Hospital,70 or Older,115,M,White,Not Span/Hispanic,8,Emergency,Home w/ Home Health Services,2017,145,Intestinal obstruction without hernia,000,NO PROC,247,Intestinal obstruction,06,Diseases and Disorders of the Digestive System,3,Major,Major,Medical,Medicare,Medicare,Private Health Insurance,,N,Y,61167.36,13760.23
Long Island,Nassau,2908000,000511,NYU Winthrop Hospital,70 or Older,114,M,Black/African American,Not Span/Hispanic,4,Emergency,Hospice - Home,2017,145,Intestinal obstruction without hernia,000,NO PROC,247,Intestinal obstruction,06,Diseases and Disorders of the Digestive System,2,Moderate,Major,Medical,Medicare,Medicare,Blue Cross/Blue Shield,,N,Y,38302.99,7788.26
Long Island,Nassau,2908000,000511,NYU Winthrop Hospital,70 or Older,115,M,White,Spanish/Hispanic,2,Emergency,Home w/ Home Health Services,2017,145,Intestinal obstruction without hernia,054,OT VASC CATH; NOT HEART,247,Intestinal obstruction,06,Diseases and Disorders of the Digestive System,2,Moderate,Minor,Medical,Medicaid,Medicaid,,,N,Y,48449.67,12125.35
Long Island,Nassau,2908000,000511,NYU Winthrop Hospital,18 to 29,115,F,White,Not Span/Hispanic,1,Emergency,Left Against Medical Advice,2017,145,Intestinal obstruction without hernia,000,NO PROC,247,Intestinal obstruction,06,Diseases and Disorders of the Digestive System,1,Minor,Minor,Medical,Blue Cross/Blue Shield,,,,N,Y,22777.86,4197.54
Long Island,Nassau,2908000,000511,NYU Winthrop Hospital,70 or Older,117,F,White,Spanish/Hispanic,4,Emergency,Home w/ Home Health Services,2017,145,Intestinal obstruction without hernia,000,NO PROC,247,Intestinal obstruction,06,Diseases and Disorders of the Digestive System,2,Moderate,Moderate,Medical,Medicaid,Medicaid,,,N,Y,64748.51,15770.30
Long Island,Nassau,2908000,000511,NYU Winthrop Hospital,70 or Older,115,F,White,Not Span/Hispanic,3,Emergency,Home or Self Care,2017,145,Intestinal obstruction without hernia,000,NO PROC,247,Intestinal obstruction,06,Diseases and Disorders of the Digestive System,1,Minor,Moderate,Medical,Medicare,Medicare,Private Health Insurance,,N,Y,26191.14,5411.58
Long Island,Nassau,2908000,000511,NYU Winthrop Hospital,70 or Older,115,M,Black/African American,Not Span/Hispanic,5,Emergency,Home w/ Home Health Services,2017,145,Intestinal obstruction without hernia,000,NO PROC,247,Intestinal obstruction,06,Diseases and Disorders of the Digestive System,1,Minor,Moderate,Medical,Medicare,Medicare,Blue Cross/Blue Shield,,N,Y,55622.67,15143.09
Long Island,Nassau,2908000,000511,NYU Winthrop Hospital,18 to 29,115,F,White,Spanish/Hispanic,2,Emergency,Home or Self Care,2017,145,Intestinal obstruction without hernia,000,NO PROC,247,Intestinal obstruction,06,Diseases and Disorders of the Digestive System,1,Minor,Minor,Medical,Medicaid,Medicaid,,,N,Y,35744.23,5066.51
Long Island,Nassau,2908000,000511,NYU Winthrop Hospital,70 or Older,115,F,White,Not Span/Hispanic,4,Emergency,Home or Self Care,2017,145,Intestinal obstruction without hernia,000,NO PROC,247,Intestinal obstruction,06,Diseases and Disorders of the Digestive System,2,Moderate,Moderate,Medical,Medicare,Medicare,Private Health Insurance,,N,Y,32298.42,6508.33
Long Island,Nassau,2908000,000511,NYU Winthrop Hospital,70 or Older,110,M,White,Not Span/Hispanic,5,Emergency,Home w/ Home Health Services,2017,145,Intestinal obstruction without hernia,221,NASOGASTRIC TUBE,247,Intestinal obstruction,06,Diseases and Disorders of the Digestive System,2,Moderate,Moderate,Medical,Medicare,Medicare,Blue Cross/Blue Shield,,N,Y,56788.30,12835.21
Long Island,Nassau,2908000,000511,NYU Winthrop Hospital,70 or Older,115,M,White,Not Span/Hispanic,6,Emergency,Home or Self Care,2017,145,Intestinal obstruction without hernia,000,NO PROC,247,Intestinal obstruction,06,Diseases and Disorders of the Digestive System,2,Moderate,Moderate,Medical,Medicare,Medicare,,,N,Y,45052.31,10296.32
Long Island,Nassau,2908000,000511,NYU Winthrop Hospital,70 or Older,115,M,White,Not Span/Hispanic,6,Emergency,Home w/ Home Health Services,2017,145,Intestinal obstruction without hernia,000,NO PROC,247,Intestinal obstruction,06,Diseases and Disorders of the Digestive System,2,Moderate,Moderate,Medical,Medicare,Medicare,Private Health Insurance,,N,Y,45326.07,9509.00
Long Island,Nassau,2908000,000511,NYU Winthrop Hospital,50 to 69,110,F,Other Race,Not Span/Hispanic,1,Emergency,Home or Self Care,2017,145,Intestinal obstruction without hernia,000,NO PROC,247,Intestinal obstruction,06,Diseases and Disorders of the Digestive System,1,Minor,Minor,Medical,Medicaid,Medicaid,,,N,Y,23239.29,4323.41
Long Island,Nassau,2908000,000511,NYU Winthrop Hospital,50 to 69,115,M,White,Not Span/Hispanic,3,Emergency,Home or Self Care,2017,145,Intestinal obstruction without hernia,221,NASOGASTRIC TUBE,247,Intestinal obstruction,06,Diseases and Disorders of the Digestive System,2,Moderate,Minor,Medical,Medicare,Medicare,Blue Cross/Blue Shield,,N,Y,53464.14,13697.92
Long Island,Nassau,2908000,000511,NYU Winthrop Hospital,50 to 69,115,F,White,Spanish/Hispanic,3,Emergency,Home or Self Care,2017,145,Intestinal obstruction without hernia,000,NO PROC,247,Intestinal obstruction,06,Diseases and Disorders of the Digestive System,1,Minor,Minor,Medical,Private Health Insurance,,,,N,Y,39657.15,8205.11
Long Island,Nassau,2908000,000511,NYU Winthrop Hospital,30 to 49,115,M,White,Not Span/Hispanic,2,Emergency,Home or Self Care,2017,145,Intestinal obstruction without hernia,000,NO PROC,247,Intestinal obstruction,06,Diseases and Disorders of the Digestive System,1,Minor,Minor,Medical,Blue Cross/Blue Shield,,,,N,Y,22900.75,4525.57
Long Island,Nassau,2908000,000511,NYU Winthrop Hospital,70 or Older,110,M,White,Not Span/Hispanic,3,Emergency,Home or Self Care,2017,145,Intestinal obstruction without hernia,000,NO PROC,247,Intestinal obstruction,06,Diseases and Disorders of the Digestive System,2,Moderate,Moderate,Medical,Medicare,Medicare,Private Health Insurance,,N,Y,31239.63,6110.88
Long Island,Nassau,2908000,000511,NYU Winthrop Hospital,50 to 69,117,F,White,Not Span/Hispanic,3,Emergency,Home or Self Care,2017,145,Intestinal obstruction without hernia,000,NO PROC,247,Intestinal obstruction,06,Diseases and Disorders of the Digestive System,2,Moderate,Moderate,Medical,Blue Cross/Blue Shield,Self-Pay,,,N,Y,33204.79,6962.30
Long Island,Nassau,2908000,000511,NYU Winthrop Hospital,50 to 69,117,M,White,Not Span/Hispanic,1,Emergency,Home or Self Care,2017,145,Intestinal obstruction without hernia,000,NO PROC,247,Intestinal obstruction,06,Diseases and Disorders of the Digestive System,1,Minor,Minor,Medical,Private Health Insurance,,,,N,Y,15416.47,2534.69
Long Island,Nassau,2908000,000511,NYU Winthrop Hospital,0 to 17,110,M,White,Spanish/Hispanic,2,Emergency,Home or Self Care,2017,145,Intestinal obstruction without hernia,000,NO PROC,247,Intestinal obstruction,06,Diseases and Disorders of the Digestive System,1,Minor,Minor,Medical,Medicaid,Medicaid,,,N,Y,21880.56,4750.92
Long Island,Nassau,2908000,000511,NYU Winthrop Hospital,50 to 69,115,M,White,Not Span/Hispanic,3,Emergency,Home or Self Care,2017,145,Intestinal obstruction without hernia,221,NASOGASTRIC TUBE,247,Intestinal obstruction,06,Diseases and Disorders of the Digestive System,1,Minor,Minor,Medical,Medicare,Medicare,,,N,Y,30440.39,6085.64
Long Island,Nassau,2908000,000511,NYU Winthrop Hospital,70 or Older,115,M,White,Not Span/Hispanic,6,Emergency,Home w/ Home Health Services,2017,145,Intestinal obstruction without hernia,000,NO PROC,247,Intestinal obstruction,06,Diseases and Disorders of the Digestive System,2,Moderate,Moderate,Medical,Medicare,Medicare,Private Health Insurance,,N,Y,39068.87,8485.30
Long Island,Nassau,2908000,000511,NYU Winthrop Hospital,50 to 69,115,M,White,Not Span/Hispanic,3,Emergency,Home or Self Care,2017,145,Intestinal obstruction without hernia,221,NASOGASTRIC TUBE,247,Intestinal obstruction,06,Diseases and Disorders of the Digestive System,1,Minor,Minor,Medical,Blue Cross/Blue Shield,,,,N,Y,26181.21,5487.64
Long Island,Nassau,2908000,000511,NYU Winthrop Hospital,0 to 17,115,F,Other Race,Spanish/Hispanic,2,Emergency,Home or Self Care,2017,145,Intestinal obstruction without hernia,221,NASOGASTRIC TUBE,247,Intestinal obstruction,06,Diseases and Disorders of the Digestive System,1,Minor,Minor,Medical,Medicaid,Medicaid,,,N,Y,17357.74,4247.01
Long Island,Nassau,2908000,000511,NYU Winthrop Hospital,70 or Older,115,F,Black/African American,Not Span/Hispanic,3,Emergency,Home or Self Care,2017,145,Intestinal obstruction without hernia,221,NASOGASTRIC TUBE,247,Intestinal obstruction,06,Diseases and Disorders of the Digestive System,1,Minor,Minor,Medical,Medicare,Medicare,Private Health Insurance,,N,Y,33032.46,6628.52
Long Island,Nassau,2908000,000511,NYU Winthrop Hospital,0 to 17,110,M,White,Not Span/Hispanic,1,Emergency,Home or Self Care,2017,145,Intestinal obstruction without hernia,000,NO PROC,247,Intestinal obstruction,06,Diseases and Disorders of the Digestive System,1,Minor,Minor,Medical,Private Health Insurance,,,,N,Y,21874.93,4726.77
Long Island,Nassau,2908000,000511,NYU Winthrop Hospital,50 to 69,117,M,White,Not Span/Hispanic,1,Emergency,Home or Self Care,2017,145,Intestinal obstruction without hernia,000,NO PROC,247,Intestinal obstruction,06,Diseases and Disorders of the Digestive System,1,Minor,Minor,Medical,Federal/State/Local/VA,,,,N,Y,20477.77,4006.23
Long Island,Nassau,2908000,000511,NYU Winthrop Hospital,70 or Older,117,F,White,Not Span/Hispanic,6,Emergency,Home w/ Home Health Services,2017,145,Intestinal obstruction without hernia,000,NO PROC,247,Intestinal obstruction,06,Diseases and Disorders of the Digestive System,1,Minor,Moderate,Medical,Medicare,Medicare,,,N,Y,53213.70,11303.30
Long Island,Nassau,2908000,000511,NYU Winthrop Hospital,70 or Older,115,M,Black/African American,Not Span/Hispanic,2,Emergency,Home w/ Home Health Services,2017,145,Intestinal obstruction without hernia,000,NO PROC,247,Intestinal obstruction,06,Diseases and Disorders of the Digestive System,2,Moderate,Moderate,Medical,Medicare,Medicare,Blue Cross/Blue Shield,,N,Y,29262.51,6196.19
Long Island,Nassau,2908000,000511,NYU Winthrop Hospital,50 to 69,115,M,White,Spanish/Hispanic,3,Emergency,Home or Self Care,2017,145,Intestinal obstruction without hernia,221,NASOGASTRIC TUBE,247,Intestinal obstruction,06,Diseases and Disorders of the Digestive System,1,Minor,Minor,Medical,Blue Cross/Blue Shield,,,,N,Y,43136.12,6283.73
Long Island,Nassau,2908000,000511,NYU Winthrop Hospital,30 to 49,115,M,White,Spanish/Hispanic,1,Emergency,Home or Self Care,2017,145,Intestinal obstruction without hernia,000,NO PROC,247,Intestinal obstruction,06,Diseases and Disorders of the Digestive System,1,Minor,Minor,Medical,Self-Pay,,,,N,Y,22153.34,3844.12
Long Island,Nassau,2908000,000511,NYU Winthrop Hospital,70 or Older,115,M,White,Not Span/Hispanic,3,Emergency,Home w/ Home Health Services,2017,145,Intestinal obstruction without hernia,071,GASTROSTOMY; TEMP/PERM,247,Intestinal obstruction,06,Diseases and Disorders of the Digestive System,2,Moderate,Major,Medical,Medicare,Medicare,,,N,Y,50361.07,11154.25
Long Island,Nassau,2908000,000511,NYU Winthrop Hospital,50 to 69,117,F,White,Not Span/Hispanic,2,Emergency,Home or Self Care,2017,145,Intestinal obstruction without hernia,000,NO PROC,247,Intestinal obstruction,06,Diseases and Disorders of the Digestive System,1,Minor,Minor,Medical,Blue Cross/Blue Shield,,,,N,Y,48216.67,7971.91
Long Island,Nassau,2908000,000511,NYU Winthrop Hospital,70 or Older,115,M,White,Not Span/Hispanic,1,Emergency,Home or Self Care,2017,145,Intestinal obstruction without hernia,000,NO PROC,247,Intestinal obstruction,06,Diseases and Disorders of the Digestive System,1,Minor,Minor,Medical,Medicare,Medicare,Self-Pay,,N,Y,15091.32,2559.62
Long Island,Nassau,2908000,000511,NYU Winthrop Hospital,50 to 69,112,F,White,Not Span/Hispanic,6,Emergency,Home or Self Care,2017,145,Intestinal obstruction without hernia,000,NO PROC,247,Intestinal obstruction,06,Diseases and Disorders of the Digestive System,2,Moderate,Minor,Medical,Private Health Insurance,,,,N,Y,42755.14,8848.69