Hospital Service Area,Hospital County,Operating Certificate Number,Permanent Facility Id,Facility Name,Age Group,Zip Code - 3 digits,Gender,Race,Ethnicity,Length of Stay,Type of Admission,Patient Disposition,Discharge Year,CCS Diagnosis Code,CCS Diagnosis Description,CCS Procedure Code,CCS Procedure Description,APR DRG Code,APR DRG Description,APR MDC Code,APR MDC Description,APR Severity of Illness Code,APR Severity of Illness Description,APR Risk of Mortality,APR Medical Surgical Description,Payment Typology 1,Payment Typology 2,Payment Typology 3,Birth Weight,Abortion Edit Indicator,Emergency Department Indicator,Total Charges,Total Costs
New York City,Kings,7002002,001324,Mount Sinai Brooklyn,70 or Older,112,F,White,Not Span/Hispanic,10,Emergency,Home w/ Home Health Services,2017,142,Appendicitis and other appendiceal conditions,193,DX ULTRASOUND HEART,248,Major gastrointestinal & peritoneal infections,06,Diseases and Disorders of the Digestive System,3,Major,Major,Medical,Medicare,Blue Cross/Blue Shield,Medicaid,,N,Y,94948.24,15212.12
Central NY,Onondaga,3301008,000636,Crouse Hospital,70 or Older,130,M,White,Not Span/Hispanic,5,Emergency,Home or Self Care,2017,135,Intestinal infection,231,OTHER THERAPEUTIC PRCS,248,Major gastrointestinal & peritoneal infections,06,Diseases and Disorders of the Digestive System,3,Major,Major,Medical,Medicare,,,,N,Y,16733.29,7348.29
New York City,Bronx,7000006,001168,Montefiore Medical Center-Wakefield Hospital,50 to 69,104,M,Other Race,Spanish/Hispanic,3,Emergency,Home or Self Care,2017,135,Intestinal infection,231,OTHER THERAPEUTIC PRCS,248,Major gastrointestinal & peritoneal infections,06,Diseases and Disorders of the Digestive System,2,Moderate,Moderate,Medical,Medicare,,,,N,Y,58282.56,13743.85
New York City,Bronx,7000006,001169,Montefiore Medical Center - Henry & Lucy Moses Div,70 or Older,104,M,White,Not Span/Hispanic,15,Emergency,Home or Self Care,2017,135,Intestinal infection,000,NO PROC,248,Major gastrointestinal & peritoneal infections,06,Diseases and Disorders of the Digestive System,3,Major,Major,Medical,Medicare,Medicaid,,,N,Y,163768.60,34508.76
New York City,Bronx,7000006,001169,Montefiore Medical Center - Henry & Lucy Moses Div,30 to 49,104,F,Other Race,Spanish/Hispanic,4,Emergency,Home or Self Care,2017,135,Intestinal infection,231,OTHER THERAPEUTIC PRCS,248,Major gastrointestinal & peritoneal infections,06,Diseases and Disorders of the Digestive System,3,Major,Moderate,Medical,Medicaid,,,,N,Y,57529.35,11085.04
New York City,Bronx,7000006,001169,Montefiore Medical Center - Henry & Lucy Moses Div,0 to 17,104,F,Other Race,Spanish/Hispanic,3,Emergency,Home or Self Care,2017,135,Intestinal infection,000,NO PROC,248,Major gastrointestinal & peritoneal infections,06,Diseases and Disorders of the Digestive System,2,Moderate,Minor,Medical,Medicaid,,,,N,Y,31064.48,8741.00
New York City,Bronx,7000006,003058,Montefiore Med Center - Jack D Weiler Hosp of A Einstein College Div,70 or Older,104,F,Black/African American,Not Span/Hispanic,5,Emergency,Home w/ Home Health Services,2017,135,Intestinal infection,231,OTHER THERAPEUTIC PRCS,248,Major gastrointestinal & peritoneal infections,06,Diseases and Disorders of the Digestive System,3,Major,Major,Medical,Medicare,,,,N,Y,41919.71,9152.70
New York City,Bronx,7000006,003058,Montefiore Med Center - Jack D Weiler Hosp of A Einstein College Div,30 to 49,100,M,Other Race,Spanish/Hispanic,5,Emergency,Home or Self Care,2017,142,Appendicitis and other appendiceal conditions,231,OTHER THERAPEUTIC PRCS,248,Major gastrointestinal & peritoneal infections,06,Diseases and Disorders of the Digestive System,2,Moderate,Minor,Medical,Private Health Insurance,,,,N,Y,54704.76,9990.56
New York City,Kings,7002002,001324,Mount Sinai Brooklyn,70 or Older,112,M,White,Not Span/Hispanic,7,Emergency,Home w/ Home Health Services,2017,135,Intestinal infection,231,OTHER THERAPEUTIC PRCS,248,Major gastrointestinal & peritoneal infections,06,Diseases and Disorders of the Digestive System,3,Major,Major,Medical,Medicare,Private Health Insurance,Self-Pay,,N,Y,64510.18,12261.20
New York City,Manhattan,7002002,001439,Mount Sinai Beth Israel,50 to 69,100,F,White,Not Span/Hispanic,11,Emergency,Skilled Nursing Home,2017,135,Intestinal infection,231,OTHER THERAPEUTIC PRCS,248,Major gastrointestinal & peritoneal infections,06,Diseases and Disorders of the Digestive System,2,Moderate,Minor,Medical,Medicaid,Medicaid,Self-Pay,,N,Y,101582.28,39411.44
New York City,Manhattan,7002002,001439,Mount Sinai Beth Israel,30 to 49,112,F,Other Race,Not Span/Hispanic,3,Emergency,Home or Self Care,2017,142,Appendicitis and other appendiceal conditions,231,OTHER THERAPEUTIC PRCS,248,Major gastrointestinal & peritoneal infections,06,Diseases and Disorders of the Digestive System,2,Moderate,Moderate,Medical,Private Health Insurance,Self-Pay,,,N,Y,32255.98,9189.75
New York City,Manhattan,7002024,001456,Mount Sinai Hospital,70 or Older,100,F,Black/African American,Not Span/Hispanic,2,Emergency,Home w/ Home Health Services,2017,135,Intestinal infection,000,NO PROC,248,Major gastrointestinal & peritoneal infections,06,Diseases and Disorders of the Digestive System,2,Moderate,Moderate,Medical,Medicare,Medicare,Medicaid,,N,Y,25808.66,7901.63
Finger Lakes,Livingston,2527000,000393,Nicholas H Noyes Memorial Hospital,50 to 69,145,F,White,Not Span/Hispanic,6,Emergency,Skilled Nursing Home,2017,135,Intestinal infection,215,OT PHYS THER/REHAB,248,Major gastrointestinal & peritoneal infections,06,Diseases and Disorders of the Digestive System,2,Moderate,Moderate,Medical,Medicare,,,,N,Y,8838.85,5997.77
Finger Lakes,Livingston,2527000,000393,Nicholas H Noyes Memorial Hospital,70 or Older,144,M,White,Not Span/Hispanic,2,Emergency,Home or Self Care,2017,135,Intestinal infection,000,NO PROC,248,Major gastrointestinal & peritoneal infections,06,Diseases and Disorders of the Digestive System,2,Moderate,Minor,Medical,Blue Cross/Blue Shield,,,,N,Y,4981.05,2535.69
Hudson Valley,Orange,3523000,000699,Orange Regional Medical Center,70 or Older,125,F,White,Not Span/Hispanic,6,Emergency,Skilled Nursing Home,2017,135,Intestinal infection,000,NO PROC,248,Major gastrointestinal & peritoneal infections,06,Diseases and Disorders of the Digestive System,2,Moderate,Major,Medical,Medicare,Medicaid,,,N,Y,43414.09,22630.65
Hudson Valley,Orange,3523000,000699,Orange Regional Medical Center,50 to 69,127,M,White,Not Span/Hispanic,4,Emergency,Home or Self Care,2017,142,Appendicitis and other appendiceal conditions,088,ABDOMINAL PARACENTESIS,248,Major gastrointestinal & peritoneal infections,06,Diseases and Disorders of the Digestive System,3,Major,Major,Medical,Medicare,Private Health Insurance,,,N,Y,41807.55,9713.16
Hudson Valley,Orange,3523000,000699,Orange Regional Medical Center,18 to 29,125,M,White,Not Span/Hispanic,3,Emergency,Home or Self Care,2017,135,Intestinal infection,000,NO PROC,248,Major gastrointestinal & peritoneal infections,06,Diseases and Disorders of the Digestive System,1,Minor,Minor,Medical,Blue Cross/Blue Shield,,,,N,Y,17964.69,3709.11
Hudson Valley,Orange,3523000,000699,Orange Regional Medical Center,70 or Older,109,F,Other Race,Spanish/Hispanic,4,Emergency,Skilled Nursing Home,2017,142,Appendicitis and other appendiceal conditions,000,NO PROC,248,Major gastrointestinal & peritoneal infections,06,Diseases and Disorders of the Digestive System,3,Major,Major,Medical,Medicare,Medicaid,,,N,Y,27405.02,8557.66
Hudson Valley,Orange,3523000,000699,Orange Regional Medical Center,50 to 69,109,F,White,Not Span/Hispanic,2,Emergency,Home or Self Care,2017,135,Intestinal infection,222,BLOOD TRANSFUSION,248,Major gastrointestinal & peritoneal infections,06,Diseases and Disorders of the Digestive System,2,Moderate,Minor,Medical,Private Health Insurance,,,,N,Y,23164.71,8847.52
Hudson Valley,Orange,3529000,000704,St Anthony Community Hospital,70 or Older,109,F,White,Not Span/Hispanic,4,Emergency,Skilled Nursing Home,2017,135,Intestinal infection,000,NO PROC,248,Major gastrointestinal & peritoneal infections,06,Diseases and Disorders of the Digestive System,3,Major,Moderate,Medical,Medicare,Blue Cross/Blue Shield,,,N,Y,57943.36,12642.49
Hudson Valley,Orange,3535001,000708,Bon Secours Community Hospital,50 to 69,OOS,F,White,Not Span/Hispanic,2,Emergency,Home or Self Care,2017,135,Intestinal infection,000,NO PROC,248,Major gastrointestinal & peritoneal infections,06,Diseases and Disorders of the Digestive System,1,Minor,Minor,Medical,Medicare,,,,N,Y,33975.02,6123.73
Hudson Valley,Rockland,4329000,000779,Good Samaritan Hospital of Suffern,50 to 69,109,F,White,Not Span/Hispanic,3,Emergency,Home or Self Care,2017,135,Intestinal infection,000,NO PROC,248,Major gastrointestinal & peritoneal infections,06,Diseases and Disorders of the Digestive System,3,Major,Major,Medical,Medicare,Medicaid,,,N,Y,38728.73,7602.65
New York City,Bronx,7000006,001168,Montefiore Medical Center-Wakefield Hospital,50 to 69,104,F,Other Race,Spanish/Hispanic,3,Emergency,Home or Self Care,2017,135,Intestinal infection,000,NO PROC,248,Major gastrointestinal & peritoneal infections,06,Diseases and Disorders of the Digestive System,1,Minor,Minor,Medical,Medicare,Medicaid,,,N,Y,32912.52,5256.57
New York City,Bronx,7000006,001168,Montefiore Medical Center-Wakefield Hospital,18 to 29,104,M,Other Race,Spanish/Hispanic,1,Emergency,Home or Self Care,2017,142,Appendicitis and other appendiceal conditions,231,OTHER THERAPEUTIC PRCS,248,Major gastrointestinal & peritoneal infections,06,Diseases and Disorders of the Digestive System,2,Moderate,Minor,Medical,Private Health Insurance,,,,N,Y,23333.59,3048.01
New York City,Bronx,7000006,001169,Montefiore Medical Center - Henry & Lucy Moses Div,50 to 69,104,M,Black/African American,Not Span/Hispanic,11,Emergency,Home w/ Home Health Services,2017,135,Intestinal infection,231,OTHER THERAPEUTIC PRCS,248,Major gastrointestinal & peritoneal infections,06,Diseases and Disorders of the Digestive System,3,Major,Major,Medical,Medicare,Medicaid,,,N,Y,156129.07,47295.89
New York City,Kings,7002002,001324,Mount Sinai Brooklyn,70 or Older,112,F,White,Not Span/Hispanic,7,Emergency,Home or Self Care,2017,135,Intestinal infection,231,OTHER THERAPEUTIC PRCS,248,Major gastrointestinal & peritoneal infections,06,Diseases and Disorders of the Digestive System,2,Moderate,Moderate,Medical,Medicare,Private Health Insurance,Self-Pay,,N,Y,55534.65,9881.88
New York City,Kings,7002002,001324,Mount Sinai Brooklyn,70 or Older,112,F,White,Not Span/Hispanic,3,Emergency,Skilled Nursing Home,2017,135,Intestinal infection,231,OTHER THERAPEUTIC PRCS,248,Major gastrointestinal & peritoneal infections,06,Diseases and Disorders of the Digestive System,3,Major,Extreme,Medical,Medicare,Miscellaneous/Other,Medicaid,,N,Y,30789.12,5735.17
New York City,Manhattan,7002002,001439,Mount Sinai Beth Israel,50 to 69,100,M,White,Not Span/Hispanic,27,Emergency,Skilled Nursing Home,2017,135,Intestinal infection,231,OTHER THERAPEUTIC PRCS,248,Major gastrointestinal & peritoneal infections,06,Diseases and Disorders of the Digestive System,3,Major,Moderate,Medical,Medicaid,Medicaid,Self-Pay,,N,Y,203427.53,64773.75
New York City,Manhattan,7002002,001439,Mount Sinai Beth Israel,18 to 29,112,M,White,Not Span/Hispanic,3,Emergency,Home or Self Care,2017,142,Appendicitis and other appendiceal conditions,231,OTHER THERAPEUTIC PRCS,248,Major gastrointestinal & peritoneal infections,06,Diseases and Disorders of the Digestive System,2,Moderate,Minor,Medical,Private Health Insurance,Self-Pay,,,N,Y,29662.06,8244.79
New York City,Manhattan,7002024,001456,Mount Sinai Hospital,70 or Older,100,F,Other Race,Not Span/Hispanic,3,Emergency,Home or Self Care,2017,135,Intestinal infection,000,NO PROC,248,Major gastrointestinal & peritoneal infections,06,Diseases and Disorders of the Digestive System,3,Major,Major,Medical,Medicare,Medicare,Self-Pay,,N,Y,23032.05,7885.81
New York City,Manhattan,7002032,001466,Mount Sinai West,70 or Older,100,F,White,Not Span/Hispanic,1,Urgent,Home or Self Care,2017,148,Peritonitis and intestinal abscess,231,OTHER THERAPEUTIC PRCS,248,Major gastrointestinal & peritoneal infections,06,Diseases and Disorders of the Digestive System,2,Moderate,Major,Medical,Medicare,Private Health Insurance,Self-Pay,,N,N,12199.19,2949.40
Hudson Valley,Westchester,5904001,001072,Montefiore New Rochelle Hospital,70 or Older,108,F,White,Unknown,6,Emergency,Home or Self Care,2017,135,Intestinal infection,231,OTHER THERAPEUTIC PRCS,248,Major gastrointestinal & peritoneal infections,06,Diseases and Disorders of the Digestive System,3,Major,Major,Medical,Medicare,Medicare,Blue Cross/Blue Shield,,N,N,42822.27,20837.88
Hudson Valley,Westchester,5904001,001072,Montefiore New Rochelle Hospital,50 to 69,105,M,Black/African American,Unknown,1,Emergency,Home or Self Care,2017,142,Appendicitis and other appendiceal conditions,000,NO PROC,248,Major gastrointestinal & peritoneal infections,06,Diseases and Disorders of the Digestive System,2,Moderate,Minor,Medical,Medicaid,Medicaid,Self-Pay,,N,Y,15973.00,5237.42
Hudson Valley,Westchester,5904001,001072,Montefiore New Rochelle Hospital,70 or Older,108,F,Other Race,Spanish/Hispanic,6,Emergency,Home or Self Care,2017,135,Intestinal infection,000,NO PROC,248,Major gastrointestinal & peritoneal infections,06,Diseases and Disorders of the Digestive System,2,Moderate,Major,Medical,Medicare,Medicaid,Self-Pay,,N,N,47641.00,23077.50
New York City,Bronx,7000006,001169,Montefiore Medical Center - Henry & Lucy Moses Div,50 to 69,104,F,Black/African American,Not Span/Hispanic,3,Emergency,Home or Self Care,2017,142,Appendicitis and other appendiceal conditions,231,OTHER THERAPEUTIC PRCS,248,Major gastrointestinal & peritoneal infections,06,Diseases and Disorders of the Digestive System,2,Moderate,Minor,Medical,Medicare,Private Health Insurance,,,N,Y,48592.42,9962.45
New York City,Bronx,7000006,001169,Montefiore Medical Center - Henry & Lucy Moses Div,50 to 69,104,F,Black/African American,Not Span/Hispanic,8,Emergency,Home or Self Care,2017,135,Intestinal infection,000,NO PROC,248,Major gastrointestinal & peritoneal infections,06,Diseases and Disorders of the Digestive System,2,Moderate,Minor,Medical,Medicaid,,,,N,Y,82406.20,17816.68
New York City,Bronx,7000006,003058,Montefiore Med Center - Jack D Weiler Hosp of A Einstein College Div,70 or Older,104,M,Other Race,Spanish/Hispanic,25,Emergency,Skilled Nursing Home,2017,135,Intestinal infection,231,OTHER THERAPEUTIC PRCS,248,Major gastrointestinal & peritoneal infections,06,Diseases and Disorders of the Digestive System,3,Major,Major,Medical,Medicare,,,,N,Y,243154.33,52018.13
New York City,Bronx,7000006,003058,Montefiore Med Center - Jack D Weiler Hosp of A Einstein College Div,50 to 69,104,F,Other Race,Not Span/Hispanic,5,Emergency,Home or Self Care,2017,142,Appendicitis and other appendiceal conditions,221,NASOGASTRIC TUBE,248,Major gastrointestinal & peritoneal infections,06,Diseases and Disorders of the Digestive System,2,Moderate,Minor,Medical,Medicare,,,,N,Y,60494.68,11376.66
New York City,Kings,7001037,001320,University Hospital of Brooklyn,30 to 49,112,M,Black/African American,Not Span/Hispanic,6,Emergency,Home or Self Care,2017,142,Appendicitis and other appendiceal conditions,231,OTHER THERAPEUTIC PRCS,248,Major gastrointestinal & peritoneal infections,06,Diseases and Disorders of the Digestive System,2,Moderate,Minor,Medical,Medicaid,Medicaid,Self-Pay,,N,Y,34726.00,20051.24
New York City,Kings,7001037,001320,University Hospital of Brooklyn,50 to 69,112,F,Black/African American,Not Span/Hispanic,3,Emergency,Home or Self Care,2017,135,Intestinal infection,202,ELECTROCARDIOGRAM,248,Major gastrointestinal & peritoneal infections,06,Diseases and Disorders of the Digestive System,1,Minor,Minor,Medical,Medicaid,Medicaid,Self-Pay,,N,Y,20460.00,16579.74
New York City,Manhattan,7002002,001439,Mount Sinai Beth Israel,30 to 49,103,F,White,Not Span/Hispanic,5,Emergency,Home or Self Care,2017,135,Intestinal infection,231,OTHER THERAPEUTIC PRCS,248,Major gastrointestinal & peritoneal infections,06,Diseases and Disorders of the Digestive System,2,Moderate,Moderate,Medical,Medicaid,Medicaid,Self-Pay,,N,Y,57072.49,17337.38
New York City,Manhattan,7002024,001456,Mount Sinai Hospital,50 to 69,112,M,Other Race,Not Span/Hispanic,21,Urgent,Home w/ Home Health Services,2017,148,Peritonitis and intestinal abscess,088,ABDOMINAL PARACENTESIS,248,Major gastrointestinal & peritoneal infections,06,Diseases and Disorders of the Digestive System,4,Extreme,Extreme,Medical,Medicaid,Medicaid,Self-Pay,,N,N,210238.41,70399.50
New York City,Manhattan,7002024,001456,Mount Sinai Hospital,0 to 17,100,F,Other Race,Not Span/Hispanic,5,Emergency,Home or Self Care,2017,142,Appendicitis and other appendiceal conditions,000,NO PROC,248,Major gastrointestinal & peritoneal infections,06,Diseases and Disorders of the Digestive System,2,Moderate,Minor,Medical,Medicaid,Medicaid,Self-Pay,,N,Y,36406.23,26709.99
New York City,Manhattan,7002053,001463,NYU Langone Hospitals,30 to 49,100,F,White,Not Span/Hispanic,3,Emergency,Home or Self Care,2017,142,Appendicitis and other appendiceal conditions,000,NO PROC,248,Major gastrointestinal & peritoneal infections,06,Diseases and Disorders of the Digestive System,2,Moderate,Minor,Medical,Private Health Insurance,,,,N,Y,25697.65,10782.41
New York City,Manhattan,7002032,001466,Mount Sinai West,50 to 69,100,F,White,Not Span/Hispanic,3,Emergency,Home or Self Care,2017,142,Appendicitis and other appendiceal conditions,231,OTHER THERAPEUTIC PRCS,248,Major gastrointestinal & peritoneal infections,06,Diseases and Disorders of the Digestive System,2,Moderate,Minor,Medical,Private Health Insurance,Self-Pay,,,N,Y,28005.43,7245.82
New York City,Kings,7001008,001293,"New York Community Hospital of Brooklyn, Inc",70 or Older,112,F,White,Not Span/Hispanic,17,Emergency,Inpatient Rehabilitation Facility,2017,135,Intestinal infection,179,CT SCAN ABDOMEN,248,Major gastrointestinal & peritoneal infections,06,Diseases and Disorders of the Digestive System,3,Major,Extreme,Medical,Medicare,Private Health Insurance,Self-Pay,,N,Y,87800.18,34424.77
New York City,Kings,7001008,001293,"New York Community Hospital of Brooklyn, Inc",50 to 69,112,M,White,Not Span/Hispanic,10,Emergency,Home or Self Care,2017,142,Appendicitis and other appendiceal conditions,088,ABDOMINAL PARACENTESIS,248,Major gastrointestinal & peritoneal infections,06,Diseases and Disorders of the Digestive System,2,Moderate,Moderate,Medical,Medicaid,Medicaid,Self-Pay,,N,Y,35640.74,18208.55
New York City,Kings,7001008,001293,"New York Community Hospital of Brooklyn, Inc",30 to 49,116,M,White,Not Span/Hispanic,12,Emergency,Skilled Nursing Home,2017,135,Intestinal infection,216,RESP INTUB/MECH VENTIL,248,Major gastrointestinal & peritoneal infections,06,Diseases and Disorders of the Digestive System,4,Extreme,Extreme,Medical,Medicaid,Self-Pay,,,N,Y,42699.11,17577.12
New York City,Kings,7001008,001293,"New York Community Hospital of Brooklyn, Inc",70 or Older,112,F,White,Not Span/Hispanic,3,Emergency,Home or Self Care,2017,135,Intestinal infection,179,CT SCAN ABDOMEN,248,Major gastrointestinal & peritoneal infections,06,Diseases and Disorders of the Digestive System,2,Moderate,Moderate,Medical,Medicare,Medicaid,Self-Pay,,N,Y,10405.50,4348.99
New York City,Kings,7001021,001306,New York - Presbyterian Brooklyn Methodist Hospital,70 or Older,103,F,White,Not Span/Hispanic,7,Emergency,Psychiatric Hospital or Unit of Hosp,2017,135,Intestinal infection,054,OT VASC CATH; NOT HEART,248,Major gastrointestinal & peritoneal infections,06,Diseases and Disorders of the Digestive System,3,Major,Major,Medical,Medicare,Self-Pay,,,N,N,42977.15,12999.14
New York City,Kings,7001021,001306,New York - Presbyterian Brooklyn Methodist Hospital,50 to 69,112,F,White,Not Span/Hispanic,6,Emergency,Skilled Nursing Home,2017,135,Intestinal infection,000,NO PROC,248,Major gastrointestinal & peritoneal infections,06,Diseases and Disorders of the Digestive System,3,Major,Major,Medical,Medicare,Private Health Insurance,Self-Pay,,N,N,29925.19,9657.04
New York City,Kings,7001021,001306,New York - Presbyterian Brooklyn Methodist Hospital,0 to 17,112,M,Other Race,Not Span/Hispanic,1,Emergency,Home or Self Care,2017,135,Intestinal infection,000,NO PROC,248,Major gastrointestinal & peritoneal infections,06,Diseases and Disorders of the Digestive System,1,Minor,Minor,Medical,Private Health Insurance,Self-Pay,,,N,Y,7754.23,3390.03
New York City,Kings,7001021,001306,New York - Presbyterian Brooklyn Methodist Hospital,30 to 49,112,M,Other Race,Not Span/Hispanic,3,Emergency,Home or Self Care,2017,135,Intestinal infection,092,OTHER BOWEL DX PRCS,248,Major gastrointestinal & peritoneal infections,06,Diseases and Disorders of the Digestive System,2,Moderate,Minor,Medical,Medicaid,Medicaid,Self-Pay,,N,Y,22526.52,7878.15
New York City,Kings,7001021,001306,New York - Presbyterian Brooklyn Methodist Hospital,50 to 69,112,M,White,Not Span/Hispanic,6,Emergency,Home or Self Care,2017,135,Intestinal infection,000,NO PROC,248,Major gastrointestinal & peritoneal infections,06,Diseases and Disorders of the Digestive System,3,Major,Major,Medical,Medicare,Medicare,Self-Pay,,N,Y,34542.81,10523.64
New York City,Kings,7001021,001306,New York - Presbyterian Brooklyn Methodist Hospital,30 to 49,112,F,White,Not Span/Hispanic,6,Emergency,Home or Self Care,2017,135,Intestinal infection,000,NO PROC,248,Major gastrointestinal & peritoneal infections,06,Diseases and Disorders of the Digestive System,1,Minor,Minor,Medical,Private Health Insurance,Self-Pay,,,N,Y,43288.30,13041.79
New York City,Kings,7001021,001306,New York - Presbyterian Brooklyn Methodist Hospital,50 to 69,112,M,Black/African American,Not Span/Hispanic,5,Emergency,Home or Self Care,2017,135,Intestinal infection,222,BLOOD TRANSFUSION,248,Major gastrointestinal & peritoneal infections,06,Diseases and Disorders of the Digestive System,3,Major,Major,Medical,Medicare,Medicaid,Self-Pay,,N,Y,38964.23,13782.21
New York City,Kings,7001021,001306,New York - Presbyterian Brooklyn Methodist Hospital,50 to 69,112,F,Other Race,Not Span/Hispanic,7,Emergency,Home w/ Home Health Services,2017,135,Intestinal infection,000,NO PROC,248,Major gastrointestinal & peritoneal infections,06,Diseases and Disorders of the Digestive System,3,Major,Moderate,Medical,Medicare,Self-Pay,,,N,Y,38233.72,11785.54
New York City,Kings,7001021,001306,New York - Presbyterian Brooklyn Methodist Hospital,30 to 49,112,F,Other Race,Spanish/Hispanic,5,Emergency,Home or Self Care,2017,135,Intestinal infection,054,OT VASC CATH; NOT HEART,248,Major gastrointestinal & peritoneal infections,06,Diseases and Disorders of the Digestive System,3,Major,Moderate,Medical,Medicaid,Medicaid,Self-Pay,,N,Y,29141.63,8908.58
New York City,Kings,7001021,001306,New York - Presbyterian Brooklyn Methodist Hospital,18 to 29,112,F,Other Race,Spanish/Hispanic,1,Emergency,Home or Self Care,2017,135,Intestinal infection,000,NO PROC,248,Major gastrointestinal & peritoneal infections,06,Diseases and Disorders of the Digestive System,2,Moderate,Minor,Medical,Private Health Insurance,Self-Pay,,,N,Y,8747.16,2347.59
New York City,Kings,7001021,001306,New York - Presbyterian Brooklyn Methodist Hospital,50 to 69,112,M,Black/African American,Not Span/Hispanic,5,Emergency,Home w/ Home Health Services,2017,135,Intestinal infection,058,HEMODIALYSIS,248,Major gastrointestinal & peritoneal infections,06,Diseases and Disorders of the Digestive System,2,Moderate,Moderate,Medical,Medicare,Private Health Insurance,Self-Pay,,N,Y,33630.41,11858.22