Hospital Service Area,Hospital County,Operating Certificate Number,Permanent Facility Id,Facility Name,Age Group,Zip Code - 3 digits,Gender,Race,Ethnicity,Length of Stay,Type of Admission,Patient Disposition,Discharge Year,CCS Diagnosis Code,CCS Diagnosis Description,CCS Procedure Code,CCS Procedure Description,APR DRG Code,APR DRG Description,APR MDC Code,APR MDC Description,APR Severity of Illness Code,APR Severity of Illness Description,APR Risk of Mortality,APR Medical Surgical Description,Payment Typology 1,Payment Typology 2,Payment Typology 3,Birth Weight,Abortion Edit Indicator,Emergency Department Indicator,Total Charges,Total Costs
New York City,Manhattan,7002001,001438,Bellevue Hospital Center,50 to 69,100,F,Other Race,Spanish/Hispanic,13,Emergency,Home or Self Care,2017,148,Peritonitis and intestinal abscess,088,ABDOMINAL PARACENTESIS,248,Major gastrointestinal & peritoneal infections,06,Diseases and Disorders of the Digestive System,3,Major,Major,Medical,Medicaid,Medicaid,,,N,Y,74464.58,48010.89
New York City,Manhattan,7002001,001438,Bellevue Hospital Center,30 to 49,100,M,Other Race,Spanish/Hispanic,9,Emergency,Home w/ Home Health Services,2017,142,Appendicitis and other appendiceal conditions,088,ABDOMINAL PARACENTESIS,248,Major gastrointestinal & peritoneal infections,06,Diseases and Disorders of the Digestive System,2,Moderate,Minor,Medical,Medicaid,Medicaid,,,N,Y,41036.23,26458.03
New York City,Manhattan,7002001,001438,Bellevue Hospital Center,30 to 49,112,M,Other Race,Not Span/Hispanic,5,Emergency,Home or Self Care,2017,008,Other infections; including parasitic,000,NO PROC,248,Major gastrointestinal & peritoneal infections,06,Diseases and Disorders of the Digestive System,1,Minor,Minor,Medical,Medicaid,Medicaid,,,N,N,29324.84,18907.13
New York City,Manhattan,7002001,001438,Bellevue Hospital Center,50 to 69,100,F,White,Not Span/Hispanic,2,Emergency,Home or Self Care,2017,135,Intestinal infection,194,DX ULTRASOUND OF GI,248,Major gastrointestinal & peritoneal infections,06,Diseases and Disorders of the Digestive System,2,Moderate,Minor,Medical,Medicaid,,,,N,Y,20891.36,13469.66
New York City,Manhattan,7002001,001438,Bellevue Hospital Center,30 to 49,100,M,Other Race,Not Span/Hispanic,5,Emergency,Home or Self Care,2017,135,Intestinal infection,092,OTHER BOWEL DX PRCS,248,Major gastrointestinal & peritoneal infections,06,Diseases and Disorders of the Digestive System,2,Moderate,Minor,Medical,Medicaid,Medicaid,,,N,Y,31663.05,20414.69
New York City,Manhattan,7002001,001438,Bellevue Hospital Center,50 to 69,100,M,Other Race,Not Span/Hispanic,9,Emergency,Skilled Nursing Home,2017,211,Other connective tissue disease,168,"INCIS/DRAIN, SKIN/SUBCU",248,Major gastrointestinal & peritoneal infections,06,Diseases and Disorders of the Digestive System,3,Major,Moderate,Medical,Medicaid,,,,N,Y,53914.28,34761.12
New York City,Manhattan,7002001,001438,Bellevue Hospital Center,50 to 69,100,M,Other Race,Not Span/Hispanic,3,Emergency,Home or Self Care,2017,142,Appendicitis and other appendiceal conditions,088,ABDOMINAL PARACENTESIS,248,Major gastrointestinal & peritoneal infections,06,Diseases and Disorders of the Digestive System,2,Moderate,Moderate,Medical,Self-Pay,,,,N,Y,23931.61,15429.86
New York City,Manhattan,7002001,001438,Bellevue Hospital Center,50 to 69,100,F,Black/African American,Not Span/Hispanic,3,Emergency,Home or Self Care,2017,148,Peritonitis and intestinal abscess,088,ABDOMINAL PARACENTESIS,248,Major gastrointestinal & peritoneal infections,06,Diseases and Disorders of the Digestive System,2,Moderate,Moderate,Medical,Medicaid,,,,N,Y,20437.89,13177.29
New York City,Manhattan,7002001,001438,Bellevue Hospital Center,18 to 29,,M,Other Race,Not Span/Hispanic,3,Emergency,Home or Self Care,2017,142,Appendicitis and other appendiceal conditions,000,NO PROC,248,Major gastrointestinal & peritoneal infections,06,Diseases and Disorders of the Digestive System,2,Moderate,Minor,Medical,Self-Pay,,,,N,Y,19868.24,12810.01
New York City,Manhattan,7002001,001438,Bellevue Hospital Center,50 to 69,101,M,Other Race,Not Span/Hispanic,6,Emergency,Home or Self Care,2017,135,Intestinal infection,000,NO PROC,248,Major gastrointestinal & peritoneal infections,06,Diseases and Disorders of the Digestive System,3,Major,Minor,Medical,Self-Pay,,,,N,Y,32458.68,20927.67
New York City,Manhattan,7002001,001438,Bellevue Hospital Center,50 to 69,113,M,Other Race,Not Span/Hispanic,9,Emergency,Home or Self Care,2017,148,Peritonitis and intestinal abscess,088,ABDOMINAL PARACENTESIS,248,Major gastrointestinal & peritoneal infections,06,Diseases and Disorders of the Digestive System,2,Moderate,Moderate,Medical,Department of Corrections,,,,N,Y,46383.30,29905.54
New York City,Manhattan,7002001,001438,Bellevue Hospital Center,30 to 49,112,M,Black/African American,Not Span/Hispanic,3,Emergency,Home or Self Care,2017,142,Appendicitis and other appendiceal conditions,088,ABDOMINAL PARACENTESIS,248,Major gastrointestinal & peritoneal infections,06,Diseases and Disorders of the Digestive System,2,Moderate,Minor,Medical,Private Health Insurance,,,,N,Y,20061.43,12934.57
New York City,Manhattan,7002001,001438,Bellevue Hospital Center,50 to 69,100,F,Other Race,Not Span/Hispanic,21,Emergency,Skilled Nursing Home,2017,135,Intestinal infection,054,OT VASC CATH; NOT HEART,248,Major gastrointestinal & peritoneal infections,06,Diseases and Disorders of the Digestive System,3,Major,Major,Medical,Medicaid,Medicaid,,,N,Y,113684.91,73298.12
New York City,Manhattan,7002001,001438,Bellevue Hospital Center,30 to 49,100,M,Other Race,Not Span/Hispanic,4,Emergency,Home or Self Care,2017,148,Peritonitis and intestinal abscess,088,ABDOMINAL PARACENTESIS,248,Major gastrointestinal & peritoneal infections,06,Diseases and Disorders of the Digestive System,2,Moderate,Moderate,Medical,Self-Pay,,,,N,Y,25740.06,16595.85
New York City,Manhattan,7002001,001438,Bellevue Hospital Center,30 to 49,113,M,Other Race,Spanish/Hispanic,3,Emergency,Home or Self Care,2017,142,Appendicitis and other appendiceal conditions,231,OTHER THERAPEUTIC PRCS,248,Major gastrointestinal & peritoneal infections,06,Diseases and Disorders of the Digestive System,2,Moderate,Minor,Medical,Medicaid,,,,N,Y,19846.76,12796.16
New York City,Manhattan,7002001,001438,Bellevue Hospital Center,70 or Older,104,F,Other Race,Not Span/Hispanic,4,Emergency,Skilled Nursing Home,2017,135,Intestinal infection,231,OTHER THERAPEUTIC PRCS,248,Major gastrointestinal & peritoneal infections,06,Diseases and Disorders of the Digestive System,3,Major,Major,Medical,Medicare,Medicaid,,,N,Y,26451.79,17054.74
New York City,Manhattan,7002001,001438,Bellevue Hospital Center,30 to 49,112,M,Other Race,Spanish/Hispanic,2,Emergency,Home or Self Care,2017,142,Appendicitis and other appendiceal conditions,231,OTHER THERAPEUTIC PRCS,248,Major gastrointestinal & peritoneal infections,06,Diseases and Disorders of the Digestive System,2,Moderate,Minor,Medical,Medicaid,,,,N,Y,14913.64,9615.54
New York City,Manhattan,7002001,001438,Bellevue Hospital Center,30 to 49,113,M,Other Race,Not Span/Hispanic,6,Emergency,Home or Self Care,2017,142,Appendicitis and other appendiceal conditions,231,OTHER THERAPEUTIC PRCS,248,Major gastrointestinal & peritoneal infections,06,Diseases and Disorders of the Digestive System,3,Major,Minor,Medical,Self-Pay,,,,N,Y,35829.12,23100.75
New York City,Manhattan,7002001,001438,Bellevue Hospital Center,30 to 49,111,M,Other Race,Not Span/Hispanic,3,Emergency,Home or Self Care,2017,142,Appendicitis and other appendiceal conditions,231,OTHER THERAPEUTIC PRCS,248,Major gastrointestinal & peritoneal infections,06,Diseases and Disorders of the Digestive System,2,Moderate,Minor,Medical,Medicaid,,,,N,Y,19737.16,12725.49
New York City,Manhattan,7002001,001438,Bellevue Hospital Center,0 to 17,113,F,Other Race,Spanish/Hispanic,2,Emergency,Home or Self Care,2017,135,Intestinal infection,231,OTHER THERAPEUTIC PRCS,248,Major gastrointestinal & peritoneal infections,06,Diseases and Disorders of the Digestive System,2,Moderate,Minor,Medical,Medicaid,Medicaid,,,N,Y,12468.43,8039.00
New York City,Manhattan,7002001,001438,Bellevue Hospital Center,18 to 29,112,F,Other Race,Spanish/Hispanic,4,Emergency,Home or Self Care,2017,142,Appendicitis and other appendiceal conditions,231,OTHER THERAPEUTIC PRCS,248,Major gastrointestinal & peritoneal infections,06,Diseases and Disorders of the Digestive System,2,Moderate,Minor,Medical,Medicaid,Medicaid,,,N,Y,26252.93,16926.52
New York City,Manhattan,7002001,001438,Bellevue Hospital Center,50 to 69,100,F,Black/African American,Not Span/Hispanic,2,Emergency,Home or Self Care,2017,148,Peritonitis and intestinal abscess,088,ABDOMINAL PARACENTESIS,248,Major gastrointestinal & peritoneal infections,06,Diseases and Disorders of the Digestive System,3,Major,Moderate,Medical,Medicaid,,,,N,Y,15555.29,10029.24
New York City,Manhattan,7002001,001438,Bellevue Hospital Center,18 to 29,100,F,Black/African American,Not Span/Hispanic,2,Emergency,Home or Self Care,2017,135,Intestinal infection,222,BLOOD TRANSFUSION,248,Major gastrointestinal & peritoneal infections,06,Diseases and Disorders of the Digestive System,1,Minor,Minor,Medical,Blue Cross/Blue Shield,,,,N,Y,13628.60,8787.01
New York City,Manhattan,7002001,001438,Bellevue Hospital Center,50 to 69,113,M,Other Race,Not Span/Hispanic,5,Emergency,Home or Self Care,2017,135,Intestinal infection,070,UP GASTRO ENDOSC/BIOPSY,248,Major gastrointestinal & peritoneal infections,06,Diseases and Disorders of the Digestive System,2,Moderate,Moderate,Medical,Medicaid,,,,N,N,31009.18,19993.11
New York City,Manhattan,7002001,001438,Bellevue Hospital Center,0 to 17,100,M,Other Race,Spanish/Hispanic,4,Emergency,Home or Self Care,2017,142,Appendicitis and other appendiceal conditions,231,OTHER THERAPEUTIC PRCS,248,Major gastrointestinal & peritoneal infections,06,Diseases and Disorders of the Digestive System,2,Moderate,Minor,Medical,Medicaid,Medicaid,,,N,Y,25884.08,16688.71
New York City,Manhattan,7002001,001438,Bellevue Hospital Center,30 to 49,100,F,Other Race,Not Span/Hispanic,14,Emergency,Home or Self Care,2017,135,Intestinal infection,183,ROUTINE CHEST X-RAY,248,Major gastrointestinal & peritoneal infections,06,Diseases and Disorders of the Digestive System,2,Moderate,Minor,Medical,Medicare,Medicare,Medicaid,,N,N,71975.56,46406.10
New York City,Manhattan,7002001,001438,Bellevue Hospital Center,50 to 69,112,F,Other Race,Not Span/Hispanic,8,Emergency,Expired,2017,135,Intestinal infection,197,OTHER DX ULTRASOUND,248,Major gastrointestinal & peritoneal infections,06,Diseases and Disorders of the Digestive System,4,Extreme,Extreme,Medical,Medicare,Medicare,Medicaid,,N,Y,51360.93,33114.86
New York City,Manhattan,7002001,001438,Bellevue Hospital Center,18 to 29,112,F,White,Not Span/Hispanic,4,Emergency,Home or Self Care,2017,142,Appendicitis and other appendiceal conditions,231,OTHER THERAPEUTIC PRCS,248,Major gastrointestinal & peritoneal infections,06,Diseases and Disorders of the Digestive System,2,Moderate,Minor,Medical,Private Health Insurance,,,,N,Y,26270.53,16937.87
New York City,Manhattan,7002001,001438,Bellevue Hospital Center,50 to 69,114,F,Black/African American,Not Span/Hispanic,10,Emergency,Home or Self Care,2017,135,Intestinal infection,000,NO PROC,248,Major gastrointestinal & peritoneal infections,06,Diseases and Disorders of the Digestive System,2,Moderate,Major,Medical,Medicaid,,,,N,Y,52443.22,33812.66
New York City,Manhattan,7002001,001438,Bellevue Hospital Center,50 to 69,100,F,Black/African American,Not Span/Hispanic,2,Emergency,Home or Self Care,2017,142,Appendicitis and other appendiceal conditions,231,OTHER THERAPEUTIC PRCS,248,Major gastrointestinal & peritoneal infections,06,Diseases and Disorders of the Digestive System,2,Moderate,Moderate,Medical,Medicaid,Medicaid,,,N,Y,16771.85,10813.62
New York City,Manhattan,7002001,001438,Bellevue Hospital Center,0 to 17,113,F,Other Race,Spanish/Hispanic,5,Emergency,Home or Self Care,2017,142,Appendicitis and other appendiceal conditions,000,NO PROC,248,Major gastrointestinal & peritoneal infections,06,Diseases and Disorders of the Digestive System,2,Moderate,Minor,Medical,Medicaid,Medicaid,,,N,Y,29427.58,18973.37
New York City,Manhattan,7002001,001438,Bellevue Hospital Center,30 to 49,113,F,Black/African American,Not Span/Hispanic,2,Emergency,Skilled Nursing Home,2017,135,Intestinal infection,177,COMP AXIAL TOMOGR (CT),248,Major gastrointestinal & peritoneal infections,06,Diseases and Disorders of the Digestive System,3,Major,Major,Medical,Medicaid,,,,N,Y,19715.89,12711.78
New York City,Manhattan,7002001,001438,Bellevue Hospital Center,0 to 17,113,M,Other Race,Spanish/Hispanic,4,Emergency,Home or Self Care,2017,142,Appendicitis and other appendiceal conditions,231,OTHER THERAPEUTIC PRCS,248,Major gastrointestinal & peritoneal infections,06,Diseases and Disorders of the Digestive System,2,Moderate,Minor,Medical,Self-Pay,,,,N,Y,24467.07,15775.09
New York City,Manhattan,7002001,001438,Bellevue Hospital Center,50 to 69,114,F,Black/African American,Not Span/Hispanic,3,Emergency,Home or Self Care,2017,135,Intestinal infection,231,OTHER THERAPEUTIC PRCS,248,Major gastrointestinal & peritoneal infections,06,Diseases and Disorders of the Digestive System,3,Major,Moderate,Medical,Medicaid,,,,N,Y,20888.19,13467.62
New York City,Manhattan,7002001,001438,Bellevue Hospital Center,30 to 49,113,M,Other Race,Not Span/Hispanic,10,Emergency,Home or Self Care,2017,142,Appendicitis and other appendiceal conditions,000,NO PROC,248,Major gastrointestinal & peritoneal infections,06,Diseases and Disorders of the Digestive System,2,Moderate,Minor,Medical,Medicaid,,,,N,Y,59386.97,38289.63
New York City,Manhattan,7002001,001438,Bellevue Hospital Center,50 to 69,113,M,Other Race,Not Span/Hispanic,10,Emergency,Home or Self Care,2017,142,Appendicitis and other appendiceal conditions,231,OTHER THERAPEUTIC PRCS,248,Major gastrointestinal & peritoneal infections,06,Diseases and Disorders of the Digestive System,3,Major,Moderate,Medical,Medicaid,,,,N,Y,56441.39,36390.47
New York City,Manhattan,7002001,001438,Bellevue Hospital Center,30 to 49,112,M,Other Race,Spanish/Hispanic,3,Emergency,Home or Self Care,2017,142,Appendicitis and other appendiceal conditions,088,ABDOMINAL PARACENTESIS,248,Major gastrointestinal & peritoneal infections,06,Diseases and Disorders of the Digestive System,2,Moderate,Minor,Medical,Medicaid,Medicaid,,,N,Y,21323.89,13748.54
New York City,Manhattan,7002001,001438,Bellevue Hospital Center,30 to 49,113,M,Other Race,Not Span/Hispanic,7,Emergency,Home or Self Care,2017,142,Appendicitis and other appendiceal conditions,088,ABDOMINAL PARACENTESIS,248,Major gastrointestinal & peritoneal infections,06,Diseases and Disorders of the Digestive System,2,Moderate,Minor,Medical,Medicaid,,,,N,Y,40399.65,26047.59
New York City,Manhattan,7002001,001438,Bellevue Hospital Center,70 or Older,100,F,White,Not Span/Hispanic,9,Emergency,Home or Self Care,2017,135,Intestinal infection,000,NO PROC,248,Major gastrointestinal & peritoneal infections,06,Diseases and Disorders of the Digestive System,1,Minor,Minor,Medical,Medicare,Medicaid,,,N,Y,47529.72,30644.69
New York City,Manhattan,7002001,001438,Bellevue Hospital Center,70 or Older,113,F,White,Not Span/Hispanic,8,Emergency,Home or Self Care,2017,135,Intestinal infection,000,NO PROC,248,Major gastrointestinal & peritoneal infections,06,Diseases and Disorders of the Digestive System,1,Minor,Moderate,Medical,Medicaid,,,,N,Y,45513.92,29345.01
New York City,Manhattan,7002001,001438,Bellevue Hospital Center,70 or Older,100,M,Other Race,Spanish/Hispanic,2,Emergency,Inpatient Rehabilitation Facility,2017,135,Intestinal infection,231,OTHER THERAPEUTIC PRCS,248,Major gastrointestinal & peritoneal infections,06,Diseases and Disorders of the Digestive System,2,Moderate,Moderate,Medical,Medicare,Medicaid,,,N,Y,17056.46,10997.12
New York City,Manhattan,7002001,001438,Bellevue Hospital Center,70 or Older,100,M,Other Race,Not Span/Hispanic,8,Emergency,Home w/ Home Health Services,2017,135,Intestinal infection,231,OTHER THERAPEUTIC PRCS,248,Major gastrointestinal & peritoneal infections,06,Diseases and Disorders of the Digestive System,2,Moderate,Moderate,Medical,Medicare,Medicaid,,,N,Y,43837.28,28264.00
New York City,Manhattan,7002001,001438,Bellevue Hospital Center,30 to 49,113,M,Other Race,Not Span/Hispanic,13,Emergency,Home or Self Care,2017,135,Intestinal infection,000,NO PROC,248,Major gastrointestinal & peritoneal infections,06,Diseases and Disorders of the Digestive System,3,Major,Moderate,Medical,Medicaid,,,,N,Y,69826.08,45020.23
New York City,Manhattan,7002001,001438,Bellevue Hospital Center,50 to 69,103,M,Other Race,Spanish/Hispanic,3,Emergency,Home or Self Care,2017,142,Appendicitis and other appendiceal conditions,231,OTHER THERAPEUTIC PRCS,248,Major gastrointestinal & peritoneal infections,06,Diseases and Disorders of the Digestive System,2,Moderate,Minor,Medical,Medicaid,,,,N,Y,19661.11,12676.46
New York City,Manhattan,7002001,001438,Bellevue Hospital Center,0 to 17,113,F,Other Race,Not Span/Hispanic,5,Emergency,Home or Self Care,2017,148,Peritonitis and intestinal abscess,196,DX ULTRASOUND AB/RETRO,248,Major gastrointestinal & peritoneal infections,06,Diseases and Disorders of the Digestive System,3,Major,Minor,Medical,Medicaid,Medicaid,,,N,Y,32248.35,20792.06
New York City,Manhattan,7002001,001438,Bellevue Hospital Center,50 to 69,112,M,Other Race,Not Span/Hispanic,2,Emergency,Home or Self Care,2017,142,Appendicitis and other appendiceal conditions,231,OTHER THERAPEUTIC PRCS,248,Major gastrointestinal & peritoneal infections,06,Diseases and Disorders of the Digestive System,2,Moderate,Minor,Medical,Medicaid,,,,N,Y,15428.29,9947.36
New York City,Manhattan,7002001,001438,Bellevue Hospital Center,50 to 69,104,M,Other Race,Not Span/Hispanic,10,Emergency,Home or Self Care,2017,142,Appendicitis and other appendiceal conditions,088,ABDOMINAL PARACENTESIS,248,Major gastrointestinal & peritoneal infections,06,Diseases and Disorders of the Digestive System,2,Moderate,Minor,Medical,Medicaid,Medicaid,,,N,N,56267.34,36278.25
New York City,Manhattan,7002001,001438,Bellevue Hospital Center,50 to 69,100,F,Other Race,Spanish/Hispanic,1,Emergency,Home or Self Care,2017,135,Intestinal infection,032,OT NON-OR THER PRC NOSE,248,Major gastrointestinal & peritoneal infections,06,Diseases and Disorders of the Digestive System,2,Moderate,Minor,Medical,Medicaid,,,,N,Y,7826.78,5046.30
New York City,Manhattan,7002001,001438,Bellevue Hospital Center,50 to 69,112,M,Other Race,Spanish/Hispanic,3,Emergency,Home or Self Care,2017,135,Intestinal infection,179,CT SCAN ABDOMEN,248,Major gastrointestinal & peritoneal infections,06,Diseases and Disorders of the Digestive System,2,Moderate,Minor,Medical,Medicaid,Medicaid,,,N,Y,20675.41,13330.43
New York City,Manhattan,7002001,001438,Bellevue Hospital Center,0 to 17,112,F,Other Race,Spanish/Hispanic,1,Emergency,Home or Self Care,2017,135,Intestinal infection,196,DX ULTRASOUND AB/RETRO,248,Major gastrointestinal & peritoneal infections,06,Diseases and Disorders of the Digestive System,1,Minor,Minor,Medical,Self-Pay,,,,N,Y,8558.34,5517.97
New York City,Manhattan,7002001,001438,Bellevue Hospital Center,50 to 69,146,F,Black/African American,Not Span/Hispanic,3,Emergency,Home or Self Care,2017,135,Intestinal infection,222,BLOOD TRANSFUSION,248,Major gastrointestinal & peritoneal infections,06,Diseases and Disorders of the Digestive System,3,Major,Moderate,Medical,Medicare,Medicaid,,,N,Y,18012.77,11613.70
New York City,Manhattan,7002001,001438,Bellevue Hospital Center,18 to 29,100,M,Other Race,Spanish/Hispanic,7,Emergency,Home or Self Care,2017,135,Intestinal infection,076,COLONOSCOPY AND BIOPSY,248,Major gastrointestinal & peritoneal infections,06,Diseases and Disorders of the Digestive System,2,Moderate,Minor,Medical,Medicaid,Medicaid,,,N,Y,38623.11,24902.17
New York City,Manhattan,7002001,001438,Bellevue Hospital Center,0 to 17,112,F,Other Race,Spanish/Hispanic,5,Emergency,Home or Self Care,2017,142,Appendicitis and other appendiceal conditions,000,NO PROC,248,Major gastrointestinal & peritoneal infections,06,Diseases and Disorders of the Digestive System,2,Moderate,Minor,Medical,Medicaid,Medicaid,,,N,Y,30513.14,19673.29
New York City,Manhattan,7002001,001438,Bellevue Hospital Center,70 or Older,100,M,Black/African American,Not Span/Hispanic,17,Emergency,Home or Self Care,2017,148,Peritonitis and intestinal abscess,058,HEMODIALYSIS,248,Major gastrointestinal & peritoneal infections,06,Diseases and Disorders of the Digestive System,3,Major,Major,Medical,Medicaid,,,,N,Y,102950.52,66377.14
