Hospital Service Area,Hospital County,Operating Certificate Number,Permanent Facility Id,Facility Name,Age Group,Zip Code - 3 digits,Gender,Race,Ethnicity,Length of Stay,Type of Admission,Patient Disposition,Discharge Year,CCS Diagnosis Code,CCS Diagnosis Description,CCS Procedure Code,CCS Procedure Description,APR DRG Code,APR DRG Description,APR MDC Code,APR MDC Description,APR Severity of Illness Code,APR Severity of Illness Description,APR Risk of Mortality,APR Medical Surgical Description,Payment Typology 1,Payment Typology 2,Payment Typology 3,Birth Weight,Abortion Edit Indicator,Emergency Department Indicator,Total Charges,Total Costs
Long Island,Nassau,2908000,000511,NYU Langone Hospital-Long Island,70 or Older,115,F,White,Not Span/Hispanic,3,Emergency,Home or Self Care,2020,DIG001,INTESTINAL INFECTION,OTR004,ISOLATION PROCEDURES,248,MAJOR GASTROINTESTINAL & PERITONEAL INFECTIONS,06,DISEASES AND DISORDERS OF THE DIGESTIVE SYSTEM,2,Moderate,Moderate,Medical,Medicare,Private Health Insurance,,,,Y,51357.59,17168.59
Long Island,Nassau,2908000,000511,NYU Langone Hospital-Long Island,50 to 69,115,M,White,Not Span/Hispanic,3,Emergency,Home or Self Care,2020,DIG009,APPENDICITIS AND OTHER APPENDICEAL CONDITIONS,GIS006,PARACENTESIS,248,MAJOR GASTROINTESTINAL & PERITONEAL INFECTIONS,06,DISEASES AND DISORDERS OF THE DIGESTIVE SYSTEM,2,Moderate,Minor,Medical,Blue Cross/Blue Shield,,,,,Y,64183.29,13194.03
Long Island,Nassau,2908000,000511,NYU Langone Hospital-Long Island,70 or Older,115,F,White,Not Span/Hispanic,13,Emergency,Inpatient Rehabilitation Facility,2020,DIG009,APPENDICITIS AND OTHER APPENDICEAL CONDITIONS,GIS006,PARACENTESIS,248,MAJOR GASTROINTESTINAL & PERITONEAL INFECTIONS,06,DISEASES AND DISORDERS OF THE DIGESTIVE SYSTEM,2,Moderate,Major,Medical,Medicare,Medicare,,,,Y,175179.89,47089.61
Long Island,Nassau,2908000,000511,NYU Langone Hospital-Long Island,50 to 69,115,F,Black/African American,Not Span/Hispanic,3,Emergency,Home or Self Care,2020,DIG001,INTESTINAL INFECTION,,,248,MAJOR GASTROINTESTINAL & PERITONEAL INFECTIONS,06,DISEASES AND DISORDERS OF THE DIGESTIVE SYSTEM,2,Moderate,Minor,Medical,Blue Cross/Blue Shield,,,,,Y,62454.7,16657.11
Long Island,Nassau,2908000,000511,NYU Langone Hospital-Long Island,50 to 69,115,M,Black/African American,Not Span/Hispanic,5,Emergency,Home w/ Home Health Services,2020,DIG016,PERITONITIS AND INTRA-ABDOMINAL ABSCESS,GIS006,PARACENTESIS,248,MAJOR GASTROINTESTINAL & PERITONEAL INFECTIONS,06,DISEASES AND DISORDERS OF THE DIGESTIVE SYSTEM,3,Major,Major,Medical,Medicare,Medicaid,,,,Y,103596.42,32580.05
Long Island,Nassau,2908000,000511,NYU Langone Hospital-Long Island,0 to 17,115,F,White,Spanish/Hispanic,1,Emergency,Home or Self Care,2020,DIG001,INTESTINAL INFECTION,,,248,MAJOR GASTROINTESTINAL & PERITONEAL INFECTIONS,06,DISEASES AND DISORDERS OF THE DIGESTIVE SYSTEM,1,Minor,Minor,Medical,Private Health Insurance,,,,,Y,27267.19,4763.09
Long Island,Nassau,2908000,000511,NYU Langone Hospital-Long Island,70 or Older,115,F,Black/African American,Not Span/Hispanic,15,Emergency,Hospice - Home,2020,DIG001,INTESTINAL INFECTION,,,248,MAJOR GASTROINTESTINAL & PERITONEAL INFECTIONS,06,DISEASES AND DISORDERS OF THE DIGESTIVE SYSTEM,3,Major,Major,Medical,Medicare,Blue Cross/Blue Shield,,,,Y,119423.13,48363.69
Long Island,Nassau,2908000,000511,NYU Langone Hospital-Long Island,0 to 17,115,M,Other Race,Spanish/Hispanic,9,Emergency,Home or Self Care,2020,DIG001,INTESTINAL INFECTION,,,248,MAJOR GASTROINTESTINAL & PERITONEAL INFECTIONS,06,DISEASES AND DISORDERS OF THE DIGESTIVE SYSTEM,3,Major,Minor,Medical,Medicaid,,,,,Y,131885.13,24957.89
Long Island,Nassau,2908000,000511,NYU Langone Hospital-Long Island,70 or Older,110,F,White,Not Span/Hispanic,3,Emergency,Home or Self Care,2020,DIG001,INTESTINAL INFECTION,OTR004,ISOLATION PROCEDURES,248,MAJOR GASTROINTESTINAL & PERITONEAL INFECTIONS,06,DISEASES AND DISORDERS OF THE DIGESTIVE SYSTEM,2,Moderate,Moderate,Medical,Medicare,Private Health Insurance,,,,Y,41974.84,12253.44
Long Island,Nassau,2908000,000511,NYU Langone Hospital-Long Island,50 to 69,115,F,White,Spanish/Hispanic,2,Emergency,Home or Self Care,2020,DIG001,INTESTINAL INFECTION,,,248,MAJOR GASTROINTESTINAL & PERITONEAL INFECTIONS,06,DISEASES AND DISORDERS OF THE DIGESTIVE SYSTEM,1,Minor,Minor,Medical,Medicaid,,,,,Y,31353.8,8464.95
Long Island,Nassau,2908000,000511,NYU Langone Hospital-Long Island,50 to 69,115,F,Black/African American,Not Span/Hispanic,4,Emergency,Home or Self Care,2020,DIG009,APPENDICITIS AND OTHER APPENDICEAL CONDITIONS,,,248,MAJOR GASTROINTESTINAL & PERITONEAL INFECTIONS,06,DISEASES AND DISORDERS OF THE DIGESTIVE SYSTEM,2,Moderate,Minor,Medical,Blue Cross/Blue Shield,Medicare,,,,Y,51210.15,14678.44
Long Island,Nassau,2908000,000511,NYU Langone Hospital-Long Island,70 or Older,115,F,White,Unknown,2,Emergency,Home or Self Care,2020,DIG009,APPENDICITIS AND OTHER APPENDICEAL CONDITIONS,GIS005,EXPLORATION OF PERITONEAL CAVITY,248,MAJOR GASTROINTESTINAL & PERITONEAL INFECTIONS,06,DISEASES AND DISORDERS OF THE DIGESTIVE SYSTEM,2,Moderate,Minor,Medical,Medicare,Medicare,,,,Y,44171.17,9908.73
Long Island,Nassau,2908000,000511,NYU Langone Hospital-Long Island,0 to 17,115,F,Other Race,Spanish/Hispanic,2,Emergency,Home or Self Care,2020,DIG001,INTESTINAL INFECTION,,,248,MAJOR GASTROINTESTINAL & PERITONEAL INFECTIONS,06,DISEASES AND DISORDERS OF THE DIGESTIVE SYSTEM,2,Moderate,Minor,Medical,Medicaid,,,,,Y,35840.36,7121.74
Long Island,Nassau,2908000,000511,NYU Langone Hospital-Long Island,50 to 69,110,F,Other Race,Not Span/Hispanic,7,Emergency,Home or Self Care,2020,DIG009,APPENDICITIS AND OTHER APPENDICEAL CONDITIONS,,,248,MAJOR GASTROINTESTINAL & PERITONEAL INFECTIONS,06,DISEASES AND DISORDERS OF THE DIGESTIVE SYSTEM,3,Major,Moderate,Medical,Private Health Insurance,,,,,Y,84546.34,25255.83
Long Island,Nassau,2908000,000511,NYU Langone Hospital-Long Island,50 to 69,114,F,White,Not Span/Hispanic,4,Emergency,Hospice - Home,2020,DIG001,INTESTINAL INFECTION,,,248,MAJOR GASTROINTESTINAL & PERITONEAL INFECTIONS,06,DISEASES AND DISORDERS OF THE DIGESTIVE SYSTEM,3,Major,Major,Medical,Medicare,Medicare,,,,Y,66763.51,15499.77
Long Island,Nassau,2908000,000511,NYU Langone Hospital-Long Island,30 to 49,115,M,White,Not Span/Hispanic,4,Emergency,Home or Self Care,2020,DIG001,INTESTINAL INFECTION,,,248,MAJOR GASTROINTESTINAL & PERITONEAL INFECTIONS,06,DISEASES AND DISORDERS OF THE DIGESTIVE SYSTEM,3,Major,Moderate,Medical,Medicaid,,,,,Y,44142.33,14539.23
Long Island,Nassau,2908000,000511,NYU Langone Hospital-Long Island,30 to 49,115,F,White,Not Span/Hispanic,16,Emergency,Home or Self Care,2020,DIG001,INTESTINAL INFECTION,OTR004,ISOLATION PROCEDURES,248,MAJOR GASTROINTESTINAL & PERITONEAL INFECTIONS,06,DISEASES AND DISORDERS OF THE DIGESTIVE SYSTEM,3,Major,Major,Medical,Medicare,Blue Cross/Blue Shield,,,,Y,151937,53523.79
Long Island,Nassau,2908000,000511,NYU Langone Hospital-Long Island,70 or Older,112,M,White,Not Span/Hispanic,9,Emergency,Home w/ Home Health Services,2020,DIG001,INTESTINAL INFECTION,,,248,MAJOR GASTROINTESTINAL & PERITONEAL INFECTIONS,06,DISEASES AND DISORDERS OF THE DIGESTIVE SYSTEM,2,Moderate,Minor,Medical,Medicare,Blue Cross/Blue Shield,Medicare,,,Y,99033.13,30769.05
Long Island,Nassau,2908000,000511,NYU Langone Hospital-Long Island,50 to 69,115,F,White,Not Span/Hispanic,2,Emergency,Home or Self Care,2020,DIG009,APPENDICITIS AND OTHER APPENDICEAL CONDITIONS,,,248,MAJOR GASTROINTESTINAL & PERITONEAL INFECTIONS,06,DISEASES AND DISORDERS OF THE DIGESTIVE SYSTEM,2,Moderate,Minor,Medical,Blue Cross/Blue Shield,,,,,Y,30312.14,8288.22
Long Island,Nassau,2908000,000511,NYU Langone Hospital-Long Island,30 to 49,116,F,Black/African American,Not Span/Hispanic,10,Emergency,Home or Self Care,2020,DIG001,INTESTINAL INFECTION,OTR004,ISOLATION PROCEDURES,248,MAJOR GASTROINTESTINAL & PERITONEAL INFECTIONS,06,DISEASES AND DISORDERS OF THE DIGESTIVE SYSTEM,2,Moderate,Minor,Medical,Blue Cross/Blue Shield,,,,,Y,85950.94,32674.64
Long Island,Nassau,2908000,000511,NYU Langone Hospital-Long Island,0 to 17,115,M,White,Spanish/Hispanic,3,Emergency,Home or Self Care,2020,DIG001,INTESTINAL INFECTION,,,248,MAJOR GASTROINTESTINAL & PERITONEAL INFECTIONS,06,DISEASES AND DISORDERS OF THE DIGESTIVE SYSTEM,1,Minor,Minor,Medical,Medicaid,,,,,Y,35643.51,8391.11
Long Island,Nassau,2908000,000511,NYU Langone Hospital-Long Island,50 to 69,115,M,Black/African American,Not Span/Hispanic,5,Emergency,Home or Self Care,2020,DIG001,INTESTINAL INFECTION,,,248,MAJOR GASTROINTESTINAL & PERITONEAL INFECTIONS,06,DISEASES AND DISORDERS OF THE DIGESTIVE SYSTEM,3,Major,Major,Medical,Medicare,Medicaid,,,,Y,56646.38,17137.87
Long Island,Nassau,2908000,000511,NYU Langone Hospital-Long Island,30 to 49,114,F,Other Race,Not Span/Hispanic,10,Emergency,Home or Self Care,2020,INF009,"PARASITIC, OTHER SPECIFIED AND UNSPECIFIED INFECTIONS",CNS002,LUMBAR PUNCTURE,248,MAJOR GASTROINTESTINAL & PERITONEAL INFECTIONS,06,DISEASES AND DISORDERS OF THE DIGESTIVE SYSTEM,2,Moderate,Minor,Medical,Medicaid,,,,,Y,221987.06,44513.01
Long Island,Nassau,2908000,000511,NYU Langone Hospital-Long Island,70 or Older,117,F,White,Not Span/Hispanic,5,Emergency,Home w/ Home Health Services,2020,DIG009,APPENDICITIS AND OTHER APPENDICEAL CONDITIONS,GIS006,PARACENTESIS,248,MAJOR GASTROINTESTINAL & PERITONEAL INFECTIONS,06,DISEASES AND DISORDERS OF THE DIGESTIVE SYSTEM,2,Moderate,Minor,Medical,Medicare,,,,,Y,70843.77,19492.01
Long Island,Nassau,2908000,000511,NYU Langone Hospital-Long Island,50 to 69,115,M,White,Not Span/Hispanic,15,Elective,Skilled Nursing Home,2020,END011,FLUID AND ELECTROLYTE DISORDERS,RES005,CHEST TUBE PLACEMENT AND THERAPEUTIC THORACENTESIS,248,MAJOR GASTROINTESTINAL & PERITONEAL INFECTIONS,06,DISEASES AND DISORDERS OF THE DIGESTIVE SYSTEM,3,Major,Major,Medical,Medicaid,,,,,N,240101.34,66341.71
Long Island,Nassau,2908000,000511,NYU Langone Hospital-Long Island,70 or Older,115,F,Black/African American,Not Span/Hispanic,3,Emergency,Home or Self Care,2020,DIG001,INTESTINAL INFECTION,OTR004,ISOLATION PROCEDURES,248,MAJOR GASTROINTESTINAL & PERITONEAL INFECTIONS,06,DISEASES AND DISORDERS OF THE DIGESTIVE SYSTEM,2,Moderate,Moderate,Medical,Medicare,,,,,Y,52931.23,12262.63
Long Island,Nassau,2908000,000511,NYU Langone Hospital-Long Island,18 to 29,115,M,White,Not Span/Hispanic,1,Emergency,Home or Self Care,2020,DIG001,INTESTINAL INFECTION,,,248,MAJOR GASTROINTESTINAL & PERITONEAL INFECTIONS,06,DISEASES AND DISORDERS OF THE DIGESTIVE SYSTEM,2,Moderate,Minor,Medical,Medicaid,,,,,Y,20996.15,3831.18
Long Island,Nassau,2908000,000511,NYU Langone Hospital-Long Island,50 to 69,117,M,Other Race,Not Span/Hispanic,1,Emergency,Home or Self Care,2020,DIG009,APPENDICITIS AND OTHER APPENDICEAL CONDITIONS,,,248,MAJOR GASTROINTESTINAL & PERITONEAL INFECTIONS,06,DISEASES AND DISORDERS OF THE DIGESTIVE SYSTEM,2,Moderate,Minor,Medical,Blue Cross/Blue Shield,,,,,Y,27744,5626.28
Long Island,Nassau,2908000,000511,NYU Langone Hospital-Long Island,70 or Older,115,F,White,Not Span/Hispanic,7,Emergency,Home or Self Care,2020,DIG001,INTESTINAL INFECTION,,,248,MAJOR GASTROINTESTINAL & PERITONEAL INFECTIONS,06,DISEASES AND DISORDERS OF THE DIGESTIVE SYSTEM,3,Major,Moderate,Medical,Medicare,Medicare,,,,Y,83204.22,25182.29
Long Island,Nassau,2908000,000511,NYU Langone Hospital-Long Island,50 to 69,110,F,White,Not Span/Hispanic,4,Emergency,Home or Self Care,2020,END011,FLUID AND ELECTROLYTE DISORDERS,MAM011,ELECTROENCEPHALOGRAM (EEG),248,MAJOR GASTROINTESTINAL & PERITONEAL INFECTIONS,06,DISEASES AND DISORDERS OF THE DIGESTIVE SYSTEM,2,Moderate,Moderate,Medical,Medicare,Medicaid,,,,Y,60396.69,15756.82
Long Island,Nassau,2908000,000511,NYU Langone Hospital-Long Island,50 to 69,117,F,White,Not Span/Hispanic,3,Emergency,Home w/ Home Health Services,2020,DIG001,INTESTINAL INFECTION,,,248,MAJOR GASTROINTESTINAL & PERITONEAL INFECTIONS,06,DISEASES AND DISORDERS OF THE DIGESTIVE SYSTEM,3,Major,Major,Medical,Medicare,Medicare,,,,N,51667.25,12645.24
Long Island,Nassau,2908000,000511,NYU Langone Hospital-Long Island,18 to 29,115,M,Other Race,Spanish/Hispanic,12,Emergency,Home or Self Care,2020,INF009,"PARASITIC, OTHER SPECIFIED AND UNSPECIFIED INFECTIONS",MAM011,ELECTROENCEPHALOGRAM (EEG),248,MAJOR GASTROINTESTINAL & PERITONEAL INFECTIONS,06,DISEASES AND DISORDERS OF THE DIGESTIVE SYSTEM,3,Major,Major,Medical,Medicaid,,,,,Y,171905.48,42665.91
Long Island,Nassau,2908000,000511,NYU Langone Hospital-Long Island,70 or Older,117,M,White,Not Span/Hispanic,4,Emergency,Home w/ Home Health Services,2020,DIG009,APPENDICITIS AND OTHER APPENDICEAL CONDITIONS,GNR008,"ABDOMINAL WALL PROCEDURES, NEC",248,MAJOR GASTROINTESTINAL & PERITONEAL INFECTIONS,06,DISEASES AND DISORDERS OF THE DIGESTIVE SYSTEM,2,Moderate,Minor,Medical,Medicare,Private Health Insurance,,,,Y,81734.41,17740.68
Long Island,Nassau,2908000,000511,NYU Langone Hospital-Long Island,70 or Older,117,F,White,Not Span/Hispanic,6,Emergency,Home w/ Home Health Services,2020,DIG001,INTESTINAL INFECTION,OTR004,ISOLATION PROCEDURES,248,MAJOR GASTROINTESTINAL & PERITONEAL INFECTIONS,06,DISEASES AND DISORDERS OF THE DIGESTIVE SYSTEM,2,Moderate,Major,Medical,Medicare,,,,,Y,89304.96,21920.56
Long Island,Nassau,2908000,000511,NYU Langone Hospital-Long Island,50 to 69,115,M,Other Race,Not Span/Hispanic,3,Emergency,Home or Self Care,2020,DIG009,APPENDICITIS AND OTHER APPENDICEAL CONDITIONS,GIS006,PARACENTESIS,248,MAJOR GASTROINTESTINAL & PERITONEAL INFECTIONS,06,DISEASES AND DISORDERS OF THE DIGESTIVE SYSTEM,2,Moderate,Moderate,Medical,Medicaid,,,,,Y,62187.99,14184.96
Long Island,Nassau,2908000,000511,NYU Langone Hospital-Long Island,50 to 69,115,F,Black/African American,Not Span/Hispanic,4,Emergency,Home w/ Home Health Services,2020,DIG016,PERITONITIS AND INTRA-ABDOMINAL ABSCESS,GIS006,PARACENTESIS,248,MAJOR GASTROINTESTINAL & PERITONEAL INFECTIONS,06,DISEASES AND DISORDERS OF THE DIGESTIVE SYSTEM,3,Major,Major,Medical,Medicare,Blue Cross/Blue Shield,,,,Y,93201.67,24509.03
Long Island,Nassau,2908000,000511,NYU Langone Hospital-Long Island,50 to 69,115,M,White,Not Span/Hispanic,4,Emergency,Home w/ Home Health Services,2020,DIG009,APPENDICITIS AND OTHER APPENDICEAL CONDITIONS,GIS006,PARACENTESIS,248,MAJOR GASTROINTESTINAL & PERITONEAL INFECTIONS,06,DISEASES AND DISORDERS OF THE DIGESTIVE SYSTEM,2,Moderate,Minor,Medical,Private Health Insurance,,,,,Y,63983.36,15742.67
Long Island,Nassau,2908000,000511,NYU Langone Hospital-Long Island,70 or Older,117,F,White,Not Span/Hispanic,2,Emergency,Home w/ Home Health Services,2020,DIG009,APPENDICITIS AND OTHER APPENDICEAL CONDITIONS,CAR024,VENOUS AND ARTERIAL CATHETER PLACEMENT,248,MAJOR GASTROINTESTINAL & PERITONEAL INFECTIONS,06,DISEASES AND DISORDERS OF THE DIGESTIVE SYSTEM,2,Moderate,Minor,Medical,Medicare,Medicare,,,,Y,39417.04,9176.56
Long Island,Nassau,2908000,000511,NYU Langone Hospital-Long Island,70 or Older,115,F,White,Not Span/Hispanic,5,Emergency,Skilled Nursing Home,2020,DIG009,APPENDICITIS AND OTHER APPENDICEAL CONDITIONS,GNR008,"ABDOMINAL WALL PROCEDURES, NEC",248,MAJOR GASTROINTESTINAL & PERITONEAL INFECTIONS,06,DISEASES AND DISORDERS OF THE DIGESTIVE SYSTEM,2,Moderate,Moderate,Medical,Medicare,Blue Cross/Blue Shield,,,,Y,98907.68,21379.83
Long Island,Nassau,2908000,000511,NYU Langone Hospital-Long Island,50 to 69,110,M,White,Not Span/Hispanic,6,Emergency,Home w/ Home Health Services,2020,DIG001,INTESTINAL INFECTION,OTR004,ISOLATION PROCEDURES,248,MAJOR GASTROINTESTINAL & PERITONEAL INFECTIONS,06,DISEASES AND DISORDERS OF THE DIGESTIVE SYSTEM,3,Major,Extreme,Medical,Medicare,,,,,Y,90984.91,22965.88
Long Island,Nassau,2908000,000511,NYU Langone Hospital-Long Island,70 or Older,112,F,Other Race,Not Span/Hispanic,6,Emergency,Home w/ Home Health Services,2020,DIG001,INTESTINAL INFECTION,OTR004,ISOLATION PROCEDURES,248,MAJOR GASTROINTESTINAL & PERITONEAL INFECTIONS,06,DISEASES AND DISORDERS OF THE DIGESTIVE SYSTEM,3,Major,Major,Medical,Medicare,Medicaid,,,,Y,93654.83,22590.94
Long Island,Nassau,2908000,000511,NYU Langone Hospital-Long Island,0 to 17,,F,Other Race,Unknown,3,Emergency,Home or Self Care,2020,DIG001,INTESTINAL INFECTION,OTR004,ISOLATION PROCEDURES,248,MAJOR GASTROINTESTINAL & PERITONEAL INFECTIONS,06,DISEASES AND DISORDERS OF THE DIGESTIVE SYSTEM,1,Minor,Minor,Medical,Blue Cross/Blue Shield,,,,,Y,41068.39,8833.44
Long Island,Nassau,2908000,000511,NYU Langone Hospital-Long Island,70 or Older,115,F,White,Not Span/Hispanic,6,Emergency,Home w/ Home Health Services,2020,DIG009,APPENDICITIS AND OTHER APPENDICEAL CONDITIONS,GNR008,"ABDOMINAL WALL PROCEDURES, NEC",248,MAJOR GASTROINTESTINAL & PERITONEAL INFECTIONS,06,DISEASES AND DISORDERS OF THE DIGESTIVE SYSTEM,2,Moderate,Major,Medical,Medicare,Blue Cross/Blue Shield,,,,Y,107057.5,26054.87
Long Island,Nassau,2908000,000511,NYU Langone Hospital-Long Island,70 or Older,115,F,White,Not Span/Hispanic,4,Emergency,Home w/ Home Health Services,2020,DIG009,APPENDICITIS AND OTHER APPENDICEAL CONDITIONS,CAR024,VENOUS AND ARTERIAL CATHETER PLACEMENT,248,MAJOR GASTROINTESTINAL & PERITONEAL INFECTIONS,06,DISEASES AND DISORDERS OF THE DIGESTIVE SYSTEM,2,Moderate,Moderate,Medical,Medicare,,,,,Y,70306.71,17492.84
Long Island,Nassau,2908000,000511,NYU Langone Hospital-Long Island,0 to 17,115,M,Other Race,Spanish/Hispanic,1,Emergency,Home or Self Care,2020,DIG001,INTESTINAL INFECTION,OTR004,ISOLATION PROCEDURES,248,MAJOR GASTROINTESTINAL & PERITONEAL INFECTIONS,06,DISEASES AND DISORDERS OF THE DIGESTIVE SYSTEM,1,Minor,Moderate,Medical,Medicaid,,,,,Y,21365.63,3899.87
Long Island,Nassau,2908000,000511,NYU Langone Hospital-Long Island,50 to 69,117,F,White,Not Span/Hispanic,4,Emergency,Home or Self Care,2020,DIG001,INTESTINAL INFECTION,,,248,MAJOR GASTROINTESTINAL & PERITONEAL INFECTIONS,06,DISEASES AND DISORDERS OF THE DIGESTIVE SYSTEM,3,Major,Major,Medical,Medicare,Blue Cross/Blue Shield,,,,Y,62937.63,15508.3
Long Island,Nassau,2908000,000511,NYU Langone Hospital-Long Island,50 to 69,115,F,White,Not Span/Hispanic,7,Emergency,Home w/ Home Health Services,2020,DIG001,INTESTINAL INFECTION,OTR004,ISOLATION PROCEDURES,248,MAJOR GASTROINTESTINAL & PERITONEAL INFECTIONS,06,DISEASES AND DISORDERS OF THE DIGESTIVE SYSTEM,2,Moderate,Moderate,Medical,Medicare,Blue Cross/Blue Shield,,,,Y,90801.67,27338.9
Long Island,Nassau,2908000,000511,NYU Langone Hospital-Long Island,70 or Older,115,F,White,Not Span/Hispanic,3,Emergency,Home or Self Care,2020,DIG009,APPENDICITIS AND OTHER APPENDICEAL CONDITIONS,,,248,MAJOR GASTROINTESTINAL & PERITONEAL INFECTIONS,06,DISEASES AND DISORDERS OF THE DIGESTIVE SYSTEM,2,Moderate,Minor,Medical,Medicare,Blue Cross/Blue Shield,,,,Y,38735.73,14645.42
Long Island,Nassau,2908000,000511,NYU Langone Hospital-Long Island,50 to 69,115,M,White,Not Span/Hispanic,3,Emergency,Home or Self Care,2020,DIG009,APPENDICITIS AND OTHER APPENDICEAL CONDITIONS,,,248,MAJOR GASTROINTESTINAL & PERITONEAL INFECTIONS,06,DISEASES AND DISORDERS OF THE DIGESTIVE SYSTEM,2,Moderate,Minor,Medical,Medicare,Medicare,,,,Y,54961.87,16116.3
Long Island,Nassau,2908000,000511,NYU Langone Hospital-Long Island,70 or Older,115,F,White,Not Span/Hispanic,4,Emergency,Skilled Nursing Home,2020,DIG001,INTESTINAL INFECTION,SKB006,SKIN LACERATION REPAIR (EXCLUDING PERINEUM),248,MAJOR GASTROINTESTINAL & PERITONEAL INFECTIONS,06,DISEASES AND DISORDERS OF THE DIGESTIVE SYSTEM,2,Moderate,Minor,Medical,Medicare,,,,,Y,72719.19,21856.27
Long Island,Nassau,2908000,000511,NYU Langone Hospital-Long Island,70 or Older,117,M,White,Not Span/Hispanic,3,Emergency,Home or Self Care,2020,DIG001,INTESTINAL INFECTION,OTR004,ISOLATION PROCEDURES,248,MAJOR GASTROINTESTINAL & PERITONEAL INFECTIONS,06,DISEASES AND DISORDERS OF THE DIGESTIVE SYSTEM,3,Major,Major,Medical,Medicare,Blue Cross/Blue Shield,,,,Y,44003.98,15539.54
Long Island,Nassau,2908000,000511,NYU Langone Hospital-Long Island,70 or Older,115,M,White,Not Span/Hispanic,10,Trauma,Skilled Nursing Home,2020,DIG001,INTESTINAL INFECTION,OTR004,ISOLATION PROCEDURES,248,MAJOR GASTROINTESTINAL & PERITONEAL INFECTIONS,06,DISEASES AND DISORDERS OF THE DIGESTIVE SYSTEM,4,Extreme,Extreme,Medical,Medicare,Medicare,,,,Y,152337.95,52322.6
Long Island,Nassau,2908000,000511,NYU Langone Hospital-Long Island,50 to 69,118,M,White,Not Span/Hispanic,3,Emergency,Home or Self Care,2020,DIG009,APPENDICITIS AND OTHER APPENDICEAL CONDITIONS,,,248,MAJOR GASTROINTESTINAL & PERITONEAL INFECTIONS,06,DISEASES AND DISORDERS OF THE DIGESTIVE SYSTEM,2,Moderate,Minor,Medical,Medicare,Blue Cross/Blue Shield,,,,Y,52287.91,15896.58
Long Island,Nassau,2908000,000511,NYU Langone Hospital-Long Island,50 to 69,115,M,White,Not Span/Hispanic,2,Emergency,Home or Self Care,2020,DIG009,APPENDICITIS AND OTHER APPENDICEAL CONDITIONS,GNR008,"ABDOMINAL WALL PROCEDURES, NEC",248,MAJOR GASTROINTESTINAL & PERITONEAL INFECTIONS,06,DISEASES AND DISORDERS OF THE DIGESTIVE SYSTEM,2,Moderate,Minor,Medical,Medicaid,,,,,Y,57822.75,12757.62
Long Island,Nassau,2908000,000511,NYU Langone Hospital-Long Island,50 to 69,115,F,Other Race,Unknown,2,Emergency,Home or Self Care,2020,DIG009,APPENDICITIS AND OTHER APPENDICEAL CONDITIONS,,,248,MAJOR GASTROINTESTINAL & PERITONEAL INFECTIONS,06,DISEASES AND DISORDERS OF THE DIGESTIVE SYSTEM,2,Moderate,Minor,Medical,Blue Cross/Blue Shield,,,,,Y,30878.88,10442.67
Long Island,Nassau,2908000,000511,NYU Langone Hospital-Long Island,70 or Older,119,F,White,Not Span/Hispanic,3,Emergency,Home w/ Home Health Services,2020,DIG001,INTESTINAL INFECTION,OTR004,ISOLATION PROCEDURES,248,MAJOR GASTROINTESTINAL & PERITONEAL INFECTIONS,06,DISEASES AND DISORDERS OF THE DIGESTIVE SYSTEM,2,Moderate,Moderate,Medical,Medicare,,,,,Y,68650.88,17707.53
Long Island,Nassau,2908000,000511,NYU Langone Hospital-Long Island,70 or Older,110,M,White,Not Span/Hispanic,5,Emergency,Home w/ Home Health Services,2020,DIG001,INTESTINAL INFECTION,,,248,MAJOR GASTROINTESTINAL & PERITONEAL INFECTIONS,06,DISEASES AND DISORDERS OF THE DIGESTIVE SYSTEM,3,Major,Moderate,Medical,Medicare,Blue Cross/Blue Shield,,,,Y,66527.66,24872.24
Long Island,Nassau,2908000,000511,NYU Langone Hospital-Long Island,50 to 69,117,M,White,Not Span/Hispanic,15,Emergency,Skilled Nursing Home,2020,DIG001,INTESTINAL INFECTION,OTR004,ISOLATION PROCEDURES,248,MAJOR GASTROINTESTINAL & PERITONEAL INFECTIONS,06,DISEASES AND DISORDERS OF THE DIGESTIVE SYSTEM,4,Extreme,Extreme,Medical,Medicare,Private Health Insurance,,,,Y,291461.7,91137.24
Long Island,Nassau,2908000,000511,NYU Langone Hospital-Long Island,70 or Older,115,M,White,Not Span/Hispanic,3,Emergency,Home w/ Home Health Services,2020,DIG001,INTESTINAL INFECTION,OTR004,ISOLATION PROCEDURES,248,MAJOR GASTROINTESTINAL & PERITONEAL INFECTIONS,06,DISEASES AND DISORDERS OF THE DIGESTIVE SYSTEM,3,Major,Major,Medical,Medicare,,,,,Y,59274.7,16940.87
Long Island,Nassau,2908000,000511,NYU Langone Hospital-Long Island,50 to 69,116,M,White,Unknown,1,Emergency,Home or Self Care,2020,DIG009,APPENDICITIS AND OTHER APPENDICEAL CONDITIONS,,,248,MAJOR GASTROINTESTINAL & PERITONEAL INFECTIONS,06,DISEASES AND DISORDERS OF THE DIGESTIVE SYSTEM,2,Moderate,Minor,Medical,Private Health Insurance,,,,,Y,23027.84,6093.76
Long Island,Nassau,2908000,000511,NYU Langone Hospital-Long Island,70 or Older,115,M,White,Not Span/Hispanic,15,Emergency,Hospice - Medical Facility,2020,DIG016,PERITONITIS AND INTRA-ABDOMINAL ABSCESS,GIS006,PARACENTESIS,248,MAJOR GASTROINTESTINAL & PERITONEAL INFECTIONS,06,DISEASES AND DISORDERS OF THE DIGESTIVE SYSTEM,4,Extreme,Extreme,Medical,Blue Cross/Blue Shield,Medicare,,,,Y,301325.89,83535.63
Long Island,Nassau,2908000,000511,NYU Langone Hospital-Long Island,0 to 17,115,F,White,Not Span/Hispanic,1,Emergency,Home or Self Care,2020,END011,FLUID AND ELECTROLYTE DISORDERS,,,248,MAJOR GASTROINTESTINAL & PERITONEAL INFECTIONS,06,DISEASES AND DISORDERS OF THE DIGESTIVE SYSTEM,1,Minor,Minor,Medical,Blue Cross/Blue Shield,,,,,Y,18136.35,4081.39