Hospital Service Area,Hospital County,Operating Certificate Number,Permanent Facility Id,Facility Name,Age Group,Zip Code - 3 digits,Gender,Race,Ethnicity,Length of Stay,Type of Admission,Patient Disposition,Discharge Year,CCS Diagnosis Code,CCS Diagnosis Description,CCS Procedure Code,CCS Procedure Description,APR DRG Code,APR DRG Description,APR MDC Code,APR MDC Description,APR Severity of Illness Code,APR Severity of Illness Description,APR Risk of Mortality,APR Medical Surgical Description,Payment Typology 1,Payment Typology 2,Payment Typology 3,Birth Weight,Abortion Edit Indicator,Emergency Department Indicator,Total Charges,Total Costs
Hudson Valley,Sullivan,5263000,000971,Catskill Regional Medical Center,30 to 49,127,F,White,Not Span/Hispanic,1,Emergency,Left Against Medical Advice,2017,154,Noninfectious gastroenteritis,000,NO PROC,249,"Other gastroenteritis, nausa & vomiting",06,Diseases and Disorders of the Digestive System,1,Minor,Minor,Medical,Private Health Insurance,,,,N,Y,7843.56,1927.71
New York City,Manhattan,7002024,001456,Mount Sinai Hospital,0 to 17,100,M,Other Race,Not Span/Hispanic,2,Urgent,Home or Self Care,2017,135,Intestinal infection,000,NO PROC,249,"Other gastroenteritis, nausa & vomiting",06,Diseases and Disorders of the Digestive System,1,Minor,Minor,Medical,Medicaid,Medicaid,Self-Pay,,N,N,13945.94,10880.58
New York City,Manhattan,7002024,001456,Mount Sinai Hospital,50 to 69,100,F,Black/African American,Not Span/Hispanic,4,Emergency,Home or Self Care,2017,135,Intestinal infection,000,NO PROC,249,"Other gastroenteritis, nausa & vomiting",06,Diseases and Disorders of the Digestive System,2,Moderate,Minor,Medical,Blue Cross/Blue Shield,Self-Pay,,,N,Y,30821.24,10409.49
New York City,Manhattan,7002024,001456,Mount Sinai Hospital,50 to 69,114,M,Other Race,Not Span/Hispanic,2,Emergency,Home or Self Care,2017,250,Nausea and vomiting,000,NO PROC,249,"Other gastroenteritis, nausa & vomiting",06,Diseases and Disorders of the Digestive System,2,Moderate,Moderate,Medical,Medicare,Medicaid,Self-Pay,,N,Y,20483.15,6732.79
New York City,Manhattan,7002032,001466,Mount Sinai West,50 to 69,100,M,White,Not Span/Hispanic,2,Emergency,Home w/ Home Health Services,2017,135,Intestinal infection,179,CT SCAN ABDOMEN,249,"Other gastroenteritis, nausa & vomiting",06,Diseases and Disorders of the Digestive System,2,Moderate,Moderate,Medical,Medicare,Medicaid,Self-Pay,,N,Y,36978.05,7531.35
Hudson Valley,Westchester,5903001,001061,Montefiore Mount Vernon Hospital,50 to 69,105,F,Other Race,Multi-ethnic,2,Emergency,Home or Self Care,2017,154,Noninfectious gastroenteritis,000,NO PROC,249,"Other gastroenteritis, nausa & vomiting",06,Diseases and Disorders of the Digestive System,1,Minor,Minor,Medical,Medicaid,Medicaid,Self-Pay,,N,N,18928.17,6735.88
Hudson Valley,Westchester,5904001,001072,Montefiore New Rochelle Hospital,50 to 69,105,F,Black/African American,Unknown,5,Emergency,Home or Self Care,2017,135,Intestinal infection,070,UP GASTRO ENDOSC/BIOPSY,249,"Other gastroenteritis, nausa & vomiting",06,Diseases and Disorders of the Digestive System,1,Minor,Minor,Medical,Private Health Insurance,Self-Pay,,,N,N,40101.00,18306.04
Hudson Valley,Westchester,5904001,001072,Montefiore New Rochelle Hospital,50 to 69,105,F,White,Not Span/Hispanic,1,Emergency,Home or Self Care,2017,154,Noninfectious gastroenteritis,000,NO PROC,249,"Other gastroenteritis, nausa & vomiting",06,Diseases and Disorders of the Digestive System,2,Moderate,Moderate,Medical,Blue Cross/Blue Shield,Self-Pay,,,N,N,7295.00,3575.85
New York City,Bronx,7000006,001168,Montefiore Medical Center-Wakefield Hospital,70 or Older,104,F,Other Race,Not Span/Hispanic,10,Emergency,Home w/ Home Health Services,2017,154,Noninfectious gastroenteritis,231,OTHER THERAPEUTIC PRCS,249,"Other gastroenteritis, nausa & vomiting",06,Diseases and Disorders of the Digestive System,3,Major,Major,Medical,Medicare,Medicaid,,,N,Y,110362.80,21277.90
New York City,Bronx,7000006,001168,Montefiore Medical Center-Wakefield Hospital,70 or Older,104,M,Other Race,Not Span/Hispanic,5,Emergency,Home w/ Home Health Services,2017,155,Other gastrointestinal disorders,019,OT THER PRCS EYELIDS,249,"Other gastroenteritis, nausa & vomiting",06,Diseases and Disorders of the Digestive System,2,Moderate,Moderate,Medical,Medicare,,,,N,Y,62477.33,13305.76
New York City,Bronx,7000006,001168,Montefiore Medical Center-Wakefield Hospital,70 or Older,104,M,White,Not Span/Hispanic,3,Emergency,Home w/ Home Health Services,2017,135,Intestinal infection,193,DX ULTRASOUND HEART,249,"Other gastroenteritis, nausa & vomiting",06,Diseases and Disorders of the Digestive System,3,Major,Major,Medical,Medicare,,,,N,Y,49260.00,12179.69
New York City,Bronx,7000006,001168,Montefiore Medical Center-Wakefield Hospital,18 to 29,104,F,Black/African American,Not Span/Hispanic,3,Emergency,Home or Self Care,2017,154,Noninfectious gastroenteritis,000,NO PROC,249,"Other gastroenteritis, nausa & vomiting",06,Diseases and Disorders of the Digestive System,2,Moderate,Minor,Medical,Medicaid,,,,N,Y,44518.50,7699.71
New York City,Bronx,7000006,001168,Montefiore Medical Center-Wakefield Hospital,18 to 29,104,M,Black/African American,Not Span/Hispanic,1,Emergency,Home or Self Care,2017,135,Intestinal infection,000,NO PROC,249,"Other gastroenteritis, nausa & vomiting",06,Diseases and Disorders of the Digestive System,1,Minor,Minor,Medical,Medicaid,,,,N,Y,23161.45,3182.11
New York City,Bronx,7000006,001169,Montefiore Medical Center - Henry & Lucy Moses Div,50 to 69,104,F,Other Race,Not Span/Hispanic,8,Emergency,Home w/ Home Health Services,2017,154,Noninfectious gastroenteritis,193,DX ULTRASOUND HEART,249,"Other gastroenteritis, nausa & vomiting",06,Diseases and Disorders of the Digestive System,3,Major,Major,Medical,Medicare,Medicaid,,,N,Y,76023.11,16196.18
New York City,Bronx,7000006,001169,Montefiore Medical Center - Henry & Lucy Moses Div,50 to 69,104,F,Black/African American,Not Span/Hispanic,4,Emergency,Psychiatric Hospital or Unit of Hosp,2017,250,Nausea and vomiting,000,NO PROC,249,"Other gastroenteritis, nausa & vomiting",06,Diseases and Disorders of the Digestive System,2,Moderate,Moderate,Medical,Medicaid,,,,N,Y,41998.79,8762.56
New York City,Bronx,7000006,001169,Montefiore Medical Center - Henry & Lucy Moses Div,50 to 69,104,F,Other Race,Not Span/Hispanic,3,Emergency,Home or Self Care,2017,155,Other gastrointestinal disorders,000,NO PROC,249,"Other gastroenteritis, nausa & vomiting",06,Diseases and Disorders of the Digestive System,2,Moderate,Major,Medical,Blue Cross/Blue Shield,,,,N,N,25701.56,5482.95
New York City,Bronx,7000006,001169,Montefiore Medical Center - Henry & Lucy Moses Div,50 to 69,104,M,Other Race,Not Span/Hispanic,3,Emergency,Home or Self Care,2017,135,Intestinal infection,231,OTHER THERAPEUTIC PRCS,249,"Other gastroenteritis, nausa & vomiting",06,Diseases and Disorders of the Digestive System,1,Minor,Minor,Medical,Medicare,Medicaid,,,N,Y,46439.13,7238.57
New York City,Bronx,7000006,001169,Montefiore Medical Center - Henry & Lucy Moses Div,50 to 69,104,F,Other Race,Spanish/Hispanic,3,Emergency,Home or Self Care,2017,154,Noninfectious gastroenteritis,231,OTHER THERAPEUTIC PRCS,249,"Other gastroenteritis, nausa & vomiting",06,Diseases and Disorders of the Digestive System,1,Minor,Minor,Medical,Medicaid,,,,N,Y,38097.17,5972.85
New York City,Bronx,7000006,001169,Montefiore Medical Center - Henry & Lucy Moses Div,70 or Older,104,M,Black/African American,Not Span/Hispanic,1,Emergency,Skilled Nursing Home,2017,135,Intestinal infection,000,NO PROC,249,"Other gastroenteritis, nausa & vomiting",06,Diseases and Disorders of the Digestive System,3,Major,Major,Medical,Medicare,Medicaid,,,N,Y,16034.75,2932.97
New York City,Bronx,7000006,001169,Montefiore Medical Center - Henry & Lucy Moses Div,30 to 49,104,M,Other Race,Not Span/Hispanic,4,Emergency,Skilled Nursing Home,2017,135,Intestinal infection,058,HEMODIALYSIS,249,"Other gastroenteritis, nausa & vomiting",06,Diseases and Disorders of the Digestive System,3,Major,Moderate,Medical,Medicare,Medicaid,,,N,Y,48519.99,9667.45
New York City,Bronx,7000006,001169,Montefiore Medical Center - Henry & Lucy Moses Div,30 to 49,104,F,Black/African American,Not Span/Hispanic,2,Emergency,Home or Self Care,2017,154,Noninfectious gastroenteritis,222,BLOOD TRANSFUSION,249,"Other gastroenteritis, nausa & vomiting",06,Diseases and Disorders of the Digestive System,2,Moderate,Minor,Medical,Self-Pay,,,,N,Y,26122.58,5055.33
New York City,Bronx,7000006,001169,Montefiore Medical Center - Henry & Lucy Moses Div,18 to 29,104,F,Other Race,Not Span/Hispanic,3,Emergency,Home or Self Care,2017,135,Intestinal infection,000,NO PROC,249,"Other gastroenteritis, nausa & vomiting",06,Diseases and Disorders of the Digestive System,2,Moderate,Moderate,Medical,Medicaid,,,,N,Y,35974.19,5712.82
New York City,Bronx,7000006,001169,Montefiore Medical Center - Henry & Lucy Moses Div,30 to 49,100,F,Other Race,Not Span/Hispanic,1,Emergency,Left Against Medical Advice,2017,250,Nausea and vomiting,000,NO PROC,249,"Other gastroenteritis, nausa & vomiting",06,Diseases and Disorders of the Digestive System,2,Moderate,Minor,Medical,Medicaid,,,,N,Y,17952.61,3715.01
New York City,Bronx,7000006,001169,Montefiore Medical Center - Henry & Lucy Moses Div,50 to 69,100,F,Other Race,Spanish/Hispanic,2,Emergency,Home or Self Care,2017,155,Other gastrointestinal disorders,231,OTHER THERAPEUTIC PRCS,249,"Other gastroenteritis, nausa & vomiting",06,Diseases and Disorders of the Digestive System,2,Moderate,Moderate,Medical,Medicaid,,,,N,Y,31204.98,6656.10
New York City,Bronx,7000006,001169,Montefiore Medical Center - Henry & Lucy Moses Div,18 to 29,104,M,Other Race,Spanish/Hispanic,2,Emergency,Home or Self Care,2017,154,Noninfectious gastroenteritis,179,CT SCAN ABDOMEN,249,"Other gastroenteritis, nausa & vomiting",06,Diseases and Disorders of the Digestive System,1,Minor,Minor,Medical,Medicaid,,,,N,Y,32804.30,5213.87
New York City,Bronx,7000006,001169,Montefiore Medical Center - Henry & Lucy Moses Div,50 to 69,104,F,Other Race,Not Span/Hispanic,3,Emergency,Home or Self Care,2017,155,Other gastrointestinal disorders,000,NO PROC,249,"Other gastroenteritis, nausa & vomiting",06,Diseases and Disorders of the Digestive System,2,Moderate,Minor,Medical,Medicaid,,,,N,Y,42171.67,7107.34
New York City,Bronx,7000006,001169,Montefiore Medical Center - Henry & Lucy Moses Div,50 to 69,104,F,Other Race,Spanish/Hispanic,4,Emergency,Home or Self Care,2017,055,Fluid and electrolyte disorders,000,NO PROC,249,"Other gastroenteritis, nausa & vomiting",06,Diseases and Disorders of the Digestive System,3,Major,Major,Medical,Medicaid,,,,N,Y,42648.44,8283.29
New York City,Bronx,7000006,001169,Montefiore Medical Center - Henry & Lucy Moses Div,0 to 17,104,M,Other Race,Spanish/Hispanic,1,Emergency,Home or Self Care,2017,055,Fluid and electrolyte disorders,000,NO PROC,249,"Other gastroenteritis, nausa & vomiting",06,Diseases and Disorders of the Digestive System,2,Moderate,Moderate,Medical,Medicaid,,,,N,N,7215.00,2304.10
New York City,Bronx,7000006,001169,Montefiore Medical Center - Henry & Lucy Moses Div,0 to 17,104,F,Black/African American,Not Span/Hispanic,1,Emergency,Home or Self Care,2017,154,Noninfectious gastroenteritis,231,OTHER THERAPEUTIC PRCS,249,"Other gastroenteritis, nausa & vomiting",06,Diseases and Disorders of the Digestive System,1,Minor,Minor,Medical,Medicaid,,,,N,Y,9011.50,1438.98
New York City,Bronx,7000006,001169,Montefiore Medical Center - Henry & Lucy Moses Div,0 to 17,104,F,Other Race,Not Span/Hispanic,2,Emergency,Home or Self Care,2017,155,Other gastrointestinal disorders,231,OTHER THERAPEUTIC PRCS,249,"Other gastroenteritis, nausa & vomiting",06,Diseases and Disorders of the Digestive System,2,Moderate,Minor,Medical,Medicaid,,,,N,Y,23566.27,6129.02
New York City,Bronx,7000006,001169,Montefiore Medical Center - Henry & Lucy Moses Div,0 to 17,107,F,White,Spanish/Hispanic,1,Emergency,Home or Self Care,2017,135,Intestinal infection,000,NO PROC,249,"Other gastroenteritis, nausa & vomiting",06,Diseases and Disorders of the Digestive System,1,Minor,Minor,Medical,Medicaid,,,,N,N,18575.43,3067.92
New York City,Bronx,7000006,001169,Montefiore Medical Center - Henry & Lucy Moses Div,0 to 17,104,M,Other Race,Spanish/Hispanic,2,Emergency,Home or Self Care,2017,135,Intestinal infection,000,NO PROC,249,"Other gastroenteritis, nausa & vomiting",06,Diseases and Disorders of the Digestive System,1,Minor,Minor,Medical,Medicaid,,,,N,Y,20814.65,5977.23
New York City,Bronx,7000006,001169,Montefiore Medical Center - Henry & Lucy Moses Div,0 to 17,104,M,White,Spanish/Hispanic,1,Emergency,Home or Self Care,2017,135,Intestinal infection,231,OTHER THERAPEUTIC PRCS,249,"Other gastroenteritis, nausa & vomiting",06,Diseases and Disorders of the Digestive System,2,Moderate,Minor,Medical,Medicaid,,,,N,Y,15305.93,3578.68
New York City,Bronx,7000006,001169,Montefiore Medical Center - Henry & Lucy Moses Div,0 to 17,104,F,Other Race,Spanish/Hispanic,1,Emergency,Home or Self Care,2017,135,Intestinal infection,000,NO PROC,249,"Other gastroenteritis, nausa & vomiting",06,Diseases and Disorders of the Digestive System,1,Minor,Minor,Medical,Medicaid,,,,N,Y,12403.25,3278.09
New York City,Bronx,7000006,001169,Montefiore Medical Center - Henry & Lucy Moses Div,0 to 17,104,F,Other Race,Spanish/Hispanic,1,Emergency,Home or Self Care,2017,135,Intestinal infection,231,OTHER THERAPEUTIC PRCS,249,"Other gastroenteritis, nausa & vomiting",06,Diseases and Disorders of the Digestive System,2,Moderate,Minor,Medical,Medicaid,,,,N,Y,14960.03,3631.46
New York City,Bronx,7000006,003058,Montefiore Med Center - Jack D Weiler Hosp of A Einstein College Div,50 to 69,104,F,Black/African American,Not Span/Hispanic,4,Emergency,Home or Self Care,2017,135,Intestinal infection,000,NO PROC,249,"Other gastroenteritis, nausa & vomiting",06,Diseases and Disorders of the Digestive System,2,Moderate,Minor,Medical,Medicare,,,,N,Y,55585.49,8466.97
New York City,Bronx,7000006,003058,Montefiore Med Center - Jack D Weiler Hosp of A Einstein College Div,50 to 69,104,F,White,Spanish/Hispanic,10,Emergency,Home or Self Care,2017,135,Intestinal infection,231,OTHER THERAPEUTIC PRCS,249,"Other gastroenteritis, nausa & vomiting",06,Diseases and Disorders of the Digestive System,3,Major,Major,Medical,Medicare,,,,N,Y,102501.36,20283.15
New York City,Bronx,7000006,003058,Montefiore Med Center - Jack D Weiler Hosp of A Einstein College Div,30 to 49,104,M,Black/African American,Not Span/Hispanic,2,Emergency,Home or Self Care,2017,135,Intestinal infection,000,NO PROC,249,"Other gastroenteritis, nausa & vomiting",06,Diseases and Disorders of the Digestive System,2,Moderate,Moderate,Medical,Medicaid,,,,N,Y,29428.15,5010.87
New York City,Bronx,7000006,003058,Montefiore Med Center - Jack D Weiler Hosp of A Einstein College Div,30 to 49,104,F,Other Race,Not Span/Hispanic,1,Emergency,Left Against Medical Advice,2017,250,Nausea and vomiting,000,NO PROC,249,"Other gastroenteritis, nausa & vomiting",06,Diseases and Disorders of the Digestive System,2,Moderate,Minor,Medical,Medicaid,,,,N,Y,9210.21,1441.09
New York City,Bronx,7000006,003058,Montefiore Med Center - Jack D Weiler Hosp of A Einstein College Div,70 or Older,104,F,White,Not Span/Hispanic,3,Emergency,Home or Self Care,2017,135,Intestinal infection,000,NO PROC,249,"Other gastroenteritis, nausa & vomiting",06,Diseases and Disorders of the Digestive System,2,Moderate,Minor,Medical,Medicare,Blue Cross/Blue Shield,,,N,Y,28769.03,4179.13
New York City,Bronx,7000006,003058,Montefiore Med Center - Jack D Weiler Hosp of A Einstein College Div,30 to 49,104,F,Other Race,Not Span/Hispanic,1,Emergency,Home or Self Care,2017,135,Intestinal infection,000,NO PROC,249,"Other gastroenteritis, nausa & vomiting",06,Diseases and Disorders of the Digestive System,1,Minor,Minor,Medical,Medicaid,,,,N,Y,17105.26,2941.15
New York City,Bronx,7000006,003058,Montefiore Med Center - Jack D Weiler Hosp of A Einstein College Div,0 to 17,104,F,Other Race,Spanish/Hispanic,1,Emergency,Home or Self Care,2017,135,Intestinal infection,000,NO PROC,249,"Other gastroenteritis, nausa & vomiting",06,Diseases and Disorders of the Digestive System,1,Minor,Minor,Medical,Private Health Insurance,,,,N,Y,14372.72,2488.91
New York City,Kings,7001033,001315,Kingsbrook Jewish Medical Center,70 or Older,112,F,Black/African American,Not Span/Hispanic,11,Emergency,Home w/ Home Health Services,2017,154,Noninfectious gastroenteritis,000,NO PROC,249,"Other gastroenteritis, nausa & vomiting",06,Diseases and Disorders of the Digestive System,3,Major,Major,Medical,Medicare,Medicare,Self-Pay,,N,Y,57705.00,19589.68
New York City,Kings,7001033,001315,Kingsbrook Jewish Medical Center,50 to 69,112,F,Black/African American,Not Span/Hispanic,4,Emergency,Home or Self Care,2017,154,Noninfectious gastroenteritis,058,HEMODIALYSIS,249,"Other gastroenteritis, nausa & vomiting",06,Diseases and Disorders of the Digestive System,2,Moderate,Moderate,Medical,Medicaid,Medicaid,Self-Pay,,N,Y,29338.00,10156.96
New York City,Kings,7001033,001315,Kingsbrook Jewish Medical Center,70 or Older,112,F,Black/African American,Not Span/Hispanic,5,Emergency,Home or Self Care,2017,154,Noninfectious gastroenteritis,000,NO PROC,249,"Other gastroenteritis, nausa & vomiting",06,Diseases and Disorders of the Digestive System,2,Moderate,Minor,Medical,Medicare,Medicare,Medicaid,,N,Y,38701.00,11575.56
New York City,Kings,7001033,001315,Kingsbrook Jewish Medical Center,30 to 49,112,F,Black/African American,Not Span/Hispanic,1,Emergency,Home or Self Care,2017,154,Noninfectious gastroenteritis,000,NO PROC,249,"Other gastroenteritis, nausa & vomiting",06,Diseases and Disorders of the Digestive System,1,Minor,Minor,Medical,Medicaid,Medicaid,Self-Pay,,N,Y,14484.00,3269.05
New York City,Kings,7002002,001324,Mount Sinai Brooklyn,70 or Older,112,F,Black/African American,Not Span/Hispanic,6,Emergency,Home w/ Home Health Services,2017,154,Noninfectious gastroenteritis,179,CT SCAN ABDOMEN,249,"Other gastroenteritis, nausa & vomiting",06,Diseases and Disorders of the Digestive System,1,Minor,Minor,Medical,Medicare,Medicaid,Self-Pay,,N,Y,47799.59,7863.96
New York City,Kings,7002002,001324,Mount Sinai Brooklyn,50 to 69,112,M,White,Not Span/Hispanic,5,Emergency,Home or Self Care,2017,154,Noninfectious gastroenteritis,222,BLOOD TRANSFUSION,249,"Other gastroenteritis, nausa & vomiting",06,Diseases and Disorders of the Digestive System,1,Minor,Minor,Medical,Medicaid,Medicaid,Self-Pay,,N,Y,43373.82,7322.12
New York City,Kings,7002002,001324,Mount Sinai Brooklyn,70 or Older,112,F,White,Not Span/Hispanic,4,Emergency,Home w/ Home Health Services,2017,154,Noninfectious gastroenteritis,231,OTHER THERAPEUTIC PRCS,249,"Other gastroenteritis, nausa & vomiting",06,Diseases and Disorders of the Digestive System,1,Minor,Minor,Medical,Medicare,Miscellaneous/Other,Self-Pay,,N,N,29165.82,4500.77
New York City,Kings,7002002,001324,Mount Sinai Brooklyn,70 or Older,112,F,White,Not Span/Hispanic,1,Emergency,Home w/ Home Health Services,2017,154,Noninfectious gastroenteritis,179,CT SCAN ABDOMEN,249,"Other gastroenteritis, nausa & vomiting",06,Diseases and Disorders of the Digestive System,1,Minor,Moderate,Medical,Medicare,Medicaid,Self-Pay,,N,Y,15759.86,2470.05
New York City,Manhattan,7002024,001456,Mount Sinai Hospital,18 to 29,100,F,White,Not Span/Hispanic,1,Emergency,Home or Self Care,2017,154,Noninfectious gastroenteritis,000,NO PROC,249,"Other gastroenteritis, nausa & vomiting",06,Diseases and Disorders of the Digestive System,2,Moderate,Minor,Medical,Private Health Insurance,Self-Pay,,,N,Y,10619.99,3483.15
New York City,Manhattan,7002024,001456,Mount Sinai Hospital,0 to 17,104,M,Black/African American,Not Span/Hispanic,2,Emergency,Home or Self Care,2017,154,Noninfectious gastroenteritis,000,NO PROC,249,"Other gastroenteritis, nausa & vomiting",06,Diseases and Disorders of the Digestive System,2,Moderate,Minor,Medical,Private Health Insurance,Medicaid,Medicaid,,N,Y,15325.95,11475.36
New York City,Manhattan,7002024,001456,Mount Sinai Hospital,0 to 17,101,F,White,Not Span/Hispanic,1,Emergency,Home or Self Care,2017,055,Fluid and electrolyte disorders,000,NO PROC,249,"Other gastroenteritis, nausa & vomiting",06,Diseases and Disorders of the Digestive System,2,Moderate,Minor,Medical,Private Health Insurance,Self-Pay,,,N,Y,8575.00,6095.19
New York City,Manhattan,7002024,001456,Mount Sinai Hospital,50 to 69,103,F,White,Not Span/Hispanic,3,Emergency,Home or Self Care,2017,154,Noninfectious gastroenteritis,000,NO PROC,249,"Other gastroenteritis, nausa & vomiting",06,Diseases and Disorders of the Digestive System,3,Major,Major,Medical,Private Health Insurance,Self-Pay,,,N,Y,49629.12,16774.41
New York City,Manhattan,7002024,001456,Mount Sinai Hospital,50 to 69,113,F,Other Race,Not Span/Hispanic,3,Emergency,Home or Self Care,2017,154,Noninfectious gastroenteritis,000,NO PROC,249,"Other gastroenteritis, nausa & vomiting",06,Diseases and Disorders of the Digestive System,1,Minor,Minor,Medical,Blue Cross/Blue Shield,Self-Pay,,,N,Y,22643.43,7641.95
New York City,Manhattan,7002032,001466,Mount Sinai West,70 or Older,100,F,Black/African American,Not Span/Hispanic,6,Emergency,Home w/ Home Health Services,2017,154,Noninfectious gastroenteritis,058,HEMODIALYSIS,249,"Other gastroenteritis, nausa & vomiting",06,Diseases and Disorders of the Digestive System,3,Major,Major,Medical,Medicare,Medicaid,Self-Pay,,N,Y,73863.45,24545.38
New York City,Manhattan,7002032,001466,Mount Sinai West,18 to 29,100,F,Black/African American,Not Span/Hispanic,1,Emergency,Left Against Medical Advice,2017,155,Other gastrointestinal disorders,231,OTHER THERAPEUTIC PRCS,249,"Other gastroenteritis, nausa & vomiting",06,Diseases and Disorders of the Digestive System,2,Moderate,Moderate,Medical,Medicaid,Medicaid,Self-Pay,,N,Y,16533.30,3694.56
New York City,Manhattan,7002032,001469,Mount Sinai St. Luke's,50 to 69,100,F,Black/African American,Not Span/Hispanic,9,Emergency,Home or Self Care,2017,154,Noninfectious gastroenteritis,193,DX ULTRASOUND HEART,249,"Other gastroenteritis, nausa & vomiting",06,Diseases and Disorders of the Digestive System,2,Moderate,Minor,Medical,Medicare,Medicare,Medicaid,,N,Y,77396.29,23935.21
New York City,Manhattan,7002032,001469,Mount Sinai St. Luke's,50 to 69,100,F,Black/African American,Not Span/Hispanic,3,Emergency,Home or Self Care,2017,135,Intestinal infection,231,OTHER THERAPEUTIC PRCS,249,"Other gastroenteritis, nausa & vomiting",06,Diseases and Disorders of the Digestive System,3,Major,Moderate,Medical,Medicare,Medicare,Medicaid,,N,Y,32670.11,8729.74
New York City,Manhattan,7002032,001469,Mount Sinai St. Luke's,70 or Older,100,F,Black/African American,Not Span/Hispanic,3,Emergency,Home w/ Home Health Services,2017,135,Intestinal infection,179,CT SCAN ABDOMEN,249,"Other gastroenteritis, nausa & vomiting",06,Diseases and Disorders of the Digestive System,3,Major,Major,Medical,Medicare,Medicare,Self-Pay,,N,N,10.00,0.90
New York City,Manhattan,7002032,001469,Mount Sinai St. Luke's,50 to 69,100,F,Black/African American,Not Span/Hispanic,2,Emergency,Home or Self Care,2017,250,Nausea and vomiting,179,CT SCAN ABDOMEN,249,"Other gastroenteritis, nausa & vomiting",06,Diseases and Disorders of the Digestive System,2,Moderate,Minor,Medical,Medicare,Medicare,Self-Pay,,N,Y,34024.79,9365.57
New York City,Manhattan,7002032,001469,Mount Sinai St. Luke's,18 to 29,100,M,White,Not Span/Hispanic,3,Emergency,Home or Self Care,2017,135,Intestinal infection,179,CT SCAN ABDOMEN,249,"Other gastroenteritis, nausa & vomiting",06,Diseases and Disorders of the Digestive System,2,Moderate,Minor,Medical,Blue Cross/Blue Shield,Blue Cross/Blue Shield,Self-Pay,,N,Y,33595.96,8762.01