Hospital Service Area,Hospital County,Operating Certificate Number,Permanent Facility Id,Facility Name,Age Group,Zip Code - 3 digits,Gender,Race,Ethnicity,Length of Stay,Type of Admission,Patient Disposition,Discharge Year,CCS Diagnosis Code,CCS Diagnosis Description,CCS Procedure Code,CCS Procedure Description,APR DRG Code,APR DRG Description,APR MDC Code,APR MDC Description,APR Severity of Illness Code,APR Severity of Illness Description,APR Risk of Mortality,APR Medical Surgical Description,Payment Typology 1,Payment Typology 2,Payment Typology 3,Birth Weight,Abortion Edit Indicator,Emergency Department Indicator,Total Charges,Total Costs
Hudson Valley,Westchester,5902001,001045,White Plains Hospital Center,0 to 17,106,M,Other Race,Not Span/Hispanic,1,Emergency,Home or Self Care,2019,END011,FLUID AND ELECTROLYTE DISORDERS,,,249,"OTHER GASTROENTERITIS, NAUSEA & VOMITING",06,DISEASES AND DISORDERS OF THE DIGESTIVE SYSTEM,1,Minor,Minor,Medical,Medicaid,,,,,true,7863,1390.83
New York City,Queens,7003010,001637,New York - Presbyterian/Queens,70 or Older,113,F,White,Not Span/Hispanic,3,Emergency,Home or Self Care,2019,DIG001,INTESTINAL INFECTION,ADM021,"ADMINISTRATION OF THERAPEUTIC SUBSTANCES, NEC",249,"OTHER GASTROENTERITIS, NAUSEA & VOMITING",06,DISEASES AND DISORDERS OF THE DIGESTIVE SYSTEM,3,Major,Major,Medical,Blue Cross/Blue Shield,Medicare,Self-Pay,,,true,24151.29,6588.94
New York City,Manhattan,7002001,001438,Bellevue Hospital Center,50 to 69,100,M,Other Race,Spanish/Hispanic,2,Emergency,Home or Self Care,2019,DIG001,INTESTINAL INFECTION,ADM007,INTRAVENOUS INDUCTION OF LABOR,249,"OTHER GASTROENTERITIS, NAUSEA & VOMITING",06,DISEASES AND DISORDERS OF THE DIGESTIVE SYSTEM,2,Moderate,Minor,Medical,Medicaid,,,,,true,14969,9948.4
New York City,Manhattan,7002001,001438,Bellevue Hospital Center,50 to 69,112,F,Black/African American,Not Span/Hispanic,1,Emergency,Home or Self Care,2019,DIG001,INTESTINAL INFECTION,IMG009,PLAIN RADIOGRAPHY,249,"OTHER GASTROENTERITIS, NAUSEA & VOMITING",06,DISEASES AND DISORDERS OF THE DIGESTIVE SYSTEM,2,Moderate,Minor,Medical,Self-Pay,,,,,true,7433.44,4940.26
New York City,Manhattan,7002001,001438,Bellevue Hospital Center,70 or Older,100,F,Other Race,Spanish/Hispanic,1,Emergency,Home or Self Care,2019,DIG001,INTESTINAL INFECTION,IMG006,COMPUTERIZED TOMOGRAPHY (CT) WITH CONTRAST,249,"OTHER GASTROENTERITIS, NAUSEA & VOMITING",06,DISEASES AND DISORDERS OF THE DIGESTIVE SYSTEM,2,Moderate,Moderate,Medical,Medicare,Medicare,Medicaid,,,true,8874.67,5898.11
New York City,Manhattan,7002001,001438,Bellevue Hospital Center,50 to 69,100,F,White,Not Span/Hispanic,3,Emergency,Home or Self Care,2019,SYM004,NAUSEA AND VOMITING,ADM021,"ADMINISTRATION OF THERAPEUTIC SUBSTANCES, NEC",249,"OTHER GASTROENTERITIS, NAUSEA & VOMITING",06,DISEASES AND DISORDERS OF THE DIGESTIVE SYSTEM,3,Major,Major,Medical,Medicaid,Medicaid,,,,true,22440.34,14913.85
New York City,Bronx,7000006,001169,Montefiore Medical Center - Henry & Lucy Moses Div,0 to 17,104,M,Other Race,Spanish/Hispanic,1,Emergency,Home or Self Care,2019,DIG001,INTESTINAL INFECTION,ADM017,ADMINISTRATION OF NUTRITIONAL AND ELECTROLYTIC SUBSTANCES,249,"OTHER GASTROENTERITIS, NAUSEA & VOMITING",06,DISEASES AND DISORDERS OF THE DIGESTIVE SYSTEM,2,Moderate,Minor,Medical,Medicaid,,,,,true,14321.9,3360.52
Hudson Valley,Dutchess,5957001,000180,Mid-Hudson Valley Division of Westchester Medical Center,50 to 69,126,M,White,Not Span/Hispanic,2,Emergency,Home or Self Care,2019,DIG022,NONINFECTIOUS GASTROENTERITIS,,,249,"OTHER GASTROENTERITIS, NAUSEA & VOMITING",06,DISEASES AND DISORDERS OF THE DIGESTIVE SYSTEM,2,Moderate,Minor,Medical,Medicaid,Medicaid,,,,true,40672.96,6223.22
Southern Tier,Broome,0303001,000058,United Health Services Hospitals Inc. - Wilson Medical Center,70 or Older,137,M,White,Not Span/Hispanic,7,Emergency,Home w/ Home Health Services,2019,DIG001,INTESTINAL INFECTION,ADM006,INFUSION OF VASOPRESSOR,249,"OTHER GASTROENTERITIS, NAUSEA & VOMITING",06,DISEASES AND DISORDERS OF THE DIGESTIVE SYSTEM,4,Extreme,Extreme,Medical,Medicare,Medicare,Private Health Insurance,,,true,28635.8,13653.04
New York City,Bronx,7000006,001169,Montefiore Medical Center - Henry & Lucy Moses Div,50 to 69,104,F,Other Race,Spanish/Hispanic,5,Emergency,Home or Self Care,2019,DIG022,NONINFECTIOUS GASTROENTERITIS,,,249,"OTHER GASTROENTERITIS, NAUSEA & VOMITING",06,DISEASES AND DISORDERS OF THE DIGESTIVE SYSTEM,2,Moderate,Minor,Medical,Medicaid,,,,,true,65557.35,11523.01
Long Island,Suffolk,5151001,000245,Stony Brook University Hospital,18 to 29,117,M,Other Race,Not Span/Hispanic,2,Emergency,Home or Self Care,2019,DIG022,NONINFECTIOUS GASTROENTERITIS,,,249,"OTHER GASTROENTERITIS, NAUSEA & VOMITING",06,DISEASES AND DISORDERS OF THE DIGESTIVE SYSTEM,2,Moderate,Minor,Medical,Private Health Insurance,,,,,true,24371.89,6198.85
New York City,Kings,7002053,001304,NYU Langone Hospital-Brooklyn,0 to 17,112,F,Other Race,Not Span/Hispanic,1,Emergency,Home or Self Care,2019,INF005,FOODBORNE INTOXICATIONS,,,249,"OTHER GASTROENTERITIS, NAUSEA & VOMITING",06,DISEASES AND DISORDERS OF THE DIGESTIVE SYSTEM,2,Moderate,Minor,Medical,Medicaid,,,,,true,20844.62,4931.5
Western NY,Erie,1401013,000292,Sisters of Charity Hospital - St. Joseph Campus,30 to 49,140,F,White,Not Span/Hispanic,3,Emergency,Home or Self Care,2019,DIG022,NONINFECTIOUS GASTROENTERITIS,GIS002,COLONOSCOPY AND PROCTOSCOPY WITH BIOPSY,249,"OTHER GASTROENTERITIS, NAUSEA & VOMITING",06,DISEASES AND DISORDERS OF THE DIGESTIVE SYSTEM,1,Minor,Minor,Medical,Private Health Insurance,,,,,true,14355.88,6214.61
New York City,Manhattan,7002054,001458,New York-Presbyterian Hospital - New York Weill Cornell Center,50 to 69,103,M,White,Not Span/Hispanic,1,Emergency,Home w/ Home Health Services,2019,DIG001,INTESTINAL INFECTION,ADM017,ADMINISTRATION OF NUTRITIONAL AND ELECTROLYTIC SUBSTANCES,249,"OTHER GASTROENTERITIS, NAUSEA & VOMITING",06,DISEASES AND DISORDERS OF THE DIGESTIVE SYSTEM,2,Moderate,Moderate,Medical,Medicare,Medicare,Self-Pay,,,true,21724.95,5066.37
Central NY,Onondaga,3301008,000636,Crouse Hospital,30 to 49,132,F,White,Not Span/Hispanic,2,Emergency,Home or Self Care,2019,DIG022,NONINFECTIOUS GASTROENTERITIS,ADM017,ADMINISTRATION OF NUTRITIONAL AND ELECTROLYTIC SUBSTANCES,249,"OTHER GASTROENTERITIS, NAUSEA & VOMITING",06,DISEASES AND DISORDERS OF THE DIGESTIVE SYSTEM,2,Moderate,Minor,Medical,Medicare,Medicare,Medicaid,,,true,7996.34,3486.18
Finger Lakes,Monroe,2701003,000411,Rochester General Hospital,50 to 69,145,F,White,Not Span/Hispanic,4,Emergency,Home or Self Care,2019,DIG022,NONINFECTIOUS GASTROENTERITIS,GIS004,GI SYSTEM ENDOSCOPY WITHOUT BIOPSY (DIAGNOSTIC),249,"OTHER GASTROENTERITIS, NAUSEA & VOMITING",06,DISEASES AND DISORDERS OF THE DIGESTIVE SYSTEM,1,Minor,Minor,Medical,Blue Cross/Blue Shield,,,,,true,17159.6,8077.38
New York City,Manhattan,7002053,001463,NYU Langone Hospitals,30 to 49,,F,Other Race,Spanish/Hispanic,2,Emergency,Home or Self Care,2019,DIG022,NONINFECTIOUS GASTROENTERITIS,,,249,"OTHER GASTROENTERITIS, NAUSEA & VOMITING",06,DISEASES AND DISORDERS OF THE DIGESTIVE SYSTEM,1,Minor,Minor,Medical,Self-Pay,,,,,true,22792.93,7746.61
Long Island,Nassau,2908000,000511,NYU Langone Hospital-Long Island,18 to 29,115,F,White,Not Span/Hispanic,5,Emergency,Home or Self Care,2019,SYM004,NAUSEA AND VOMITING,,,249,"OTHER GASTROENTERITIS, NAUSEA & VOMITING",06,DISEASES AND DISORDERS OF THE DIGESTIVE SYSTEM,3,Major,Moderate,Medical,Private Health Insurance,,,,,true,45464.48,10338.71
Long Island,Nassau,2908000,000511,NYU Langone Hospital-Long Island,0 to 17,115,F,White,Spanish/Hispanic,2,Emergency,Home or Self Care,2019,DIG001,INTESTINAL INFECTION,,,249,"OTHER GASTROENTERITIS, NAUSEA & VOMITING",06,DISEASES AND DISORDERS OF THE DIGESTIVE SYSTEM,1,Minor,Minor,Medical,Medicaid,,,,,true,24284.68,5128.13
Long Island,Suffolk,5151001,000889,Stony Brook Southampton Hospital,70 or Older,119,F,White,Not Span/Hispanic,3,Emergency,Home or Self Care,2019,DIG001,INTESTINAL INFECTION,,,249,"OTHER GASTROENTERITIS, NAUSEA & VOMITING",06,DISEASES AND DISORDERS OF THE DIGESTIVE SYSTEM,2,Moderate,Moderate,Medical,Private Health Insurance,,,,,true,31305.28,7820.18
New York City,Manhattan,7002054,001458,New York-Presbyterian Hospital - New York Weill Cornell Center,0 to 17,100,F,Other Race,Spanish/Hispanic,1,Emergency,Home or Self Care,2019,DIG001,INTESTINAL INFECTION,OTR004,ISOLATION PROCEDURES,249,"OTHER GASTROENTERITIS, NAUSEA & VOMITING",06,DISEASES AND DISORDERS OF THE DIGESTIVE SYSTEM,2,Moderate,Minor,Medical,Private Health Insurance,Self-Pay,,,,true,16810.24,5178.04
New York City,Manhattan,7002054,001458,New York-Presbyterian Hospital - New York Weill Cornell Center,30 to 49,100,F,White,Not Span/Hispanic,1,Emergency,Home or Self Care,2019,DIG001,INTESTINAL INFECTION,ADM015,ADMINISTRATION OF ANTIBIOTICS,249,"OTHER GASTROENTERITIS, NAUSEA & VOMITING",06,DISEASES AND DISORDERS OF THE DIGESTIVE SYSTEM,3,Major,Major,Medical,Private Health Insurance,,,,,true,26690.5,5471.37
Central NY,St Lawrence,4423701,000812,Gouverneur Hospital,30 to 49,136,M,White,Not Span/Hispanic,1,Emergency,Home or Self Care,2019,DIG022,NONINFECTIOUS GASTROENTERITIS,,,249,"OTHER GASTROENTERITIS, NAUSEA & VOMITING",06,DISEASES AND DISORDERS OF THE DIGESTIVE SYSTEM,2,Moderate,Moderate,Medical,Medicaid,,,,,true,7662.7,3425.24
New York City,Manhattan,7002001,001438,Bellevue Hospital Center,30 to 49,112,F,Other Race,Not Span/Hispanic,1,Emergency,Home or Self Care,2019,DIG001,INTESTINAL INFECTION,ADM017,ADMINISTRATION OF NUTRITIONAL AND ELECTROLYTIC SUBSTANCES,249,"OTHER GASTROENTERITIS, NAUSEA & VOMITING",06,DISEASES AND DISORDERS OF THE DIGESTIVE SYSTEM,3,Major,Moderate,Medical,Medicaid,Medicaid,,,,false,6552.28,4354.65
New York City,Bronx,7000001,001178,BronxCare Hospital Center,50 to 69,104,F,Other Race,Spanish/Hispanic,2,Emergency,Home or Self Care,2019,DIG022,NONINFECTIOUS GASTROENTERITIS,,,249,"OTHER GASTROENTERITIS, NAUSEA & VOMITING",06,DISEASES AND DISORDERS OF THE DIGESTIVE SYSTEM,2,Moderate,Minor,Medical,Medicaid,Medicaid,,,,true,8813.65,9786.22
Capital/Adirond,Albany,0101000,000001,Albany Medical Center Hospital,70 or Older,122,F,White,Not Span/Hispanic,7,Emergency,Home or Self Care,2019,DIG022,NONINFECTIOUS GASTROENTERITIS,ADM001,TRANSFUSION OF BLOOD AND BLOOD PRODUCTS,249,"OTHER GASTROENTERITIS, NAUSEA & VOMITING",06,DISEASES AND DISORDERS OF THE DIGESTIVE SYSTEM,3,Major,Major,Medical,Medicare,,,,,true,36258.31,10348.39
Western NY,Erie,1401005,000210,Erie County Medical Center,50 to 69,142,F,White,Not Span/Hispanic,11,Emergency,Home or Self Care,2019,DIG022,NONINFECTIOUS GASTROENTERITIS,CAR024,VENOUS AND ARTERIAL CATHETER PLACEMENT,249,"OTHER GASTROENTERITIS, NAUSEA & VOMITING",06,DISEASES AND DISORDERS OF THE DIGESTIVE SYSTEM,3,Major,Major,Medical,Medicaid,Medicaid,,,,true,28884,19149.61
New York City,Manhattan,7002054,001458,New York-Presbyterian Hospital - New York Weill Cornell Center,70 or Older,OOS,F,Other Race,Not Span/Hispanic,1,Emergency,Home or Self Care,2019,SYM006,ABDOMINAL PAIN AND OTHER DIGESTIVE/ABDOMEN SIGNS AND SYMPTOMS,ADM021,"ADMINISTRATION OF THERAPEUTIC SUBSTANCES, NEC",249,"OTHER GASTROENTERITIS, NAUSEA & VOMITING",06,DISEASES AND DISORDERS OF THE DIGESTIVE SYSTEM,2,Moderate,Moderate,Medical,Blue Cross/Blue Shield,Medicare,Self-Pay,,,false,18335.22,8183.01
Central NY,Cortland,1101000,000158,Guthrie Cortland Medical Center,70 or Older,130,F,White,Not Span/Hispanic,2,Emergency,Home w/ Home Health Services,2019,DIG001,INTESTINAL INFECTION,,,249,"OTHER GASTROENTERITIS, NAUSEA & VOMITING",06,DISEASES AND DISORDERS OF THE DIGESTIVE SYSTEM,2,Moderate,Moderate,Medical,Medicare,Medicaid,,,,true,6446.26,2602.86
Central NY,Cortland,1101000,000158,Guthrie Cortland Medical Center,70 or Older,131,M,White,Not Span/Hispanic,2,Emergency,Home w/ Home Health Services,2019,SYM006,ABDOMINAL PAIN AND OTHER DIGESTIVE/ABDOMEN SIGNS AND SYMPTOMS,,,249,"OTHER GASTROENTERITIS, NAUSEA & VOMITING",06,DISEASES AND DISORDERS OF THE DIGESTIVE SYSTEM,3,Major,Major,Medical,Medicare,Private Health Insurance,,,,true,5140.29,2567.85
New York City,Manhattan,7002001,001438,Bellevue Hospital Center,30 to 49,100,M,Black/African American,Not Span/Hispanic,3,Emergency,Home or Self Care,2019,DIG022,NONINFECTIOUS GASTROENTERITIS,ADM021,"ADMINISTRATION OF THERAPEUTIC SUBSTANCES, NEC",249,"OTHER GASTROENTERITIS, NAUSEA & VOMITING",06,DISEASES AND DISORDERS OF THE DIGESTIVE SYSTEM,2,Moderate,Moderate,Medical,Medicaid,,,,,true,19939.83,13252.01
New York City,Manhattan,7002001,001438,Bellevue Hospital Center,50 to 69,111,F,Other Race,Not Span/Hispanic,2,Emergency,Home or Self Care,2019,DIG022,NONINFECTIOUS GASTROENTERITIS,ADM017,ADMINISTRATION OF NUTRITIONAL AND ELECTROLYTIC SUBSTANCES,249,"OTHER GASTROENTERITIS, NAUSEA & VOMITING",06,DISEASES AND DISORDERS OF THE DIGESTIVE SYSTEM,2,Moderate,Moderate,Medical,Medicaid,,,,,true,13492.8,8967.31
Capital/Adirond,Fulton,1701000,000330,Nathan Littauer Hospital,50 to 69,121,F,White,Not Span/Hispanic,3,Emergency,Home or Self Care,2019,DIG022,NONINFECTIOUS GASTROENTERITIS,ADM010,VACCINATIONS,249,"OTHER GASTROENTERITIS, NAUSEA & VOMITING",06,DISEASES AND DISORDERS OF THE DIGESTIVE SYSTEM,2,Moderate,Minor,Medical,Medicaid,,,,,true,22096.6,2649.35
Finger Lakes,Wayne,5820000,001028,Newark-Wayne Community Hospital,70 or Older,145,F,White,Not Span/Hispanic,9,Emergency,Hospice - Medical Facility,2019,DIG001,INTESTINAL INFECTION,CAR024,VENOUS AND ARTERIAL CATHETER PLACEMENT,249,"OTHER GASTROENTERITIS, NAUSEA & VOMITING",06,DISEASES AND DISORDERS OF THE DIGESTIVE SYSTEM,4,Extreme,Extreme,Medical,Medicare,,,,,true,29165.77,12464.72
Central NY,Onondaga,3301007,000635,University Hospital SUNY Health Science Center,0 to 17,131,F,White,Not Span/Hispanic,1,Emergency,Home or Self Care,2019,END011,FLUID AND ELECTROLYTE DISORDERS,,,249,"OTHER GASTROENTERITIS, NAUSEA & VOMITING",06,DISEASES AND DISORDERS OF THE DIGESTIVE SYSTEM,1,Minor,Minor,Medical,Medicaid,,,,,true,8169,2963.02
Central NY,Onondaga,3301007,000635,University Hospital SUNY Health Science Center,0 to 17,130,M,White,Not Span/Hispanic,3,Emergency,Home or Self Care,2019,END011,FLUID AND ELECTROLYTE DISORDERS,,,249,"OTHER GASTROENTERITIS, NAUSEA & VOMITING",06,DISEASES AND DISORDERS OF THE DIGESTIVE SYSTEM,1,Minor,Minor,Medical,Private Health Insurance,,,,,true,20479,6661.73
New York City,Manhattan,7002054,001458,New York-Presbyterian Hospital - New York Weill Cornell Center,30 to 49,112,F,Multi-racial,Not Span/Hispanic,1,Emergency,Home or Self Care,2019,SYM004,NAUSEA AND VOMITING,ADM017,ADMINISTRATION OF NUTRITIONAL AND ELECTROLYTIC SUBSTANCES,249,"OTHER GASTROENTERITIS, NAUSEA & VOMITING",06,DISEASES AND DISORDERS OF THE DIGESTIVE SYSTEM,2,Moderate,Moderate,Medical,"Managed Care, Unspecified",Medicaid,Self-Pay,,,true,15463.49,3489.87
New York City,Manhattan,7002054,001437,New York-Presbyterian/Lower Manhattan Hospital,70 or Older,100,F,Other Race,Not Span/Hispanic,2,Emergency,Home w/ Home Health Services,2019,DIG001,INTESTINAL INFECTION,ADM021,"ADMINISTRATION OF THERAPEUTIC SUBSTANCES, NEC",249,"OTHER GASTROENTERITIS, NAUSEA & VOMITING",06,DISEASES AND DISORDERS OF THE DIGESTIVE SYSTEM,3,Major,Major,Medical,Medicare,Medicare,Medicaid,,,true,30760.21,6632
New York City,Bronx,7000002,001165,Jacobi Medical Center,0 to 17,104,F,Other Race,Not Span/Hispanic,7,Emergency,Home or Self Care,2019,DIG022,NONINFECTIOUS GASTROENTERITIS,GIS001,ESOPHAGOGASTRODUODENOSCOPY (EGD) WITH BIOPSY,249,"OTHER GASTROENTERITIS, NAUSEA & VOMITING",06,DISEASES AND DISORDERS OF THE DIGESTIVE SYSTEM,2,Moderate,Minor,Medical,Medicaid,Medicaid,,,,true,46225.26,27349.18
Central NY,Onondaga,3301007,000635,University Hospital SUNY Health Science Center,50 to 69,132,F,Black/African American,Not Span/Hispanic,3,Emergency,Home or Self Care,2019,DIG022,NONINFECTIOUS GASTROENTERITIS,,,249,"OTHER GASTROENTERITIS, NAUSEA & VOMITING",06,DISEASES AND DISORDERS OF THE DIGESTIVE SYSTEM,3,Major,Moderate,Medical,Private Health Insurance,,,,,true,27284.3,6905.73
Central NY,Onondaga,3301007,000635,University Hospital SUNY Health Science Center,30 to 49,131,F,White,Not Span/Hispanic,3,Emergency,Home or Self Care,2019,DIG001,INTESTINAL INFECTION,,,249,"OTHER GASTROENTERITIS, NAUSEA & VOMITING",06,DISEASES AND DISORDERS OF THE DIGESTIVE SYSTEM,3,Major,Moderate,Medical,Federal/State/Local/VA,,,,,true,26647.2,6800.09
New York City,Kings,7001002,001286,Brookdale Hospital Medical Center,50 to 69,112,M,Black/African American,Unknown,2,Emergency,Home or Self Care,2019,DIG022,NONINFECTIOUS GASTROENTERITIS,,,249,"OTHER GASTROENTERITIS, NAUSEA & VOMITING",06,DISEASES AND DISORDERS OF THE DIGESTIVE SYSTEM,2,Moderate,Moderate,Medical,Federal/State/Local/VA,,,,,true,10123.29,4846.63
New York City,Kings,7001002,001286,Brookdale Hospital Medical Center,50 to 69,112,M,Black/African American,Unknown,3,Emergency,Home or Self Care,2019,DIG001,INTESTINAL INFECTION,ENT001,LARYNGOSCOPY (DIAGNOSTIC),249,"OTHER GASTROENTERITIS, NAUSEA & VOMITING",06,DISEASES AND DISORDERS OF THE DIGESTIVE SYSTEM,3,Major,Major,Medical,Medicare,Medicaid,,,,true,13351.32,5964.76
Western NY,Erie,1401005,000210,Erie County Medical Center,30 to 49,142,M,White,Unknown,4,Emergency,Home or Self Care,2019,DIG022,NONINFECTIOUS GASTROENTERITIS,,,249,"OTHER GASTROENTERITIS, NAUSEA & VOMITING",06,DISEASES AND DISORDERS OF THE DIGESTIVE SYSTEM,3,Major,Major,Medical,Medicaid,Medicaid,,,,true,15183.87,8087.32
Hudson Valley,Westchester,5922000,001122,New York - Presbyterian Hospital,18 to 29,104,M,White,Not Span/Hispanic,2,Emergency,Home or Self Care,2019,DIG022,NONINFECTIOUS GASTROENTERITIS,,,249,"OTHER GASTROENTERITIS, NAUSEA & VOMITING",06,DISEASES AND DISORDERS OF THE DIGESTIVE SYSTEM,1,Minor,Minor,Medical,Self-Pay,,,,,true,29021.72,10276.89
Finger Lakes,Monroe,2701003,000411,Rochester General Hospital,50 to 69,146,M,White,Not Span/Hispanic,14,Emergency,Inpatient Rehabilitation Facility,2019,DIG001,INTESTINAL INFECTION,CAR025,PLACEMENT OF TUNNELED OR IMPLANTABLE PORTION OF A VASCULAR ACCESS DEVICE,249,"OTHER GASTROENTERITIS, NAUSEA & VOMITING",06,DISEASES AND DISORDERS OF THE DIGESTIVE SYSTEM,3,Major,Major,Medical,Self-Pay,,,,,true,43976.93,20516.48
Hudson Valley,Westchester,5902001,001045,White Plains Hospital Center,70 or Older,105,F,Other Race,Not Span/Hispanic,3,Emergency,Home or Self Care,2019,DIG001,INTESTINAL INFECTION,,,249,"OTHER GASTROENTERITIS, NAUSEA & VOMITING",06,DISEASES AND DISORDERS OF THE DIGESTIVE SYSTEM,1,Minor,Minor,Medical,Medicare,Blue Cross/Blue Shield,,,,true,29881,6499.77
Hudson Valley,Westchester,5902001,001045,White Plains Hospital Center,70 or Older,105,F,Other Race,Not Span/Hispanic,3,Emergency,Home or Self Care,2019,DIG022,NONINFECTIOUS GASTROENTERITIS,,,249,"OTHER GASTROENTERITIS, NAUSEA & VOMITING",06,DISEASES AND DISORDERS OF THE DIGESTIVE SYSTEM,2,Moderate,Moderate,Medical,Medicare,Private Health Insurance,,,,true,34729,6769.99
New York City,Queens,7003010,001637,New York - Presbyterian/Queens,0 to 17,113,F,White,Not Span/Hispanic,2,Emergency,Home or Self Care,2019,DIG001,INTESTINAL INFECTION,ADM015,ADMINISTRATION OF ANTIBIOTICS,249,"OTHER GASTROENTERITIS, NAUSEA & VOMITING",06,DISEASES AND DISORDERS OF THE DIGESTIVE SYSTEM,3,Major,Major,Medical,Private Health Insurance,Self-Pay,,,,true,20617.53,6912.11
New York City,Queens,7003010,001637,New York - Presbyterian/Queens,30 to 49,100,M,Other Race,Spanish/Hispanic,3,Emergency,Home or Self Care,2019,SYM004,NAUSEA AND VOMITING,IMG006,COMPUTERIZED TOMOGRAPHY (CT) WITH CONTRAST,249,"OTHER GASTROENTERITIS, NAUSEA & VOMITING",06,DISEASES AND DISORDERS OF THE DIGESTIVE SYSTEM,1,Minor,Minor,Medical,Medicaid,Self-Pay,,,,true,26031.56,6247.13
Western NY,Erie,1401013,000292,Sisters of Charity Hospital - St. Joseph Campus,50 to 69,142,F,White,Not Span/Hispanic,2,Emergency,Home or Self Care,2019,DIG022,NONINFECTIOUS GASTROENTERITIS,GIS002,COLONOSCOPY AND PROCTOSCOPY WITH BIOPSY,249,"OTHER GASTROENTERITIS, NAUSEA & VOMITING",06,DISEASES AND DISORDERS OF THE DIGESTIVE SYSTEM,3,Major,Major,Medical,Blue Cross/Blue Shield,Medicare,,,,true,11493.67,4252.69
Western NY,Erie,1401013,000292,Sisters of Charity Hospital - St. Joseph Campus,30 to 49,142,F,White,Not Span/Hispanic,1,Emergency,Home or Self Care,2019,DIG001,INTESTINAL INFECTION,,,249,"OTHER GASTROENTERITIS, NAUSEA & VOMITING",06,DISEASES AND DISORDERS OF THE DIGESTIVE SYSTEM,2,Moderate,Minor,Medical,Federal/State/Local/VA,,,,,true,6640.47,2517.01
Western NY,Erie,1401013,000292,Sisters of Charity Hospital - St. Joseph Campus,30 to 49,140,F,White,Not Span/Hispanic,1,Emergency,Home or Self Care,2019,DIG022,NONINFECTIOUS GASTROENTERITIS,,,249,"OTHER GASTROENTERITIS, NAUSEA & VOMITING",06,DISEASES AND DISORDERS OF THE DIGESTIVE SYSTEM,1,Minor,Minor,Medical,Medicaid,Medicaid,,,,true,6827.4,2928.17
New York City,Kings,7001021,001306,New York - Presbyterian Brooklyn Methodist Hospital,70 or Older,112,F,White,Not Span/Hispanic,3,Emergency,Left Against Medical Advice,2019,DIG001,INTESTINAL INFECTION,,,249,"OTHER GASTROENTERITIS, NAUSEA & VOMITING",06,DISEASES AND DISORDERS OF THE DIGESTIVE SYSTEM,3,Major,Major,Medical,Blue Cross/Blue Shield,Medicare,Self-Pay,,,true,23914.43,5487.57
New York City,Kings,7001021,001306,New York - Presbyterian Brooklyn Methodist Hospital,50 to 69,112,M,Black/African American,Not Span/Hispanic,1,Emergency,Home or Self Care,2019,DIG022,NONINFECTIOUS GASTROENTERITIS,,,249,"OTHER GASTROENTERITIS, NAUSEA & VOMITING",06,DISEASES AND DISORDERS OF THE DIGESTIVE SYSTEM,2,Moderate,Moderate,Medical,Medicare,Medicare,Medicaid,,,true,12192.02,2511.57
Central NY,Herkimer,2129700,000362,Little Falls Hospital,70 or Older,134,F,White,Not Span/Hispanic,5,Urgent,Home or Self Care,2019,SYM006,ABDOMINAL PAIN AND OTHER DIGESTIVE/ABDOMEN SIGNS AND SYMPTOMS,,,249,"OTHER GASTROENTERITIS, NAUSEA & VOMITING",06,DISEASES AND DISORDERS OF THE DIGESTIVE SYSTEM,2,Moderate,Moderate,Medical,Medicare,,,,,false,8320.63,6508.9
Central NY,Oneida,3202003,000599,Faxton-St Lukes Healthcare St Lukes Division,50 to 69,133,M,White,Not Span/Hispanic,2,Emergency,Home or Self Care,2019,DIG001,INTESTINAL INFECTION,,,249,"OTHER GASTROENTERITIS, NAUSEA & VOMITING",06,DISEASES AND DISORDERS OF THE DIGESTIVE SYSTEM,1,Minor,Minor,Medical,Blue Cross/Blue Shield,Private Health Insurance,,,,true,20633.61,2871.1
Long Island,Suffolk,5154001,000925,Good Samaritan Hospital Medical Center,30 to 49,117,F,White,Spanish/Hispanic,3,Emergency,Home or Self Care,2019,SYM004,NAUSEA AND VOMITING,GIS001,ESOPHAGOGASTRODUODENOSCOPY (EGD) WITH BIOPSY,249,"OTHER GASTROENTERITIS, NAUSEA & VOMITING",06,DISEASES AND DISORDERS OF THE DIGESTIVE SYSTEM,2,Moderate,Minor,Medical,Medicaid,Medicaid,,,,true,38627.51,6134.92
Long Island,Suffolk,5154001,000925,Good Samaritan Hospital Medical Center,70 or Older,117,F,White,Not Span/Hispanic,4,Emergency,Home w/ Home Health Services,2019,DIG022,NONINFECTIOUS GASTROENTERITIS,,,249,"OTHER GASTROENTERITIS, NAUSEA & VOMITING",06,DISEASES AND DISORDERS OF THE DIGESTIVE SYSTEM,3,Major,Moderate,Medical,Medicare,Medicare,,,,true,30262,5300.12
New York City,Kings,7001021,001306,New York - Presbyterian Brooklyn Methodist Hospital,70 or Older,112,F,White,Not Span/Hispanic,1,Emergency,Home or Self Care,2019,DIG001,INTESTINAL INFECTION,,,249,"OTHER GASTROENTERITIS, NAUSEA & VOMITING",06,DISEASES AND DISORDERS OF THE DIGESTIVE SYSTEM,1,Minor,Minor,Medical,Medicare,Private Health Insurance,Self-Pay,,,true,14046.64,2810.76
Long Island,Nassau,2952005,000552,Plainview Hospital,70 or Older,115,F,White,Not Span/Hispanic,3,Emergency,Home or Self Care,2019,DIG022,NONINFECTIOUS GASTROENTERITIS,,,249,"OTHER GASTROENTERITIS, NAUSEA & VOMITING",06,DISEASES AND DISORDERS OF THE DIGESTIVE SYSTEM,2,Moderate,Major,Medical,Medicare,Medicaid,,,,true,25156.91,8104.04