Hospital Service Area,Hospital County,Operating Certificate Number,Permanent Facility Id,Facility Name,Age Group,Zip Code - 3 digits,Gender,Race,Ethnicity,Length of Stay,Type of Admission,Patient Disposition,Discharge Year,CCS Diagnosis Code,CCS Diagnosis Description,CCS Procedure Code,CCS Procedure Description,APR DRG Code,APR DRG Description,APR MDC Code,APR MDC Description,APR Severity of Illness Code,APR Severity of Illness Description,APR Risk of Mortality,APR Medical Surgical Description,Payment Typology 1,Payment Typology 2,Payment Typology 3,Birth Weight,Abortion Edit Indicator,Emergency Department Indicator,Total Charges,Total Costs
New York City,Manhattan,7002053,001463,NYU Langone Hospitals,30 to 49,,F,Other Race,Spanish/Hispanic,2,Emergency,Home or Self Care,2019,DIG022,NONINFECTIOUS GASTROENTERITIS,,,249,"OTHER GASTROENTERITIS, NAUSEA & VOMITING",06,DISEASES AND DISORDERS OF THE DIGESTIVE SYSTEM,1,Minor,Minor,Medical,Self-Pay,,,,,true,22792.93,7746.61
New York City,Manhattan,7002053,001463,NYU Langone Hospitals,30 to 49,103,M,White,Not Span/Hispanic,2,Emergency,Home or Self Care,2019,DIG022,NONINFECTIOUS GASTROENTERITIS,,,249,"OTHER GASTROENTERITIS, NAUSEA & VOMITING",06,DISEASES AND DISORDERS OF THE DIGESTIVE SYSTEM,2,Moderate,Minor,Medical,Private Health Insurance,,,,,true,39811.39,9977.85
New York City,Manhattan,7002053,001463,NYU Langone Hospitals,30 to 49,114,M,Other Race,Spanish/Hispanic,6,Emergency,Hospice - Home,2019,SYM006,ABDOMINAL PAIN AND OTHER DIGESTIVE/ABDOMEN SIGNS AND SYMPTOMS,OTR004,ISOLATION PROCEDURES,249,"OTHER GASTROENTERITIS, NAUSEA & VOMITING",06,DISEASES AND DISORDERS OF THE DIGESTIVE SYSTEM,3,Major,Major,Medical,Medicare,Medicaid,,,,true,55368.08,22079.88
New York City,Manhattan,7002053,001463,NYU Langone Hospitals,70 or Older,112,F,White,Not Span/Hispanic,2,Emergency,Home w/ Home Health Services,2019,DIG001,INTESTINAL INFECTION,OTR004,ISOLATION PROCEDURES,249,"OTHER GASTROENTERITIS, NAUSEA & VOMITING",06,DISEASES AND DISORDERS OF THE DIGESTIVE SYSTEM,3,Major,Major,Medical,Medicare,Medicaid,,,,true,48309.47,10638.59
New York City,Manhattan,7002053,001463,NYU Langone Hospitals,30 to 49,111,M,Multi-racial,Not Span/Hispanic,2,Emergency,Home or Self Care,2019,DIG001,INTESTINAL INFECTION,SUD001,SUBSTANCE USE DETOXIFICATION,249,"OTHER GASTROENTERITIS, NAUSEA & VOMITING",06,DISEASES AND DISORDERS OF THE DIGESTIVE SYSTEM,2,Moderate,Moderate,Medical,Private Health Insurance,,,,,true,30177.76,10707.16
New York City,Manhattan,7002053,001463,NYU Langone Hospitals,30 to 49,100,M,Black/African American,Not Span/Hispanic,3,Emergency,Home or Self Care,2019,DIG001,INTESTINAL INFECTION,,,249,"OTHER GASTROENTERITIS, NAUSEA & VOMITING",06,DISEASES AND DISORDERS OF THE DIGESTIVE SYSTEM,2,Moderate,Minor,Medical,Blue Cross/Blue Shield,,,,,true,42034.49,12459.84
New York City,Manhattan,7002053,001463,NYU Langone Hospitals,70 or Older,112,M,Other Race,Not Span/Hispanic,2,Emergency,Home or Self Care,2019,DIG001,INTESTINAL INFECTION,GIS004,GI SYSTEM ENDOSCOPY WITHOUT BIOPSY (DIAGNOSTIC),249,"OTHER GASTROENTERITIS, NAUSEA & VOMITING",06,DISEASES AND DISORDERS OF THE DIGESTIVE SYSTEM,3,Major,Major,Medical,Medicare,Medicaid,,,,true,59233.06,12933.76
New York City,Manhattan,7002053,001463,NYU Langone Hospitals,70 or Older,100,F,White,Not Span/Hispanic,1,Emergency,Home w/ Home Health Services,2019,DIG022,NONINFECTIOUS GASTROENTERITIS,,,249,"OTHER GASTROENTERITIS, NAUSEA & VOMITING",06,DISEASES AND DISORDERS OF THE DIGESTIVE SYSTEM,4,Extreme,Major,Medical,Medicare,Medicaid,,,,true,53426.76,17769.82
New York City,Manhattan,7002053,001463,NYU Langone Hospitals,30 to 49,112,F,White,Not Span/Hispanic,2,Emergency,Home or Self Care,2019,DIG022,NONINFECTIOUS GASTROENTERITIS,,,249,"OTHER GASTROENTERITIS, NAUSEA & VOMITING",06,DISEASES AND DISORDERS OF THE DIGESTIVE SYSTEM,2,Moderate,Minor,Medical,Private Health Insurance,,,,,true,32529.33,11024.8
New York City,Manhattan,7002053,001463,NYU Langone Hospitals,70 or Older,112,F,White,Not Span/Hispanic,1,Emergency,Home w/ Home Health Services,2019,DIG001,INTESTINAL INFECTION,,,249,"OTHER GASTROENTERITIS, NAUSEA & VOMITING",06,DISEASES AND DISORDERS OF THE DIGESTIVE SYSTEM,2,Moderate,Minor,Medical,Medicare,Medicaid,,,,true,30622.11,6591.32
New York City,Manhattan,7002053,001463,NYU Langone Hospitals,0 to 17,100,M,Black/African American,Not Span/Hispanic,1,Emergency,Home or Self Care,2019,DIG001,INTESTINAL INFECTION,OTR004,ISOLATION PROCEDURES,249,"OTHER GASTROENTERITIS, NAUSEA & VOMITING",06,DISEASES AND DISORDERS OF THE DIGESTIVE SYSTEM,1,Minor,Minor,Medical,Medicaid,,,,,true,19806.23,4577.33
New York City,Manhattan,7002053,001463,NYU Langone Hospitals,50 to 69,113,M,Other Race,Not Span/Hispanic,2,Emergency,Home or Self Care,2019,DIG022,NONINFECTIOUS GASTROENTERITIS,,,249,"OTHER GASTROENTERITIS, NAUSEA & VOMITING",06,DISEASES AND DISORDERS OF THE DIGESTIVE SYSTEM,3,Major,Moderate,Medical,Private Health Insurance,,,,,true,29620.67,8683.35
New York City,Manhattan,7002053,001463,NYU Langone Hospitals,50 to 69,115,F,White,Not Span/Hispanic,2,Emergency,Home or Self Care,2019,SYM004,NAUSEA AND VOMITING,,,249,"OTHER GASTROENTERITIS, NAUSEA & VOMITING",06,DISEASES AND DISORDERS OF THE DIGESTIVE SYSTEM,2,Moderate,Moderate,Medical,Medicare,Medicare,,,,true,28544.25,8489.31
New York City,Manhattan,7002053,001463,NYU Langone Hospitals,50 to 69,112,F,White,Not Span/Hispanic,9,Emergency,Home or Self Care,2019,DIG001,INTESTINAL INFECTION,,,249,"OTHER GASTROENTERITIS, NAUSEA & VOMITING",06,DISEASES AND DISORDERS OF THE DIGESTIVE SYSTEM,3,Major,Moderate,Medical,Blue Cross/Blue Shield,,,,,false,134216.48,33471.96
New York City,Manhattan,7002053,001463,NYU Langone Hospitals,30 to 49,104,M,White,Not Span/Hispanic,2,Emergency,Home or Self Care,2019,DIG001,INTESTINAL INFECTION,,,249,"OTHER GASTROENTERITIS, NAUSEA & VOMITING",06,DISEASES AND DISORDERS OF THE DIGESTIVE SYSTEM,3,Major,Minor,Medical,Blue Cross/Blue Shield,,,,,true,64829.97,18485.88
New York City,Manhattan,7002053,001463,NYU Langone Hospitals,30 to 49,112,M,Other Race,Spanish/Hispanic,3,Emergency,Home or Self Care,2019,DIG001,INTESTINAL INFECTION,ADM021,"ADMINISTRATION OF THERAPEUTIC SUBSTANCES, NEC",249,"OTHER GASTROENTERITIS, NAUSEA & VOMITING",06,DISEASES AND DISORDERS OF THE DIGESTIVE SYSTEM,3,Major,Moderate,Medical,Medicaid,,,,,true,49110.5,13373.45
New York City,Manhattan,7002053,001463,NYU Langone Hospitals,70 or Older,100,F,White,Not Span/Hispanic,1,Emergency,Home w/ Home Health Services,2019,DIG001,INTESTINAL INFECTION,,,249,"OTHER GASTROENTERITIS, NAUSEA & VOMITING",06,DISEASES AND DISORDERS OF THE DIGESTIVE SYSTEM,3,Major,Major,Medical,Medicare,Blue Cross/Blue Shield,,,,true,43930.42,14133.04
New York City,Manhattan,7002053,001463,NYU Langone Hospitals,70 or Older,OOS,F,White,Not Span/Hispanic,1,Elective,Home or Self Care,2019,SYM004,NAUSEA AND VOMITING,,,249,"OTHER GASTROENTERITIS, NAUSEA & VOMITING",06,DISEASES AND DISORDERS OF THE DIGESTIVE SYSTEM,4,Extreme,Major,Medical,Medicare,,,,,false,13267.63,3977.54
New York City,Manhattan,7002053,001463,NYU Langone Hospitals,0 to 17,103,F,White,Not Span/Hispanic,1,Emergency,Home w/ Home Health Services,2019,END011,FLUID AND ELECTROLYTE DISORDERS,MAM011,ELECTROENCEPHALOGRAM (EEG),249,"OTHER GASTROENTERITIS, NAUSEA & VOMITING",06,DISEASES AND DISORDERS OF THE DIGESTIVE SYSTEM,3,Major,Moderate,Medical,Blue Cross/Blue Shield,,,,,true,60166.42,5111.51
New York City,Manhattan,7002053,001463,NYU Langone Hospitals,70 or Older,114,M,White,Not Span/Hispanic,2,Emergency,Home w/ Home Health Services,2019,DIG022,NONINFECTIOUS GASTROENTERITIS,,,249,"OTHER GASTROENTERITIS, NAUSEA & VOMITING",06,DISEASES AND DISORDERS OF THE DIGESTIVE SYSTEM,3,Major,Major,Medical,Medicaid,,,,,true,46950.69,11844.49
New York City,Manhattan,7002053,001463,NYU Langone Hospitals,18 to 29,100,F,White,Not Span/Hispanic,1,Emergency,Home or Self Care,2019,DIG022,NONINFECTIOUS GASTROENTERITIS,,,249,"OTHER GASTROENTERITIS, NAUSEA & VOMITING",06,DISEASES AND DISORDERS OF THE DIGESTIVE SYSTEM,2,Moderate,Moderate,Medical,Private Health Insurance,,,,,true,19083.69,4992.09
New York City,Manhattan,7002053,001463,NYU Langone Hospitals,70 or Older,115,F,White,Not Span/Hispanic,1,Emergency,Home or Self Care,2019,DIG022,NONINFECTIOUS GASTROENTERITIS,,,249,"OTHER GASTROENTERITIS, NAUSEA & VOMITING",06,DISEASES AND DISORDERS OF THE DIGESTIVE SYSTEM,3,Major,Major,Medical,Medicare,Medicare,,,,true,13705.88,4258.56
New York City,Manhattan,7002053,001463,NYU Langone Hospitals,50 to 69,104,F,Other Race,Spanish/Hispanic,1,Emergency,Home or Self Care,2019,DIG001,INTESTINAL INFECTION,,,249,"OTHER GASTROENTERITIS, NAUSEA & VOMITING",06,DISEASES AND DISORDERS OF THE DIGESTIVE SYSTEM,3,Major,Moderate,Medical,Private Health Insurance,,,,,true,19440.13,4837.42
New York City,Manhattan,7002053,001463,NYU Langone Hospitals,0 to 17,112,F,White,Not Span/Hispanic,2,Emergency,Home or Self Care,2019,END011,FLUID AND ELECTROLYTE DISORDERS,OTR004,ISOLATION PROCEDURES,249,"OTHER GASTROENTERITIS, NAUSEA & VOMITING",06,DISEASES AND DISORDERS OF THE DIGESTIVE SYSTEM,3,Major,Moderate,Medical,Medicaid,,,,,true,32102.46,7969.41
New York City,Manhattan,7002053,001463,NYU Langone Hospitals,30 to 49,114,F,Other Race,Not Span/Hispanic,5,Emergency,Home or Self Care,2019,DIG001,INTESTINAL INFECTION,ESA001,HEMODIALYSIS,249,"OTHER GASTROENTERITIS, NAUSEA & VOMITING",06,DISEASES AND DISORDERS OF THE DIGESTIVE SYSTEM,3,Major,Major,Medical,Medicare,Medicaid,,,,true,86026.85,30965.87
New York City,Manhattan,7002053,001463,NYU Langone Hospitals,0 to 17,113,M,Other Race,Spanish/Hispanic,4,Emergency,Home or Self Care,2019,DIG001,INTESTINAL INFECTION,,,249,"OTHER GASTROENTERITIS, NAUSEA & VOMITING",06,DISEASES AND DISORDERS OF THE DIGESTIVE SYSTEM,2,Moderate,Minor,Medical,Medicaid,,,,,true,48983.87,13455.67
New York City,Manhattan,7002053,001463,NYU Langone Hospitals,30 to 49,104,F,Black/African American,Not Span/Hispanic,2,Emergency,Home or Self Care,2019,DIG022,NONINFECTIOUS GASTROENTERITIS,,,249,"OTHER GASTROENTERITIS, NAUSEA & VOMITING",06,DISEASES AND DISORDERS OF THE DIGESTIVE SYSTEM,3,Major,Major,Medical,Private Health Insurance,,,,,true,27626.19,8348.94
New York City,Manhattan,7002053,001463,NYU Langone Hospitals,50 to 69,112,M,Other Race,Spanish/Hispanic,2,Emergency,Home or Self Care,2019,DIG022,NONINFECTIOUS GASTROENTERITIS,,,249,"OTHER GASTROENTERITIS, NAUSEA & VOMITING",06,DISEASES AND DISORDERS OF THE DIGESTIVE SYSTEM,3,Major,Major,Medical,Medicare,,,,,true,46977.75,11706.81
New York City,Manhattan,7002053,001463,NYU Langone Hospitals,70 or Older,100,M,Other Race,Spanish/Hispanic,3,Emergency,Home w/ Home Health Services,2019,DIG022,NONINFECTIOUS GASTROENTERITIS,ESA001,HEMODIALYSIS,249,"OTHER GASTROENTERITIS, NAUSEA & VOMITING",06,DISEASES AND DISORDERS OF THE DIGESTIVE SYSTEM,3,Major,Major,Medical,Medicare,Medicaid,,,,true,86365.32,27157.86
New York City,Manhattan,7002053,001463,NYU Langone Hospitals,70 or Older,100,M,Other Race,Unknown,3,Emergency,Home or Self Care,2019,DIG022,NONINFECTIOUS GASTROENTERITIS,,,249,"OTHER GASTROENTERITIS, NAUSEA & VOMITING",06,DISEASES AND DISORDERS OF THE DIGESTIVE SYSTEM,2,Moderate,Moderate,Medical,Medicare,Blue Cross/Blue Shield,,,,true,45001.75,13326.72
New York City,Manhattan,7002053,001463,NYU Langone Hospitals,50 to 69,112,M,White,Not Span/Hispanic,1,Emergency,Home or Self Care,2019,DIG022,NONINFECTIOUS GASTROENTERITIS,,,249,"OTHER GASTROENTERITIS, NAUSEA & VOMITING",06,DISEASES AND DISORDERS OF THE DIGESTIVE SYSTEM,1,Minor,Minor,Medical,Private Health Insurance,,,,,true,35366.92,9654.07
New York City,Manhattan,7002053,001463,NYU Langone Hospitals,70 or Older,100,M,Other Race,Spanish/Hispanic,1,Emergency,Home w/ Home Health Services,2019,DIG001,INTESTINAL INFECTION,,,249,"OTHER GASTROENTERITIS, NAUSEA & VOMITING",06,DISEASES AND DISORDERS OF THE DIGESTIVE SYSTEM,3,Major,Major,Medical,Medicare,Medicaid,,,,true,17681.65,4923.4
New York City,Manhattan,7002053,001463,NYU Langone Hospitals,50 to 69,107,M,White,Not Span/Hispanic,2,Emergency,Home w/ Home Health Services,2019,DIG022,NONINFECTIOUS GASTROENTERITIS,,,249,"OTHER GASTROENTERITIS, NAUSEA & VOMITING",06,DISEASES AND DISORDERS OF THE DIGESTIVE SYSTEM,2,Moderate,Minor,Medical,Medicare,Medicare,,,,true,57324.65,18171.73
New York City,Manhattan,7002053,001463,NYU Langone Hospitals,0 to 17,112,F,White,Not Span/Hispanic,4,Emergency,Home or Self Care,2019,END011,FLUID AND ELECTROLYTE DISORDERS,OTR004,ISOLATION PROCEDURES,249,"OTHER GASTROENTERITIS, NAUSEA & VOMITING",06,DISEASES AND DISORDERS OF THE DIGESTIVE SYSTEM,2,Moderate,Moderate,Medical,Blue Cross/Blue Shield,,,,,true,39805.03,12494.13
New York City,Manhattan,7002053,001463,NYU Langone Hospitals,70 or Older,100,F,White,Not Span/Hispanic,2,Emergency,Home w/ Home Health Services,2019,DIG022,NONINFECTIOUS GASTROENTERITIS,,,249,"OTHER GASTROENTERITIS, NAUSEA & VOMITING",06,DISEASES AND DISORDERS OF THE DIGESTIVE SYSTEM,2,Moderate,Minor,Medical,Medicare,Medicare,,,,true,46782.86,16110.03
New York City,Manhattan,7002053,001463,NYU Langone Hospitals,50 to 69,100,F,White,Unknown,6,Emergency,Home or Self Care,2019,DIG001,INTESTINAL INFECTION,OTR004,ISOLATION PROCEDURES,249,"OTHER GASTROENTERITIS, NAUSEA & VOMITING",06,DISEASES AND DISORDERS OF THE DIGESTIVE SYSTEM,3,Major,Moderate,Medical,Medicaid,,,,,true,148301.08,29152.92
New York City,Manhattan,7002053,001463,NYU Langone Hospitals,70 or Older,100,F,White,Not Span/Hispanic,1,Emergency,Home w/ Home Health Services,2019,DIG022,NONINFECTIOUS GASTROENTERITIS,,,249,"OTHER GASTROENTERITIS, NAUSEA & VOMITING",06,DISEASES AND DISORDERS OF THE DIGESTIVE SYSTEM,3,Major,Major,Medical,Medicare,Medicare,,,,true,19241.27,4984.84
New York City,Manhattan,7002053,001463,NYU Langone Hospitals,18 to 29,112,F,Other Race,Spanish/Hispanic,13,Emergency,Home or Self Care,2019,SYM004,NAUSEA AND VOMITING,GIS017,GASTROSTOMY,249,"OTHER GASTROENTERITIS, NAUSEA & VOMITING",06,DISEASES AND DISORDERS OF THE DIGESTIVE SYSTEM,4,Extreme,Moderate,Medical,Private Health Insurance,,,,,true,144770.2,52240.88
New York City,Manhattan,7002053,001463,NYU Langone Hospitals,70 or Older,100,F,White,Not Span/Hispanic,4,Emergency,Skilled Nursing Home,2019,DIG022,NONINFECTIOUS GASTROENTERITIS,,,249,"OTHER GASTROENTERITIS, NAUSEA & VOMITING",06,DISEASES AND DISORDERS OF THE DIGESTIVE SYSTEM,3,Major,Moderate,Medical,Medicaid,,,,,true,45476.26,15743.82
New York City,Manhattan,7002053,001463,NYU Langone Hospitals,30 to 49,112,F,White,Not Span/Hispanic,2,Emergency,Home or Self Care,2019,SYM004,NAUSEA AND VOMITING,,,249,"OTHER GASTROENTERITIS, NAUSEA & VOMITING",06,DISEASES AND DISORDERS OF THE DIGESTIVE SYSTEM,3,Major,Moderate,Medical,Medicare,Medicaid,,,,false,24153.54,7529.04
New York City,Manhattan,7002053,001463,NYU Langone Hospitals,0 to 17,112,M,White,Not Span/Hispanic,1,Emergency,Home or Self Care,2019,DIG001,INTESTINAL INFECTION,OTR004,ISOLATION PROCEDURES,249,"OTHER GASTROENTERITIS, NAUSEA & VOMITING",06,DISEASES AND DISORDERS OF THE DIGESTIVE SYSTEM,2,Moderate,Moderate,Medical,Private Health Insurance,,,,,true,20554.78,4746.47
New York City,Manhattan,7002053,001463,NYU Langone Hospitals,70 or Older,100,F,Other Race,Unknown,1,Emergency,Home or Self Care,2019,DIG001,INTESTINAL INFECTION,,,249,"OTHER GASTROENTERITIS, NAUSEA & VOMITING",06,DISEASES AND DISORDERS OF THE DIGESTIVE SYSTEM,2,Moderate,Minor,Medical,Medicare,Blue Cross/Blue Shield,,,,true,27669.11,9211.7
New York City,Manhattan,7002053,001463,NYU Langone Hospitals,18 to 29,112,M,White,Not Span/Hispanic,2,Emergency,Home or Self Care,2019,DIG001,INTESTINAL INFECTION,GIS004,GI SYSTEM ENDOSCOPY WITHOUT BIOPSY (DIAGNOSTIC),249,"OTHER GASTROENTERITIS, NAUSEA & VOMITING",06,DISEASES AND DISORDERS OF THE DIGESTIVE SYSTEM,3,Major,Minor,Medical,Blue Cross/Blue Shield,,,,,true,73406.72,14976.96
New York City,Manhattan,7002053,001463,NYU Langone Hospitals,50 to 69,115,M,White,Not Span/Hispanic,8,Emergency,Home or Self Care,2019,DIG022,NONINFECTIOUS GASTROENTERITIS,GIS002,COLONOSCOPY AND PROCTOSCOPY WITH BIOPSY,249,"OTHER GASTROENTERITIS, NAUSEA & VOMITING",06,DISEASES AND DISORDERS OF THE DIGESTIVE SYSTEM,3,Major,Major,Medical,Medicare,Medicare,,,,true,133434.46,33332.54
New York City,Manhattan,7002053,001463,NYU Langone Hospitals,70 or Older,OOS,F,Black/African American,Not Span/Hispanic,2,Emergency,Home or Self Care,2019,DIG022,NONINFECTIOUS GASTROENTERITIS,GIS002,COLONOSCOPY AND PROCTOSCOPY WITH BIOPSY,249,"OTHER GASTROENTERITIS, NAUSEA & VOMITING",06,DISEASES AND DISORDERS OF THE DIGESTIVE SYSTEM,3,Major,Moderate,Medical,Medicare,Medicare,,,,true,67217.58,18451.5
New York City,Manhattan,7002053,001463,NYU Langone Hospitals,70 or Older,100,F,White,Not Span/Hispanic,1,Emergency,Home w/ Home Health Services,2019,DIG022,NONINFECTIOUS GASTROENTERITIS,,,249,"OTHER GASTROENTERITIS, NAUSEA & VOMITING",06,DISEASES AND DISORDERS OF THE DIGESTIVE SYSTEM,3,Major,Major,Medical,Medicaid,,,,,true,33349.3,9671.91
New York City,Manhattan,7002053,001463,NYU Langone Hospitals,50 to 69,100,F,White,Not Span/Hispanic,6,Emergency,Home w/ Home Health Services,2019,END011,FLUID AND ELECTROLYTE DISORDERS,OTR004,ISOLATION PROCEDURES,249,"OTHER GASTROENTERITIS, NAUSEA & VOMITING",06,DISEASES AND DISORDERS OF THE DIGESTIVE SYSTEM,2,Moderate,Minor,Medical,Medicare,Blue Cross/Blue Shield,,,,true,72341.44,21452.82
New York City,Manhattan,7002053,001463,NYU Langone Hospitals,30 to 49,112,F,White,Not Span/Hispanic,2,Emergency,Home or Self Care,2019,SYM004,NAUSEA AND VOMITING,,,249,"OTHER GASTROENTERITIS, NAUSEA & VOMITING",06,DISEASES AND DISORDERS OF THE DIGESTIVE SYSTEM,3,Major,Moderate,Medical,Medicare,Medicaid,,,,false,29037.27,7944.51
New York City,Manhattan,7002053,001463,NYU Langone Hospitals,0 to 17,112,M,White,Not Span/Hispanic,2,Emergency,Home or Self Care,2019,END011,FLUID AND ELECTROLYTE DISORDERS,,,249,"OTHER GASTROENTERITIS, NAUSEA & VOMITING",06,DISEASES AND DISORDERS OF THE DIGESTIVE SYSTEM,2,Moderate,Minor,Medical,Private Health Insurance,,,,,true,29717.48,7669.14
New York City,Manhattan,7002053,001463,NYU Langone Hospitals,50 to 69,100,M,White,Not Span/Hispanic,1,Emergency,Home or Self Care,2019,DIG001,INTESTINAL INFECTION,,,249,"OTHER GASTROENTERITIS, NAUSEA & VOMITING",06,DISEASES AND DISORDERS OF THE DIGESTIVE SYSTEM,2,Moderate,Minor,Medical,Private Health Insurance,,,,,true,29070.51,9163.43
New York City,Manhattan,7002053,001463,NYU Langone Hospitals,70 or Older,112,F,Other Race,Unknown,2,Emergency,Home w/ Home Health Services,2019,DIG001,INTESTINAL INFECTION,OTR004,ISOLATION PROCEDURES,249,"OTHER GASTROENTERITIS, NAUSEA & VOMITING",06,DISEASES AND DISORDERS OF THE DIGESTIVE SYSTEM,3,Major,Major,Medical,Medicare,Medicaid,,,,true,39724.25,10192.52
New York City,Manhattan,7002053,001463,NYU Langone Hospitals,0 to 17,112,M,Other Race,Not Span/Hispanic,1,Emergency,Home or Self Care,2019,END011,FLUID AND ELECTROLYTE DISORDERS,OTR004,ISOLATION PROCEDURES,249,"OTHER GASTROENTERITIS, NAUSEA & VOMITING",06,DISEASES AND DISORDERS OF THE DIGESTIVE SYSTEM,2,Moderate,Minor,Medical,Medicaid,,,,,true,21230.49,4865.59
New York City,Manhattan,7002053,001463,NYU Langone Hospitals,18 to 29,100,M,Other Race,Spanish/Hispanic,7,Emergency,Home or Self Care,2019,DIG001,INTESTINAL INFECTION,ESA001,HEMODIALYSIS,249,"OTHER GASTROENTERITIS, NAUSEA & VOMITING",06,DISEASES AND DISORDERS OF THE DIGESTIVE SYSTEM,3,Major,Major,Medical,Blue Cross/Blue Shield,Medicaid,,,,true,92788.5,34100.12
New York City,Manhattan,7002053,001463,NYU Langone Hospitals,50 to 69,OOS,M,Other Race,Not Span/Hispanic,3,Emergency,Home or Self Care,2019,DIG001,INTESTINAL INFECTION,OTR004,ISOLATION PROCEDURES,249,"OTHER GASTROENTERITIS, NAUSEA & VOMITING",06,DISEASES AND DISORDERS OF THE DIGESTIVE SYSTEM,2,Moderate,Minor,Medical,Blue Cross/Blue Shield,,,,,true,63569.07,17576.01
New York City,Manhattan,7002053,001463,NYU Langone Hospitals,0 to 17,112,F,Other Race,Spanish/Hispanic,13,Emergency,Home or Self Care,2019,DIG022,NONINFECTIOUS GASTROENTERITIS,GIS004,GI SYSTEM ENDOSCOPY WITHOUT BIOPSY (DIAGNOSTIC),249,"OTHER GASTROENTERITIS, NAUSEA & VOMITING",06,DISEASES AND DISORDERS OF THE DIGESTIVE SYSTEM,2,Moderate,Minor,Medical,Medicaid,,,,,true,175885.65,44314.93
New York City,Manhattan,7002053,001463,NYU Langone Hospitals,50 to 69,100,M,White,Not Span/Hispanic,7,Emergency,Home or Self Care,2019,DIG001,INTESTINAL INFECTION,GIS001,ESOPHAGOGASTRODUODENOSCOPY (EGD) WITH BIOPSY,249,"OTHER GASTROENTERITIS, NAUSEA & VOMITING",06,DISEASES AND DISORDERS OF THE DIGESTIVE SYSTEM,2,Moderate,Minor,Medical,Private Health Insurance,,,,,true,126147.27,37075.62
New York City,Manhattan,7002053,001463,NYU Langone Hospitals,30 to 49,OOS,F,Multi-racial,Spanish/Hispanic,2,Emergency,Home or Self Care,2019,SYM004,NAUSEA AND VOMITING,GIS004,GI SYSTEM ENDOSCOPY WITHOUT BIOPSY (DIAGNOSTIC),249,"OTHER GASTROENTERITIS, NAUSEA & VOMITING",06,DISEASES AND DISORDERS OF THE DIGESTIVE SYSTEM,2,Moderate,Minor,Medical,Private Health Insurance,,,,,true,65746.78,16966.61
New York City,Manhattan,7002053,001463,NYU Langone Hospitals,50 to 69,OOS,M,White,Not Span/Hispanic,1,Emergency,Home or Self Care,2019,END011,FLUID AND ELECTROLYTE DISORDERS,ENT013,ENT REPAIR,249,"OTHER GASTROENTERITIS, NAUSEA & VOMITING",06,DISEASES AND DISORDERS OF THE DIGESTIVE SYSTEM,1,Minor,Minor,Medical,Blue Cross/Blue Shield,,,,,true,26527.04,6187.36
New York City,Manhattan,7002053,001463,NYU Langone Hospitals,0 to 17,100,F,Black/African American,Not Span/Hispanic,3,Emergency,Home or Self Care,2019,DIG022,NONINFECTIOUS GASTROENTERITIS,,,249,"OTHER GASTROENTERITIS, NAUSEA & VOMITING",06,DISEASES AND DISORDERS OF THE DIGESTIVE SYSTEM,3,Major,Moderate,Medical,Private Health Insurance,Medicaid,,,,true,70907.32,12122.5
New York City,Manhattan,7002053,001463,NYU Langone Hospitals,70 or Older,113,M,White,Not Span/Hispanic,1,Emergency,Home w/ Home Health Services,2019,SYM006,ABDOMINAL PAIN AND OTHER DIGESTIVE/ABDOMEN SIGNS AND SYMPTOMS,,,249,"OTHER GASTROENTERITIS, NAUSEA & VOMITING",06,DISEASES AND DISORDERS OF THE DIGESTIVE SYSTEM,2,Moderate,Moderate,Medical,Medicare,Medicare,,,,true,30850.32,9488.35
New York City,Manhattan,7002053,001463,NYU Langone Hospitals,50 to 69,112,M,White,Not Span/Hispanic,8,Emergency,Home or Self Care,2019,END011,FLUID AND ELECTROLYTE DISORDERS,,,249,"OTHER GASTROENTERITIS, NAUSEA & VOMITING",06,DISEASES AND DISORDERS OF THE DIGESTIVE SYSTEM,3,Major,Major,Medical,Medicare,Blue Cross/Blue Shield,,,,true,91521.95,31531.21
New York City,Manhattan,7002053,001463,NYU Langone Hospitals,30 to 49,100,F,White,Not Span/Hispanic,1,Emergency,Home or Self Care,2019,DIG022,NONINFECTIOUS GASTROENTERITIS,GIS002,COLONOSCOPY AND PROCTOSCOPY WITH BIOPSY,249,"OTHER GASTROENTERITIS, NAUSEA & VOMITING",06,DISEASES AND DISORDERS OF THE DIGESTIVE SYSTEM,2,Moderate,Minor,Medical,Private Health Insurance,,,,,true,42186.55,8502.33
New York City,Manhattan,7002053,001463,NYU Langone Hospitals,50 to 69,100,F,White,Not Span/Hispanic,1,Emergency,Home or Self Care,2019,DIG001,INTESTINAL INFECTION,,,249,"OTHER GASTROENTERITIS, NAUSEA & VOMITING",06,DISEASES AND DISORDERS OF THE DIGESTIVE SYSTEM,2,Moderate,Minor,Medical,Private Health Insurance,,,,,true,16394.29,4664.12
New York City,Manhattan,7002053,001463,NYU Langone Hospitals,70 or Older,100,F,Other Race,Not Span/Hispanic,1,Emergency,Home or Self Care,2019,DIG001,INTESTINAL INFECTION,,,249,"OTHER GASTROENTERITIS, NAUSEA & VOMITING",06,DISEASES AND DISORDERS OF THE DIGESTIVE SYSTEM,1,Minor,Minor,Medical,Medicare,Private Health Insurance,,,,true,27295.4,8065.87