Hospital Service Area,Hospital County,Operating Certificate Number,Permanent Facility Id,Facility Name,Age Group,Zip Code - 3 digits,Gender,Race,Ethnicity,Length of Stay,Type of Admission,Patient Disposition,Discharge Year,CCS Diagnosis Code,CCS Diagnosis Description,CCS Procedure Code,CCS Procedure Description,APR DRG Code,APR DRG Description,APR MDC Code,APR MDC Description,APR Severity of Illness Code,APR Severity of Illness Description,APR Risk of Mortality,APR Medical Surgical Description,Payment Typology 1,Payment Typology 2,Payment Typology 3,Birth Weight,Abortion Edit Indicator,Emergency Department Indicator,Total Charges,Total Costs
New York City,Kings,7002053,001304,NYU Langone Hospital-Brooklyn,0 to 17,112,M,Other Race,Unknown,1,Emergency,Home or Self Care,2020,SYM004,NAUSEA AND VOMITING,,,249,"OTHER GASTROENTERITIS, NAUSEA & VOMITING",06,DISEASES AND DISORDERS OF THE DIGESTIVE SYSTEM,1,Minor,Minor,Medical,Medicaid,,,,,Y,11845.11,3881.91
New York City,Kings,7002053,001304,NYU Langone Hospital-Brooklyn,0 to 17,,F,White,Unknown,1,Emergency,Home or Self Care,2020,END011,FLUID AND ELECTROLYTE DISORDERS,,,249,"OTHER GASTROENTERITIS, NAUSEA & VOMITING",06,DISEASES AND DISORDERS OF THE DIGESTIVE SYSTEM,2,Moderate,Moderate,Medical,Medicaid,,,,,Y,12949.21,3069.45
New York City,Kings,7002053,001304,NYU Langone Hospital-Brooklyn,50 to 69,112,F,Other Race,Spanish/Hispanic,1,Emergency,Home or Self Care,2020,DIG022,NONINFECTIOUS GASTROENTERITIS,,,249,"OTHER GASTROENTERITIS, NAUSEA & VOMITING",06,DISEASES AND DISORDERS OF THE DIGESTIVE SYSTEM,1,Minor,Minor,Medical,Medicare,Blue Cross/Blue Shield,,,,Y,49863.71,13369.95
New York City,Kings,7002053,001304,NYU Langone Hospital-Brooklyn,70 or Older,112,F,White,Not Span/Hispanic,5,Emergency,Skilled Nursing Home,2020,DIG022,NONINFECTIOUS GASTROENTERITIS,IMG006,COMPUTERIZED TOMOGRAPHY (CT) WITH CONTRAST,249,"OTHER GASTROENTERITIS, NAUSEA & VOMITING",06,DISEASES AND DISORDERS OF THE DIGESTIVE SYSTEM,2,Moderate,Major,Medical,Medicare,Blue Cross/Blue Shield,,,,Y,52127.56,17617.47
New York City,Kings,7002053,001304,NYU Langone Hospital-Brooklyn,70 or Older,112,F,White,Not Span/Hispanic,2,Emergency,Home or Self Care,2020,END011,FLUID AND ELECTROLYTE DISORDERS,,,249,"OTHER GASTROENTERITIS, NAUSEA & VOMITING",06,DISEASES AND DISORDERS OF THE DIGESTIVE SYSTEM,3,Major,Major,Medical,Medicare,Private Health Insurance,,,,Y,61984.82,17758.25
New York City,Kings,7002053,001304,NYU Langone Hospital-Brooklyn,0 to 17,112,M,White,Spanish/Hispanic,1,Emergency,Home or Self Care,2020,DIG022,NONINFECTIOUS GASTROENTERITIS,,,249,"OTHER GASTROENTERITIS, NAUSEA & VOMITING",06,DISEASES AND DISORDERS OF THE DIGESTIVE SYSTEM,2,Moderate,Minor,Medical,Medicaid,,,,,Y,12743.01,3064.38
New York City,Kings,7002053,001304,NYU Langone Hospital-Brooklyn,0 to 17,112,M,Other Race,Spanish/Hispanic,1,Emergency,Home or Self Care,2020,DIG001,INTESTINAL INFECTION,,,249,"OTHER GASTROENTERITIS, NAUSEA & VOMITING",06,DISEASES AND DISORDERS OF THE DIGESTIVE SYSTEM,1,Minor,Minor,Medical,Medicaid,,,,,Y,14933.3,3321.56
New York City,Kings,7002053,001304,NYU Langone Hospital-Brooklyn,0 to 17,112,M,White,Not Span/Hispanic,1,Emergency,Home or Self Care,2020,DIG001,INTESTINAL INFECTION,IMG008,ULTRASONOGRAPHY,249,"OTHER GASTROENTERITIS, NAUSEA & VOMITING",06,DISEASES AND DISORDERS OF THE DIGESTIVE SYSTEM,2,Moderate,Minor,Medical,Private Health Insurance,,,,,Y,14912.2,4242.66
New York City,Kings,7002053,001304,NYU Langone Hospital-Brooklyn,70 or Older,112,F,White,Not Span/Hispanic,3,Emergency,Home w/ Home Health Services,2020,DIG001,INTESTINAL INFECTION,,,249,"OTHER GASTROENTERITIS, NAUSEA & VOMITING",06,DISEASES AND DISORDERS OF THE DIGESTIVE SYSTEM,3,Major,Moderate,Medical,Private Health Insurance,Medicaid,,,,Y,34133.94,10780.38
New York City,Kings,7002053,001304,NYU Langone Hospital-Brooklyn,70 or Older,112,F,White,Not Span/Hispanic,1,Emergency,Home w/ Home Health Services,2020,DIG022,NONINFECTIOUS GASTROENTERITIS,,,249,"OTHER GASTROENTERITIS, NAUSEA & VOMITING",06,DISEASES AND DISORDERS OF THE DIGESTIVE SYSTEM,2,Moderate,Major,Medical,Medicare,Medicaid,,,,Y,44392.92,12677.37
New York City,Kings,7002053,001304,NYU Langone Hospital-Brooklyn,70 or Older,112,F,White,Not Span/Hispanic,6,Emergency,Skilled Nursing Home,2020,DIG022,NONINFECTIOUS GASTROENTERITIS,ESA004,NON-INVASIVE VENTILATION,249,"OTHER GASTROENTERITIS, NAUSEA & VOMITING",06,DISEASES AND DISORDERS OF THE DIGESTIVE SYSTEM,3,Major,Major,Medical,Medicare,Medicaid,,,,Y,106634.37,25315.08
New York City,Kings,7002053,001304,NYU Langone Hospital-Brooklyn,30 to 49,112,F,White,Not Span/Hispanic,4,Emergency,Home or Self Care,2020,DIG001,INTESTINAL INFECTION,,,249,"OTHER GASTROENTERITIS, NAUSEA & VOMITING",06,DISEASES AND DISORDERS OF THE DIGESTIVE SYSTEM,2,Moderate,Moderate,Medical,Private Health Insurance,,,,,Y,55062.23,15610.61
New York City,Kings,7002053,001304,NYU Langone Hospital-Brooklyn,50 to 69,112,F,White,Not Span/Hispanic,1,Emergency,Home or Self Care,2020,DIG001,INTESTINAL INFECTION,,,249,"OTHER GASTROENTERITIS, NAUSEA & VOMITING",06,DISEASES AND DISORDERS OF THE DIGESTIVE SYSTEM,2,Moderate,Major,Medical,Blue Cross/Blue Shield,,,,,Y,51907.35,13060.97
New York City,Kings,7002053,001304,NYU Langone Hospital-Brooklyn,70 or Older,112,M,White,Not Span/Hispanic,1,Emergency,Home or Self Care,2020,DIG001,INTESTINAL INFECTION,ADM015,ADMINISTRATION OF ANTIBIOTICS,249,"OTHER GASTROENTERITIS, NAUSEA & VOMITING",06,DISEASES AND DISORDERS OF THE DIGESTIVE SYSTEM,2,Moderate,Major,Medical,Blue Cross/Blue Shield,,,,,Y,40842.02,9337.34
New York City,Kings,7002053,001304,NYU Langone Hospital-Brooklyn,30 to 49,112,M,White,Not Span/Hispanic,1,Emergency,Home or Self Care,2020,SYM004,NAUSEA AND VOMITING,OTR004,ISOLATION PROCEDURES,249,"OTHER GASTROENTERITIS, NAUSEA & VOMITING",06,DISEASES AND DISORDERS OF THE DIGESTIVE SYSTEM,2,Moderate,Moderate,Medical,Medicare,Medicaid,,,,Y,46931.09,12891.47
New York City,Kings,7002053,001304,NYU Langone Hospital-Brooklyn,0 to 17,112,F,Other Race,Not Span/Hispanic,2,Emergency,Home or Self Care,2020,DIG001,INTESTINAL INFECTION,,,249,"OTHER GASTROENTERITIS, NAUSEA & VOMITING",06,DISEASES AND DISORDERS OF THE DIGESTIVE SYSTEM,2,Moderate,Moderate,Medical,Medicaid,,,,,Y,17817.24,5026.18
New York City,Kings,7002053,001304,NYU Langone Hospital-Brooklyn,70 or Older,112,F,Other Race,Not Span/Hispanic,3,Emergency,Home w/ Home Health Services,2020,DIG022,NONINFECTIOUS GASTROENTERITIS,GIS002,COLONOSCOPY AND PROCTOSCOPY WITH BIOPSY,249,"OTHER GASTROENTERITIS, NAUSEA & VOMITING",06,DISEASES AND DISORDERS OF THE DIGESTIVE SYSTEM,2,Moderate,Moderate,Medical,Medicare,Medicaid,,,,Y,74241.79,15225.39
New York City,Kings,7002053,001304,NYU Langone Hospital-Brooklyn,18 to 29,112,F,Other Race,Spanish/Hispanic,1,Emergency,Home or Self Care,2020,SYM004,NAUSEA AND VOMITING,ADM021,"ADMINISTRATION OF THERAPEUTIC SUBSTANCES, NEC",249,"OTHER GASTROENTERITIS, NAUSEA & VOMITING",06,DISEASES AND DISORDERS OF THE DIGESTIVE SYSTEM,1,Minor,Minor,Medical,Private Health Insurance,,,,,Y,25993.39,7616.39
New York City,Kings,7002053,001304,NYU Langone Hospital-Brooklyn,50 to 69,112,F,Other Race,Spanish/Hispanic,1,Emergency,Home w/ Home Health Services,2020,DIG001,INTESTINAL INFECTION,ADM015,ADMINISTRATION OF ANTIBIOTICS,249,"OTHER GASTROENTERITIS, NAUSEA & VOMITING",06,DISEASES AND DISORDERS OF THE DIGESTIVE SYSTEM,2,Moderate,Minor,Medical,Medicaid,,,,,Y,42992.59,9705.74
New York City,Kings,7002053,001304,NYU Langone Hospital-Brooklyn,30 to 49,112,M,Other Race,Not Span/Hispanic,2,Emergency,Home or Self Care,2020,DIG001,INTESTINAL INFECTION,,,249,"OTHER GASTROENTERITIS, NAUSEA & VOMITING",06,DISEASES AND DISORDERS OF THE DIGESTIVE SYSTEM,2,Moderate,Moderate,Medical,Private Health Insurance,,,,,Y,39213.62,9127.03
New York City,Kings,7002053,001304,NYU Langone Hospital-Brooklyn,50 to 69,112,F,Black/African American,Not Span/Hispanic,4,Emergency,Home or Self Care,2020,DIG022,NONINFECTIOUS GASTROENTERITIS,GIS016,GI SYSTEM ENDOSCOPIC THERAPEUTIC PROCEDURES,249,"OTHER GASTROENTERITIS, NAUSEA & VOMITING",06,DISEASES AND DISORDERS OF THE DIGESTIVE SYSTEM,1,Minor,Minor,Medical,Medicare,Medicaid,,,,Y,106402.46,24256.17
New York City,Kings,7002053,001304,NYU Langone Hospital-Brooklyn,50 to 69,112,M,Other Race,Spanish/Hispanic,1,Emergency,Home or Self Care,2020,DIG001,INTESTINAL INFECTION,ADM015,ADMINISTRATION OF ANTIBIOTICS,249,"OTHER GASTROENTERITIS, NAUSEA & VOMITING",06,DISEASES AND DISORDERS OF THE DIGESTIVE SYSTEM,2,Moderate,Moderate,Medical,Private Health Insurance,,,,,Y,50275.34,12742.48
New York City,Kings,7002053,001304,NYU Langone Hospital-Brooklyn,0 to 17,112,M,Other Race,Spanish/Hispanic,1,Emergency,Home or Self Care,2020,SYM004,NAUSEA AND VOMITING,,,249,"OTHER GASTROENTERITIS, NAUSEA & VOMITING",06,DISEASES AND DISORDERS OF THE DIGESTIVE SYSTEM,1,Minor,Minor,Medical,Medicaid,,,,,Y,26540.09,4940.53
New York City,Kings,7002053,001304,NYU Langone Hospital-Brooklyn,30 to 49,112,F,White,Not Span/Hispanic,2,Emergency,Home or Self Care,2020,DIG001,INTESTINAL INFECTION,OTR004,ISOLATION PROCEDURES,249,"OTHER GASTROENTERITIS, NAUSEA & VOMITING",06,DISEASES AND DISORDERS OF THE DIGESTIVE SYSTEM,1,Minor,Minor,Medical,Private Health Insurance,,,,,Y,52046.73,14072.22
New York City,Kings,7002053,001304,NYU Langone Hospital-Brooklyn,18 to 29,112,M,Other Race,Spanish/Hispanic,1,Emergency,Home or Self Care,2020,DIG022,NONINFECTIOUS GASTROENTERITIS,ADM021,"ADMINISTRATION OF THERAPEUTIC SUBSTANCES, NEC",249,"OTHER GASTROENTERITIS, NAUSEA & VOMITING",06,DISEASES AND DISORDERS OF THE DIGESTIVE SYSTEM,2,Moderate,Minor,Medical,Blue Cross/Blue Shield,,,,,Y,20407.27,4838.42
New York City,Kings,7002053,001304,NYU Langone Hospital-Brooklyn,30 to 49,112,M,Black/African American,Unknown,1,Emergency,Home or Self Care,2020,DIG001,INTESTINAL INFECTION,,,249,"OTHER GASTROENTERITIS, NAUSEA & VOMITING",06,DISEASES AND DISORDERS OF THE DIGESTIVE SYSTEM,2,Moderate,Moderate,Medical,Medicaid,,,,,Y,26682.75,5570.17
New York City,Kings,7002053,001304,NYU Langone Hospital-Brooklyn,50 to 69,112,F,White,Not Span/Hispanic,1,Emergency,Home or Self Care,2020,SYM006,ABDOMINAL PAIN AND OTHER DIGESTIVE/ABDOMEN SIGNS AND SYMPTOMS,,,249,"OTHER GASTROENTERITIS, NAUSEA & VOMITING",06,DISEASES AND DISORDERS OF THE DIGESTIVE SYSTEM,1,Minor,Minor,Medical,Medicare,Medicaid,,,,Y,32591.34,6023.1
New York City,Kings,7002053,001304,NYU Langone Hospital-Brooklyn,70 or Older,112,F,Other Race,Spanish/Hispanic,4,Emergency,Home or Self Care,2020,DIG001,INTESTINAL INFECTION,ADM001,TRANSFUSION OF BLOOD AND BLOOD PRODUCTS,249,"OTHER GASTROENTERITIS, NAUSEA & VOMITING",06,DISEASES AND DISORDERS OF THE DIGESTIVE SYSTEM,4,Extreme,Major,Medical,Medicare,,,,,Y,50016.19,15180.73
New York City,Kings,7002053,001304,NYU Langone Hospital-Brooklyn,30 to 49,103,M,White,Not Span/Hispanic,5,Emergency,Left Against Medical Advice,2020,DIG022,NONINFECTIOUS GASTROENTERITIS,,,249,"OTHER GASTROENTERITIS, NAUSEA & VOMITING",06,DISEASES AND DISORDERS OF THE DIGESTIVE SYSTEM,2,Moderate,Minor,Medical,Medicare,Medicaid,,,,Y,68100.59,18776.24
New York City,Kings,7002053,001304,NYU Langone Hospital-Brooklyn,50 to 69,112,F,Black/African American,Not Span/Hispanic,1,Emergency,Home or Self Care,2020,DIG001,INTESTINAL INFECTION,,,249,"OTHER GASTROENTERITIS, NAUSEA & VOMITING",06,DISEASES AND DISORDERS OF THE DIGESTIVE SYSTEM,2,Moderate,Minor,Medical,Private Health Insurance,,,,,Y,35784.36,8010.26
New York City,Kings,7002053,001304,NYU Langone Hospital-Brooklyn,0 to 17,112,M,Other Race,Unknown,1,Emergency,Home or Self Care,2020,DIG001,INTESTINAL INFECTION,,,249,"OTHER GASTROENTERITIS, NAUSEA & VOMITING",06,DISEASES AND DISORDERS OF THE DIGESTIVE SYSTEM,2,Moderate,Moderate,Medical,Medicaid,,,,,Y,12540.38,3034.09
New York City,Kings,7002053,001304,NYU Langone Hospital-Brooklyn,50 to 69,112,M,Other Race,Spanish/Hispanic,1,Emergency,Home or Self Care,2020,END011,FLUID AND ELECTROLYTE DISORDERS,,,249,"OTHER GASTROENTERITIS, NAUSEA & VOMITING",06,DISEASES AND DISORDERS OF THE DIGESTIVE SYSTEM,1,Minor,Minor,Medical,Medicare,,,,,Y,30443.7,7028.07
New York City,Kings,7002053,001304,NYU Langone Hospital-Brooklyn,0 to 17,112,F,Other Race,Spanish/Hispanic,1,Emergency,Home or Self Care,2020,DIG022,NONINFECTIOUS GASTROENTERITIS,,,249,"OTHER GASTROENTERITIS, NAUSEA & VOMITING",06,DISEASES AND DISORDERS OF THE DIGESTIVE SYSTEM,1,Minor,Minor,Medical,Medicaid,,,,,Y,13173.1,3100.29
New York City,Kings,7002053,001304,NYU Langone Hospital-Brooklyn,70 or Older,112,F,White,Not Span/Hispanic,2,Emergency,Home or Self Care,2020,SYM004,NAUSEA AND VOMITING,,,249,"OTHER GASTROENTERITIS, NAUSEA & VOMITING",06,DISEASES AND DISORDERS OF THE DIGESTIVE SYSTEM,2,Moderate,Moderate,Medical,Medicare,Medicare,,,,Y,35230.57,8593.34
New York City,Kings,7002053,001304,NYU Langone Hospital-Brooklyn,0 to 17,112,F,White,Spanish/Hispanic,1,Emergency,Home or Self Care,2020,DIG001,INTESTINAL INFECTION,IMG008,ULTRASONOGRAPHY,249,"OTHER GASTROENTERITIS, NAUSEA & VOMITING",06,DISEASES AND DISORDERS OF THE DIGESTIVE SYSTEM,1,Minor,Minor,Medical,Medicaid,,,,,Y,16542.51,3493.24
New York City,Kings,7002053,001304,NYU Langone Hospital-Brooklyn,30 to 49,112,F,Black/African American,Not Span/Hispanic,1,Emergency,Home or Self Care,2020,SYM004,NAUSEA AND VOMITING,,,249,"OTHER GASTROENTERITIS, NAUSEA & VOMITING",06,DISEASES AND DISORDERS OF THE DIGESTIVE SYSTEM,2,Moderate,Minor,Medical,Medicaid,,,,,Y,37120.75,9884.93
New York City,Kings,7002053,001304,NYU Langone Hospital-Brooklyn,30 to 49,112,M,Other Race,Not Span/Hispanic,3,Emergency,Home or Self Care,2020,SYM004,NAUSEA AND VOMITING,,,249,"OTHER GASTROENTERITIS, NAUSEA & VOMITING",06,DISEASES AND DISORDERS OF THE DIGESTIVE SYSTEM,2,Moderate,Minor,Medical,Medicaid,,,,,Y,52306.82,13962
New York City,Kings,7002053,001304,NYU Langone Hospital-Brooklyn,70 or Older,112,F,Other Race,Spanish/Hispanic,2,Emergency,Home or Self Care,2020,DIG001,INTESTINAL INFECTION,OTR004,ISOLATION PROCEDURES,249,"OTHER GASTROENTERITIS, NAUSEA & VOMITING",06,DISEASES AND DISORDERS OF THE DIGESTIVE SYSTEM,2,Moderate,Moderate,Medical,Medicare,,,,,Y,41061.46,9027.52
New York City,Kings,7002053,001304,NYU Langone Hospital-Brooklyn,70 or Older,112,F,Other Race,Spanish/Hispanic,1,Emergency,Home or Self Care,2020,DIG001,INTESTINAL INFECTION,OTR004,ISOLATION PROCEDURES,249,"OTHER GASTROENTERITIS, NAUSEA & VOMITING",06,DISEASES AND DISORDERS OF THE DIGESTIVE SYSTEM,2,Moderate,Moderate,Medical,Medicare,,,,,Y,23471.92,4992.09
New York City,Kings,7002053,001304,NYU Langone Hospital-Brooklyn,0 to 17,112,F,Other Race,Not Span/Hispanic,5,Emergency,Home or Self Care,2020,DIG001,INTESTINAL INFECTION,,,249,"OTHER GASTROENTERITIS, NAUSEA & VOMITING",06,DISEASES AND DISORDERS OF THE DIGESTIVE SYSTEM,2,Moderate,Minor,Medical,Self-Pay,,,,,Y,50174.68,11561.88
New York City,Kings,7002053,001304,NYU Langone Hospital-Brooklyn,70 or Older,112,F,White,Unknown,2,Emergency,Skilled Nursing Home,2020,DIG022,NONINFECTIOUS GASTROENTERITIS,,,249,"OTHER GASTROENTERITIS, NAUSEA & VOMITING",06,DISEASES AND DISORDERS OF THE DIGESTIVE SYSTEM,3,Major,Moderate,Medical,Medicare,,,,,Y,73818.3,17168.62
New York City,Kings,7002053,001304,NYU Langone Hospital-Brooklyn,30 to 49,113,M,Other Race,Not Span/Hispanic,1,Emergency,Home or Self Care,2020,DIG022,NONINFECTIOUS GASTROENTERITIS,OTR004,ISOLATION PROCEDURES,249,"OTHER GASTROENTERITIS, NAUSEA & VOMITING",06,DISEASES AND DISORDERS OF THE DIGESTIVE SYSTEM,2,Moderate,Moderate,Medical,Medicaid,,,,,Y,16326.8,4377.82
New York City,Kings,7002053,001304,NYU Langone Hospital-Brooklyn,18 to 29,112,F,Other Race,Not Span/Hispanic,2,Emergency,Home or Self Care,2020,DIG022,NONINFECTIOUS GASTROENTERITIS,OTR004,ISOLATION PROCEDURES,249,"OTHER GASTROENTERITIS, NAUSEA & VOMITING",06,DISEASES AND DISORDERS OF THE DIGESTIVE SYSTEM,2,Moderate,Minor,Medical,Private Health Insurance,,,,,Y,48000.39,9838.75
New York City,Kings,7002053,001304,NYU Langone Hospital-Brooklyn,70 or Older,112,F,White,Not Span/Hispanic,1,Emergency,Home or Self Care,2020,SYM006,ABDOMINAL PAIN AND OTHER DIGESTIVE/ABDOMEN SIGNS AND SYMPTOMS,GIS006,PARACENTESIS,249,"OTHER GASTROENTERITIS, NAUSEA & VOMITING",06,DISEASES AND DISORDERS OF THE DIGESTIVE SYSTEM,3,Major,Major,Medical,Medicare,Medicaid,,,,Y,26276.94,5447.99
New York City,Kings,7002053,001304,NYU Langone Hospital-Brooklyn,50 to 69,112,F,White,Not Span/Hispanic,14,Emergency,Home w/ Home Health Services,2020,DIG001,INTESTINAL INFECTION,GIS002,COLONOSCOPY AND PROCTOSCOPY WITH BIOPSY,249,"OTHER GASTROENTERITIS, NAUSEA & VOMITING",06,DISEASES AND DISORDERS OF THE DIGESTIVE SYSTEM,4,Extreme,Extreme,Medical,Medicare,Medicaid,,,,Y,271636.8,63796.87
New York City,Kings,7002053,001304,NYU Langone Hospital-Brooklyn,30 to 49,112,F,White,Spanish/Hispanic,1,Emergency,Home or Self Care,2020,SYM004,NAUSEA AND VOMITING,ADM021,"ADMINISTRATION OF THERAPEUTIC SUBSTANCES, NEC",249,"OTHER GASTROENTERITIS, NAUSEA & VOMITING",06,DISEASES AND DISORDERS OF THE DIGESTIVE SYSTEM,2,Moderate,Moderate,Medical,Private Health Insurance,,,,,Y,18279.45,4508.16
New York City,Kings,7002053,001304,NYU Langone Hospital-Brooklyn,0 to 17,112,M,White,Not Span/Hispanic,2,Emergency,Home or Self Care,2020,DIG001,INTESTINAL INFECTION,OTR004,ISOLATION PROCEDURES,249,"OTHER GASTROENTERITIS, NAUSEA & VOMITING",06,DISEASES AND DISORDERS OF THE DIGESTIVE SYSTEM,1,Minor,Minor,Medical,Medicaid,,,,,Y,24321.72,5643.68
New York City,Kings,7002053,001304,NYU Langone Hospital-Brooklyn,50 to 69,112,F,White,Not Span/Hispanic,4,Emergency,Home w/ Home Health Services,2020,DIG022,NONINFECTIOUS GASTROENTERITIS,OTR004,ISOLATION PROCEDURES,249,"OTHER GASTROENTERITIS, NAUSEA & VOMITING",06,DISEASES AND DISORDERS OF THE DIGESTIVE SYSTEM,3,Major,Moderate,Medical,Medicare,Medicaid,,,,Y,53401.14,15595.17
New York City,Kings,7002053,001304,NYU Langone Hospital-Brooklyn,0 to 17,112,F,Other Race,Not Span/Hispanic,4,Emergency,Home or Self Care,2020,DIG001,INTESTINAL INFECTION,,,249,"OTHER GASTROENTERITIS, NAUSEA & VOMITING",06,DISEASES AND DISORDERS OF THE DIGESTIVE SYSTEM,2,Moderate,Minor,Medical,Medicaid,,,,,Y,44169.85,10897.87
New York City,Kings,7002053,001304,NYU Langone Hospital-Brooklyn,70 or Older,112,F,White,Not Span/Hispanic,3,Emergency,Home or Self Care,2020,END011,FLUID AND ELECTROLYTE DISORDERS,,,249,"OTHER GASTROENTERITIS, NAUSEA & VOMITING",06,DISEASES AND DISORDERS OF THE DIGESTIVE SYSTEM,2,Moderate,Major,Medical,Medicare,Medicare,,,,Y,41692.22,11026.16
New York City,Kings,7002053,001304,NYU Langone Hospital-Brooklyn,70 or Older,OOS,M,White,Not Span/Hispanic,1,Emergency,Home or Self Care,2020,DIG001,INTESTINAL INFECTION,ADM021,"ADMINISTRATION OF THERAPEUTIC SUBSTANCES, NEC",249,"OTHER GASTROENTERITIS, NAUSEA & VOMITING",06,DISEASES AND DISORDERS OF THE DIGESTIVE SYSTEM,2,Moderate,Moderate,Medical,Medicare,,,,,Y,25927.89,5374.48
New York City,Kings,7002053,001304,NYU Langone Hospital-Brooklyn,18 to 29,112,F,Other Race,Not Span/Hispanic,3,Emergency,Home or Self Care,2020,SYM004,NAUSEA AND VOMITING,,,249,"OTHER GASTROENTERITIS, NAUSEA & VOMITING",06,DISEASES AND DISORDERS OF THE DIGESTIVE SYSTEM,2,Moderate,Moderate,Medical,Medicaid,,,,,Y,33431.47,10588.66
New York City,Kings,7002053,001304,NYU Langone Hospital-Brooklyn,50 to 69,112,F,White,Not Span/Hispanic,5,Emergency,Home or Self Care,2020,DIG022,NONINFECTIOUS GASTROENTERITIS,GIS006,PARACENTESIS,249,"OTHER GASTROENTERITIS, NAUSEA & VOMITING",06,DISEASES AND DISORDERS OF THE DIGESTIVE SYSTEM,3,Major,Major,Medical,Medicare,,,,,Y,71181.58,19543.14
New York City,Kings,7002053,001304,NYU Langone Hospital-Brooklyn,18 to 29,112,F,Other Race,Not Span/Hispanic,3,Emergency,Left Against Medical Advice,2020,SYM004,NAUSEA AND VOMITING,,,249,"OTHER GASTROENTERITIS, NAUSEA & VOMITING",06,DISEASES AND DISORDERS OF THE DIGESTIVE SYSTEM,2,Moderate,Minor,Medical,Medicaid,,,,,Y,35070.92,10809.93
New York City,Kings,7002053,001304,NYU Langone Hospital-Brooklyn,50 to 69,112,F,Other Race,Spanish/Hispanic,2,Emergency,Home or Self Care,2020,DIG022,NONINFECTIOUS GASTROENTERITIS,,,249,"OTHER GASTROENTERITIS, NAUSEA & VOMITING",06,DISEASES AND DISORDERS OF THE DIGESTIVE SYSTEM,2,Moderate,Minor,Medical,Medicaid,,,,,Y,48513.82,11978.97
New York City,Kings,7002053,001304,NYU Langone Hospital-Brooklyn,30 to 49,112,M,White,Not Span/Hispanic,3,Emergency,Home or Self Care,2020,DIG022,NONINFECTIOUS GASTROENTERITIS,GIS001,ESOPHAGOGASTRODUODENOSCOPY (EGD) WITH BIOPSY,249,"OTHER GASTROENTERITIS, NAUSEA & VOMITING",06,DISEASES AND DISORDERS OF THE DIGESTIVE SYSTEM,2,Moderate,Moderate,Medical,Private Health Insurance,,,,,Y,92536.53,21028.61
New York City,Kings,7002053,001304,NYU Langone Hospital-Brooklyn,30 to 49,112,F,Other Race,Spanish/Hispanic,1,Emergency,Home or Self Care,2020,DIG022,NONINFECTIOUS GASTROENTERITIS,,,249,"OTHER GASTROENTERITIS, NAUSEA & VOMITING",06,DISEASES AND DISORDERS OF THE DIGESTIVE SYSTEM,1,Minor,Minor,Medical,Blue Cross/Blue Shield,,,,,Y,26838.19,6541.22
New York City,Kings,7002053,001304,NYU Langone Hospital-Brooklyn,50 to 69,112,F,Other Race,Not Span/Hispanic,4,Emergency,Home w/ Home Health Services,2020,INF005,FOODBORNE INTOXICATIONS,,,249,"OTHER GASTROENTERITIS, NAUSEA & VOMITING",06,DISEASES AND DISORDERS OF THE DIGESTIVE SYSTEM,2,Moderate,Major,Medical,Medicaid,,,,,Y,68526.84,21431.55
New York City,Kings,7002053,001304,NYU Langone Hospital-Brooklyn,30 to 49,112,M,Other Race,Not Span/Hispanic,1,Emergency,Left Against Medical Advice,2020,DIG022,NONINFECTIOUS GASTROENTERITIS,GIS002,COLONOSCOPY AND PROCTOSCOPY WITH BIOPSY,249,"OTHER GASTROENTERITIS, NAUSEA & VOMITING",06,DISEASES AND DISORDERS OF THE DIGESTIVE SYSTEM,1,Minor,Minor,Medical,Blue Cross/Blue Shield,,,,,Y,56681.36,10271.32
New York City,Kings,7002053,001304,NYU Langone Hospital-Brooklyn,70 or Older,112,F,Other Race,Spanish/Hispanic,8,Emergency,Hospice - Home,2020,DIG001,INTESTINAL INFECTION,OTR004,ISOLATION PROCEDURES,249,"OTHER GASTROENTERITIS, NAUSEA & VOMITING",06,DISEASES AND DISORDERS OF THE DIGESTIVE SYSTEM,3,Major,Major,Medical,Medicare,,,,,Y,112316.97,39444.96
New York City,Kings,7002053,001304,NYU Langone Hospital-Brooklyn,70 or Older,112,F,White,Not Span/Hispanic,1,Emergency,Home w/ Home Health Services,2020,DIG001,INTESTINAL INFECTION,,,249,"OTHER GASTROENTERITIS, NAUSEA & VOMITING",06,DISEASES AND DISORDERS OF THE DIGESTIVE SYSTEM,2,Moderate,Moderate,Medical,Medicare,Medicare,,,,Y,29212.71,6554.27
New York City,Kings,7002053,001304,NYU Langone Hospital-Brooklyn,70 or Older,112,F,White,Not Span/Hispanic,4,Emergency,Home w/ Home Health Services,2020,SYM004,NAUSEA AND VOMITING,OTR004,ISOLATION PROCEDURES,249,"OTHER GASTROENTERITIS, NAUSEA & VOMITING",06,DISEASES AND DISORDERS OF THE DIGESTIVE SYSTEM,3,Major,Major,Medical,Medicare,Private Health Insurance,,,,Y,81912.15,21708.61
New York City,Kings,7002053,001304,NYU Langone Hospital-Brooklyn,70 or Older,112,F,White,Spanish/Hispanic,3,Emergency,Home or Self Care,2020,DIG022,NONINFECTIOUS GASTROENTERITIS,,,249,"OTHER GASTROENTERITIS, NAUSEA & VOMITING",06,DISEASES AND DISORDERS OF THE DIGESTIVE SYSTEM,1,Minor,Minor,Medical,Medicare,Medicaid,,,,Y,56093.9,16223.29
New York City,Kings,7002053,001304,NYU Langone Hospital-Brooklyn,50 to 69,112,F,Other Race,Spanish/Hispanic,3,Emergency,Home or Self Care,2020,DIG022,NONINFECTIOUS GASTROENTERITIS,ADM015,ADMINISTRATION OF ANTIBIOTICS,249,"OTHER GASTROENTERITIS, NAUSEA & VOMITING",06,DISEASES AND DISORDERS OF THE DIGESTIVE SYSTEM,2,Moderate,Minor,Medical,Medicaid,,,,,Y,54982.46,16245.52
New York City,Kings,7002053,001304,NYU Langone Hospital-Brooklyn,50 to 69,112,F,Black/African American,Not Span/Hispanic,2,Emergency,Home w/ Home Health Services,2020,DIG001,INTESTINAL INFECTION,ADM021,"ADMINISTRATION OF THERAPEUTIC SUBSTANCES, NEC",249,"OTHER GASTROENTERITIS, NAUSEA & VOMITING",06,DISEASES AND DISORDERS OF THE DIGESTIVE SYSTEM,3,Major,Moderate,Medical,Medicare,Medicaid,,,,Y,53993.29,13242.11