Hospital Service Area,Hospital County,Operating Certificate Number,Permanent Facility Id,Facility Name,Age Group,Zip Code - 3 digits,Gender,Race,Ethnicity,Length of Stay,Type of Admission,Patient Disposition,Discharge Year,CCS Diagnosis Code,CCS Diagnosis Description,CCS Procedure Code,CCS Procedure Description,APR DRG Code,APR DRG Description,APR MDC Code,APR MDC Description,APR Severity of Illness Code,APR Severity of Illness Description,APR Risk of Mortality,APR Medical Surgical Description,Payment Typology 1,Payment Typology 2,Payment Typology 3,Birth Weight,Abortion Edit Indicator,Emergency Department Indicator,Total Charges,Total Costs
New York City,Manhattan,7002053,001463,NYU Langone Hospitals,50 to 69,112,F,White,Not Span/Hispanic,1,Emergency,Home or Self Care,2020,DIG022,NONINFECTIOUS GASTROENTERITIS,,,249,"OTHER GASTROENTERITIS, NAUSEA & VOMITING",06,DISEASES AND DISORDERS OF THE DIGESTIVE SYSTEM,2,Moderate,Moderate,Medical,Medicare,,,,,Y,45084.36,10669.77
New York City,Manhattan,7002053,001463,NYU Langone Hospitals,70 or Older,104,F,Other Race,Not Span/Hispanic,4,Emergency,Home w/ Home Health Services,2020,DIG022,NONINFECTIOUS GASTROENTERITIS,ESA004,NON-INVASIVE VENTILATION,249,"OTHER GASTROENTERITIS, NAUSEA & VOMITING",06,DISEASES AND DISORDERS OF THE DIGESTIVE SYSTEM,4,Extreme,Extreme,Medical,Medicare,Blue Cross/Blue Shield,,,,Y,60468.23,16763.5
New York City,Manhattan,7002053,001463,NYU Langone Hospitals,50 to 69,127,F,White,Not Span/Hispanic,2,Emergency,Home or Self Care,2020,DIG022,NONINFECTIOUS GASTROENTERITIS,OTR004,ISOLATION PROCEDURES,249,"OTHER GASTROENTERITIS, NAUSEA & VOMITING",06,DISEASES AND DISORDERS OF THE DIGESTIVE SYSTEM,1,Minor,Minor,Medical,Private Health Insurance,,,,,N,16558.83,6473.92
New York City,Manhattan,7002053,001463,NYU Langone Hospitals,50 to 69,113,M,Other Race,Not Span/Hispanic,1,Emergency,Home or Self Care,2020,SYM004,NAUSEA AND VOMITING,,,249,"OTHER GASTROENTERITIS, NAUSEA & VOMITING",06,DISEASES AND DISORDERS OF THE DIGESTIVE SYSTEM,2,Moderate,Moderate,Medical,Private Health Insurance,,,,,Y,12923.66,4003.47
New York City,Manhattan,7002053,001463,NYU Langone Hospitals,0 to 17,112,M,White,Not Span/Hispanic,1,Emergency,Home or Self Care,2020,DIG001,INTESTINAL INFECTION,,,249,"OTHER GASTROENTERITIS, NAUSEA & VOMITING",06,DISEASES AND DISORDERS OF THE DIGESTIVE SYSTEM,2,Moderate,Moderate,Medical,Medicaid,,,,,Y,20233.3,3936.21
New York City,Manhattan,7002053,001463,NYU Langone Hospitals,0 to 17,112,F,White,Not Span/Hispanic,2,Emergency,Home or Self Care,2020,DIG022,NONINFECTIOUS GASTROENTERITIS,,,249,"OTHER GASTROENTERITIS, NAUSEA & VOMITING",06,DISEASES AND DISORDERS OF THE DIGESTIVE SYSTEM,2,Moderate,Minor,Medical,Private Health Insurance,,,,,Y,21396.53,5502.8
New York City,Manhattan,7002053,001463,NYU Langone Hospitals,50 to 69,100,F,Other Race,Spanish/Hispanic,3,Emergency,Home or Self Care,2020,DIG001,INTESTINAL INFECTION,MAM005,MEASUREMENT DURING CARDIAC CATHETERIZATION,249,"OTHER GASTROENTERITIS, NAUSEA & VOMITING",06,DISEASES AND DISORDERS OF THE DIGESTIVE SYSTEM,3,Major,Major,Medical,Private Health Insurance,Medicare,,,,Y,113628.54,17575.83
New York City,Manhattan,7002053,001463,NYU Langone Hospitals,18 to 29,112,F,White,Not Span/Hispanic,1,Emergency,Home or Self Care,2020,DIG001,INTESTINAL INFECTION,,,249,"OTHER GASTROENTERITIS, NAUSEA & VOMITING",06,DISEASES AND DISORDERS OF THE DIGESTIVE SYSTEM,2,Moderate,Moderate,Medical,Private Health Insurance,,,,,Y,38193.51,10367.05
New York City,Manhattan,7002053,001463,NYU Langone Hospitals,30 to 49,OOS,M,Other Race,Spanish/Hispanic,1,Emergency,Home or Self Care,2020,DIG022,NONINFECTIOUS GASTROENTERITIS,,,249,"OTHER GASTROENTERITIS, NAUSEA & VOMITING",06,DISEASES AND DISORDERS OF THE DIGESTIVE SYSTEM,1,Minor,Minor,Medical,Medicaid,,,,,Y,35751.51,8955.45
New York City,Manhattan,7002053,001463,NYU Langone Hospitals,0 to 17,112,M,White,Spanish/Hispanic,1,Emergency,Home or Self Care,2020,DIG001,INTESTINAL INFECTION,,,249,"OTHER GASTROENTERITIS, NAUSEA & VOMITING",06,DISEASES AND DISORDERS OF THE DIGESTIVE SYSTEM,2,Moderate,Moderate,Medical,Private Health Insurance,,,,,Y,16851.88,3516.79
New York City,Manhattan,7002053,001463,NYU Langone Hospitals,50 to 69,101,M,White,Not Span/Hispanic,5,Emergency,Home or Self Care,2020,DIG022,NONINFECTIOUS GASTROENTERITIS,,,249,"OTHER GASTROENTERITIS, NAUSEA & VOMITING",06,DISEASES AND DISORDERS OF THE DIGESTIVE SYSTEM,2,Moderate,Moderate,Medical,Private Health Insurance,,,,,Y,201890.34,37451.3
New York City,Manhattan,7002053,001463,NYU Langone Hospitals,70 or Older,100,F,White,Not Span/Hispanic,3,Emergency,Skilled Nursing Home,2020,DIG001,INTESTINAL INFECTION,OTR004,ISOLATION PROCEDURES,249,"OTHER GASTROENTERITIS, NAUSEA & VOMITING",06,DISEASES AND DISORDERS OF THE DIGESTIVE SYSTEM,3,Major,Moderate,Medical,Medicare,Medicare,,,,Y,57152.47,13168.07
New York City,Manhattan,7002053,001463,NYU Langone Hospitals,50 to 69,112,M,Other Race,Not Span/Hispanic,1,Emergency,Home or Self Care,2020,SYM004,NAUSEA AND VOMITING,,,249,"OTHER GASTROENTERITIS, NAUSEA & VOMITING",06,DISEASES AND DISORDERS OF THE DIGESTIVE SYSTEM,2,Moderate,Major,Medical,Medicaid,,,,,Y,26505.65,4949.74
New York City,Manhattan,7002053,001463,NYU Langone Hospitals,18 to 29,114,F,Other Race,Spanish/Hispanic,1,Emergency,Home or Self Care,2020,SYM004,NAUSEA AND VOMITING,,,249,"OTHER GASTROENTERITIS, NAUSEA & VOMITING",06,DISEASES AND DISORDERS OF THE DIGESTIVE SYSTEM,2,Moderate,Moderate,Medical,Private Health Insurance,,,,,Y,34643.97,9508.5
New York City,Manhattan,7002053,001463,NYU Langone Hospitals,30 to 49,112,M,Black/African American,Not Span/Hispanic,3,Emergency,Home or Self Care,2020,DIG001,INTESTINAL INFECTION,OTR004,ISOLATION PROCEDURES,249,"OTHER GASTROENTERITIS, NAUSEA & VOMITING",06,DISEASES AND DISORDERS OF THE DIGESTIVE SYSTEM,2,Moderate,Minor,Medical,Medicaid,,,,,Y,42268.87,11586.11
New York City,Manhattan,7002053,001463,NYU Langone Hospitals,50 to 69,104,M,Black/African American,Not Span/Hispanic,41,Emergency,Inpatient Rehabilitation Facility,2020,DIG022,NONINFECTIOUS GASTROENTERITIS,CNS002,LUMBAR PUNCTURE,249,"OTHER GASTROENTERITIS, NAUSEA & VOMITING",06,DISEASES AND DISORDERS OF THE DIGESTIVE SYSTEM,3,Major,Major,Medical,Private Health Insurance,,,,,Y,477403.09,150213.83
New York City,Manhattan,7002053,001463,NYU Langone Hospitals,0 to 17,112,M,Other Race,Spanish/Hispanic,5,Emergency,Home or Self Care,2020,END011,FLUID AND ELECTROLYTE DISORDERS,OTR004,ISOLATION PROCEDURES,249,"OTHER GASTROENTERITIS, NAUSEA & VOMITING",06,DISEASES AND DISORDERS OF THE DIGESTIVE SYSTEM,2,Moderate,Moderate,Medical,Medicaid,,,,,Y,69174.26,22149.15
New York City,Manhattan,7002053,001463,NYU Langone Hospitals,0 to 17,112,F,White,Not Span/Hispanic,1,Emergency,Home or Self Care,2020,END011,FLUID AND ELECTROLYTE DISORDERS,,,249,"OTHER GASTROENTERITIS, NAUSEA & VOMITING",06,DISEASES AND DISORDERS OF THE DIGESTIVE SYSTEM,2,Moderate,Moderate,Medical,Medicaid,,,,,Y,16814.51,3571.05
New York City,Manhattan,7002053,001463,NYU Langone Hospitals,70 or Older,100,M,Other Race,Spanish/Hispanic,2,Emergency,Home w/ Home Health Services,2020,DIG001,INTESTINAL INFECTION,,,249,"OTHER GASTROENTERITIS, NAUSEA & VOMITING",06,DISEASES AND DISORDERS OF THE DIGESTIVE SYSTEM,2,Moderate,Moderate,Medical,Medicare,Medicaid,,,,Y,36745.39,10835.24
New York City,Manhattan,7002053,001463,NYU Langone Hospitals,30 to 49,OOS,F,White,Not Span/Hispanic,1,Emergency,Home or Self Care,2020,DIG022,NONINFECTIOUS GASTROENTERITIS,,,249,"OTHER GASTROENTERITIS, NAUSEA & VOMITING",06,DISEASES AND DISORDERS OF THE DIGESTIVE SYSTEM,1,Minor,Minor,Medical,Private Health Insurance,,,,,Y,29916.62,7949.72
New York City,Manhattan,7002053,001463,NYU Langone Hospitals,70 or Older,OOS,F,White,Not Span/Hispanic,2,Emergency,Home or Self Care,2020,SYM006,ABDOMINAL PAIN AND OTHER DIGESTIVE/ABDOMEN SIGNS AND SYMPTOMS,GIS002,COLONOSCOPY AND PROCTOSCOPY WITH BIOPSY,249,"OTHER GASTROENTERITIS, NAUSEA & VOMITING",06,DISEASES AND DISORDERS OF THE DIGESTIVE SYSTEM,3,Major,Moderate,Medical,Private Health Insurance,,,,,Y,86934.06,17198.48
New York City,Manhattan,7002053,001463,NYU Langone Hospitals,70 or Older,112,F,White,Not Span/Hispanic,1,Emergency,Home or Self Care,2020,DIG022,NONINFECTIOUS GASTROENTERITIS,,,249,"OTHER GASTROENTERITIS, NAUSEA & VOMITING",06,DISEASES AND DISORDERS OF THE DIGESTIVE SYSTEM,1,Minor,Minor,Medical,Medicare,Private Health Insurance,,,,Y,42061.75,11981.4
New York City,Manhattan,7002053,001463,NYU Langone Hospitals,50 to 69,OOS,F,White,Not Span/Hispanic,3,Emergency,Home w/ Home Health Services,2020,SYM004,NAUSEA AND VOMITING,,,249,"OTHER GASTROENTERITIS, NAUSEA & VOMITING",06,DISEASES AND DISORDERS OF THE DIGESTIVE SYSTEM,3,Major,Moderate,Medical,Medicare,,,,,Y,54272.18,15450.33
New York City,Manhattan,7002053,001463,NYU Langone Hospitals,30 to 49,114,F,Other Race,Not Span/Hispanic,1,Emergency,Home or Self Care,2020,SYM004,NAUSEA AND VOMITING,OTR004,ISOLATION PROCEDURES,249,"OTHER GASTROENTERITIS, NAUSEA & VOMITING",06,DISEASES AND DISORDERS OF THE DIGESTIVE SYSTEM,1,Minor,Minor,Medical,Medicare,Medicaid,,,,N,37467.85,10919.85
New York City,Manhattan,7002053,001463,NYU Langone Hospitals,50 to 69,100,F,White,Not Span/Hispanic,1,Emergency,Home or Self Care,2020,SYM004,NAUSEA AND VOMITING,CNS002,LUMBAR PUNCTURE,249,"OTHER GASTROENTERITIS, NAUSEA & VOMITING",06,DISEASES AND DISORDERS OF THE DIGESTIVE SYSTEM,1,Minor,Minor,Medical,Blue Cross/Blue Shield,,,,,Y,37177.87,10204.95
New York City,Manhattan,7002053,001463,NYU Langone Hospitals,0 to 17,OOS,F,White,Not Span/Hispanic,2,Emergency,Home or Self Care,2020,END011,FLUID AND ELECTROLYTE DISORDERS,,,249,"OTHER GASTROENTERITIS, NAUSEA & VOMITING",06,DISEASES AND DISORDERS OF THE DIGESTIVE SYSTEM,2,Moderate,Minor,Medical,Blue Cross/Blue Shield,,,,,Y,19354.72,5249.19
New York City,Manhattan,7002053,001463,NYU Langone Hospitals,30 to 49,103,F,Other Race,Spanish/Hispanic,1,Emergency,Home or Self Care,2020,DIG022,NONINFECTIOUS GASTROENTERITIS,,,249,"OTHER GASTROENTERITIS, NAUSEA & VOMITING",06,DISEASES AND DISORDERS OF THE DIGESTIVE SYSTEM,1,Minor,Minor,Medical,Blue Cross/Blue Shield,,,,,Y,29728.85,8081.87
New York City,Manhattan,7002053,001463,NYU Langone Hospitals,70 or Older,100,F,White,Not Span/Hispanic,3,Emergency,Home or Self Care,2020,DIG001,INTESTINAL INFECTION,OTR004,ISOLATION PROCEDURES,249,"OTHER GASTROENTERITIS, NAUSEA & VOMITING",06,DISEASES AND DISORDERS OF THE DIGESTIVE SYSTEM,1,Minor,Moderate,Medical,Medicare,Blue Cross/Blue Shield,,,,Y,46842.23,12586.33
New York City,Manhattan,7002053,001463,NYU Langone Hospitals,70 or Older,104,F,Other Race,Spanish/Hispanic,1,Emergency,Home w/ Home Health Services,2020,DIG001,INTESTINAL INFECTION,,,249,"OTHER GASTROENTERITIS, NAUSEA & VOMITING",06,DISEASES AND DISORDERS OF THE DIGESTIVE SYSTEM,2,Moderate,Major,Medical,Medicare,,,,,Y,40792.18,6565.09
New York City,Manhattan,7002053,001463,NYU Langone Hospitals,0 to 17,100,F,White,Not Span/Hispanic,4,Emergency,Home or Self Care,2020,DIG001,INTESTINAL INFECTION,,,249,"OTHER GASTROENTERITIS, NAUSEA & VOMITING",06,DISEASES AND DISORDERS OF THE DIGESTIVE SYSTEM,2,Moderate,Moderate,Medical,Private Health Insurance,,,,,Y,36664.49,10962.94
New York City,Manhattan,7002053,001463,NYU Langone Hospitals,0 to 17,OOS,M,White,Not Span/Hispanic,3,Urgent,Home or Self Care,2020,END011,FLUID AND ELECTROLYTE DISORDERS,,,249,"OTHER GASTROENTERITIS, NAUSEA & VOMITING",06,DISEASES AND DISORDERS OF THE DIGESTIVE SYSTEM,2,Moderate,Minor,Medical,Blue Cross/Blue Shield,,,,,N,25489.02,7135.24
New York City,Manhattan,7002053,001463,NYU Langone Hospitals,70 or Older,100,F,White,Not Span/Hispanic,2,Emergency,Home or Self Care,2020,DIG022,NONINFECTIOUS GASTROENTERITIS,,,249,"OTHER GASTROENTERITIS, NAUSEA & VOMITING",06,DISEASES AND DISORDERS OF THE DIGESTIVE SYSTEM,2,Moderate,Moderate,Medical,Medicare,Private Health Insurance,,,,Y,31476.02,8210.46
New York City,Manhattan,7002053,001463,NYU Langone Hospitals,0 to 17,100,M,Other Race,Unknown,1,Emergency,Home or Self Care,2020,END011,FLUID AND ELECTROLYTE DISORDERS,,,249,"OTHER GASTROENTERITIS, NAUSEA & VOMITING",06,DISEASES AND DISORDERS OF THE DIGESTIVE SYSTEM,2,Moderate,Moderate,Medical,Private Health Insurance,,,,,Y,19662.13,3851.87
New York City,Manhattan,7002053,001463,NYU Langone Hospitals,70 or Older,112,F,Black/African American,Not Span/Hispanic,1,Emergency,Home w/ Home Health Services,2020,DIG022,NONINFECTIOUS GASTROENTERITIS,,,249,"OTHER GASTROENTERITIS, NAUSEA & VOMITING",06,DISEASES AND DISORDERS OF THE DIGESTIVE SYSTEM,2,Moderate,Moderate,Medical,Medicare,,,,,Y,36265.02,10559.56
New York City,Manhattan,7002053,001463,NYU Langone Hospitals,30 to 49,103,M,White,Not Span/Hispanic,2,Emergency,Home or Self Care,2020,DIG001,INTESTINAL INFECTION,OTR004,ISOLATION PROCEDURES,249,"OTHER GASTROENTERITIS, NAUSEA & VOMITING",06,DISEASES AND DISORDERS OF THE DIGESTIVE SYSTEM,3,Major,Minor,Medical,Medicaid,,,,,N,31537.25,8128.83
New York City,Manhattan,7002053,001463,NYU Langone Hospitals,30 to 49,113,M,Black/African American,Not Span/Hispanic,6,Emergency,Home w/ Home Health Services,2020,DIG022,NONINFECTIOUS GASTROENTERITIS,OTR004,ISOLATION PROCEDURES,249,"OTHER GASTROENTERITIS, NAUSEA & VOMITING",06,DISEASES AND DISORDERS OF THE DIGESTIVE SYSTEM,3,Major,Moderate,Medical,Medicaid,,,,,Y,80694.23,23225.2
New York City,Manhattan,7002053,001463,NYU Langone Hospitals,70 or Older,112,F,White,Not Span/Hispanic,1,Emergency,Home or Self Care,2020,DIG022,NONINFECTIOUS GASTROENTERITIS,,,249,"OTHER GASTROENTERITIS, NAUSEA & VOMITING",06,DISEASES AND DISORDERS OF THE DIGESTIVE SYSTEM,1,Minor,Moderate,Medical,Medicare,,,,,Y,27528.05,5750.13
New York City,Manhattan,7002053,001463,NYU Langone Hospitals,70 or Older,100,F,White,Not Span/Hispanic,1,Emergency,Home or Self Care,2020,DIG022,NONINFECTIOUS GASTROENTERITIS,,,249,"OTHER GASTROENTERITIS, NAUSEA & VOMITING",06,DISEASES AND DISORDERS OF THE DIGESTIVE SYSTEM,1,Minor,Minor,Medical,Medicare,,,,,Y,35702,9045.22
New York City,Manhattan,7002053,001463,NYU Langone Hospitals,0 to 17,112,F,Other Race,Unknown,3,Emergency,Home or Self Care,2020,END011,FLUID AND ELECTROLYTE DISORDERS,,,249,"OTHER GASTROENTERITIS, NAUSEA & VOMITING",06,DISEASES AND DISORDERS OF THE DIGESTIVE SYSTEM,2,Moderate,Minor,Medical,Medicaid,,,,,Y,32829.23,8278.58
New York City,Manhattan,7002053,001463,NYU Langone Hospitals,50 to 69,104,M,Black/African American,Not Span/Hispanic,2,Emergency,Home or Self Care,2020,DIG001,INTESTINAL INFECTION,OTR004,ISOLATION PROCEDURES,249,"OTHER GASTROENTERITIS, NAUSEA & VOMITING",06,DISEASES AND DISORDERS OF THE DIGESTIVE SYSTEM,1,Minor,Minor,Medical,Self-Pay,,,,,Y,46559.13,10458.08
New York City,Manhattan,7002053,001463,NYU Langone Hospitals,50 to 69,100,F,White,Unknown,1,Emergency,Home or Self Care,2020,DIG022,NONINFECTIOUS GASTROENTERITIS,,,249,"OTHER GASTROENTERITIS, NAUSEA & VOMITING",06,DISEASES AND DISORDERS OF THE DIGESTIVE SYSTEM,2,Moderate,Minor,Medical,Medicare,,,,,Y,30196.47,8886.25
New York City,Manhattan,7002053,001463,NYU Langone Hospitals,0 to 17,112,M,Other Race,Unknown,1,Emergency,Home or Self Care,2020,DIG022,NONINFECTIOUS GASTROENTERITIS,,,249,"OTHER GASTROENTERITIS, NAUSEA & VOMITING",06,DISEASES AND DISORDERS OF THE DIGESTIVE SYSTEM,2,Moderate,Minor,Medical,Medicaid,,,,,Y,13474.83,3163.63
New York City,Manhattan,7002053,001463,NYU Langone Hospitals,30 to 49,100,F,White,Not Span/Hispanic,1,Emergency,Home or Self Care,2020,DIG001,INTESTINAL INFECTION,OTR004,ISOLATION PROCEDURES,249,"OTHER GASTROENTERITIS, NAUSEA & VOMITING",06,DISEASES AND DISORDERS OF THE DIGESTIVE SYSTEM,1,Minor,Minor,Medical,Private Health Insurance,,,,,Y,35927.03,9428.4
New York City,Manhattan,7002053,001463,NYU Langone Hospitals,0 to 17,100,M,Other Race,Unknown,2,Emergency,Home or Self Care,2020,END011,FLUID AND ELECTROLYTE DISORDERS,,,249,"OTHER GASTROENTERITIS, NAUSEA & VOMITING",06,DISEASES AND DISORDERS OF THE DIGESTIVE SYSTEM,2,Moderate,Minor,Medical,Private Health Insurance,,,,,Y,25939.66,5963.88
New York City,Manhattan,7002053,001463,NYU Langone Hospitals,0 to 17,112,F,White,Not Span/Hispanic,1,Emergency,Home or Self Care,2020,DIG022,NONINFECTIOUS GASTROENTERITIS,,,249,"OTHER GASTROENTERITIS, NAUSEA & VOMITING",06,DISEASES AND DISORDERS OF THE DIGESTIVE SYSTEM,1,Minor,Minor,Medical,Blue Cross/Blue Shield,,,,,Y,17323.69,3651.26
New York City,Manhattan,7002053,001463,NYU Langone Hospitals,30 to 49,104,F,Other Race,Spanish/Hispanic,7,Emergency,Home or Self Care,2020,DIG022,NONINFECTIOUS GASTROENTERITIS,ADM001,TRANSFUSION OF BLOOD AND BLOOD PRODUCTS,249,"OTHER GASTROENTERITIS, NAUSEA & VOMITING",06,DISEASES AND DISORDERS OF THE DIGESTIVE SYSTEM,3,Major,Major,Medical,Medicare,Medicaid,,,,Y,98180.83,27082.5
New York City,Manhattan,7002053,001463,NYU Langone Hospitals,0 to 17,112,M,Other Race,Spanish/Hispanic,1,Emergency,Home or Self Care,2020,END011,FLUID AND ELECTROLYTE DISORDERS,,,249,"OTHER GASTROENTERITIS, NAUSEA & VOMITING",06,DISEASES AND DISORDERS OF THE DIGESTIVE SYSTEM,2,Moderate,Minor,Medical,Medicaid,,,,,Y,16941.13,3587.49
New York City,Manhattan,7002053,001463,NYU Langone Hospitals,50 to 69,114,F,Black/African American,Not Span/Hispanic,2,Emergency,Home w/ Home Health Services,2020,DIG022,NONINFECTIOUS GASTROENTERITIS,,,249,"OTHER GASTROENTERITIS, NAUSEA & VOMITING",06,DISEASES AND DISORDERS OF THE DIGESTIVE SYSTEM,3,Major,Moderate,Medical,Private Health Insurance,,,,,N,32138.2,8440.93
New York City,Manhattan,7002053,001463,NYU Langone Hospitals,50 to 69,112,M,White,Not Span/Hispanic,7,Emergency,Home or Self Care,2020,DIG001,INTESTINAL INFECTION,CAR025,PLACEMENT OF TUNNELED OR IMPLANTABLE PORTION OF A VASCULAR ACCESS DEVICE,249,"OTHER GASTROENTERITIS, NAUSEA & VOMITING",06,DISEASES AND DISORDERS OF THE DIGESTIVE SYSTEM,2,Moderate,Major,Medical,Medicare,,,,,Y,115112.23,38274.27
New York City,Manhattan,7002053,001463,NYU Langone Hospitals,30 to 49,117,M,White,Not Span/Hispanic,4,Emergency,Home or Self Care,2020,DIG022,NONINFECTIOUS GASTROENTERITIS,OTR004,ISOLATION PROCEDURES,249,"OTHER GASTROENTERITIS, NAUSEA & VOMITING",06,DISEASES AND DISORDERS OF THE DIGESTIVE SYSTEM,1,Minor,Minor,Medical,Blue Cross/Blue Shield,,,,,Y,70032.6,15816.4
New York City,Manhattan,7002053,001463,NYU Langone Hospitals,0 to 17,113,M,Other Race,Not Span/Hispanic,7,Emergency,Home or Self Care,2020,DIG001,INTESTINAL INFECTION,,,249,"OTHER GASTROENTERITIS, NAUSEA & VOMITING",06,DISEASES AND DISORDERS OF THE DIGESTIVE SYSTEM,3,Major,Moderate,Medical,Medicaid,,,,,Y,63231.07,24968.01
New York City,Manhattan,7002053,001463,NYU Langone Hospitals,0 to 17,OOS,F,Other Race,Not Span/Hispanic,3,Emergency,Home or Self Care,2020,DIG001,INTESTINAL INFECTION,IMG008,ULTRASONOGRAPHY,249,"OTHER GASTROENTERITIS, NAUSEA & VOMITING",06,DISEASES AND DISORDERS OF THE DIGESTIVE SYSTEM,1,Minor,Minor,Medical,Blue Cross/Blue Shield,,,,,Y,50501.33,8752.53
New York City,Manhattan,7002053,001463,NYU Langone Hospitals,70 or Older,100,F,White,Not Span/Hispanic,1,Emergency,Home or Self Care,2020,DIG001,INTESTINAL INFECTION,,,249,"OTHER GASTROENTERITIS, NAUSEA & VOMITING",06,DISEASES AND DISORDERS OF THE DIGESTIVE SYSTEM,3,Major,Moderate,Medical,Medicare,Medicare,,,,Y,57985.86,14578.87
New York City,Manhattan,7002053,001463,NYU Langone Hospitals,50 to 69,111,F,White,Not Span/Hispanic,3,Emergency,Home or Self Care,2020,DIG022,NONINFECTIOUS GASTROENTERITIS,GIS004,GI SYSTEM ENDOSCOPY WITHOUT BIOPSY (DIAGNOSTIC),249,"OTHER GASTROENTERITIS, NAUSEA & VOMITING",06,DISEASES AND DISORDERS OF THE DIGESTIVE SYSTEM,2,Moderate,Moderate,Medical,Private Health Insurance,,,,,N,54191.87,13635.9
New York City,Manhattan,7002053,001463,NYU Langone Hospitals,70 or Older,100,F,Other Race,Spanish/Hispanic,7,Emergency,Home w/ Home Health Services,2020,SYM004,NAUSEA AND VOMITING,IMG008,ULTRASONOGRAPHY,249,"OTHER GASTROENTERITIS, NAUSEA & VOMITING",06,DISEASES AND DISORDERS OF THE DIGESTIVE SYSTEM,2,Moderate,Major,Medical,Medicare,,,,,Y,87347.25,26438.61
New York City,Manhattan,7002053,001463,NYU Langone Hospitals,50 to 69,112,F,Black/African American,Not Span/Hispanic,2,Emergency,Home or Self Care,2020,DIG001,INTESTINAL INFECTION,,,249,"OTHER GASTROENTERITIS, NAUSEA & VOMITING",06,DISEASES AND DISORDERS OF THE DIGESTIVE SYSTEM,2,Moderate,Major,Medical,Medicaid,,,,,Y,34604.8,8033.47
New York City,Manhattan,7002053,001463,NYU Langone Hospitals,0 to 17,112,F,White,Not Span/Hispanic,1,Emergency,Home or Self Care,2020,DIG022,NONINFECTIOUS GASTROENTERITIS,,,249,"OTHER GASTROENTERITIS, NAUSEA & VOMITING",06,DISEASES AND DISORDERS OF THE DIGESTIVE SYSTEM,3,Major,Moderate,Medical,Medicaid,,,,,Y,15634.87,3412.94
New York City,Manhattan,7002053,001463,NYU Langone Hospitals,18 to 29,112,M,Other Race,Not Span/Hispanic,4,Emergency,Home w/ Home Health Services,2020,DIG022,NONINFECTIOUS GASTROENTERITIS,,,249,"OTHER GASTROENTERITIS, NAUSEA & VOMITING",06,DISEASES AND DISORDERS OF THE DIGESTIVE SYSTEM,2,Moderate,Moderate,Medical,Medicaid,,,,,Y,58416.8,15635.29
New York City,Manhattan,7002053,001463,NYU Langone Hospitals,0 to 17,114,F,Other Race,Not Span/Hispanic,4,Emergency,Home or Self Care,2020,DIG001,INTESTINAL INFECTION,CNS002,LUMBAR PUNCTURE,249,"OTHER GASTROENTERITIS, NAUSEA & VOMITING",06,DISEASES AND DISORDERS OF THE DIGESTIVE SYSTEM,1,Minor,Minor,Medical,Medicaid,,,,,Y,60207.18,11170.9
New York City,Manhattan,7002053,001463,NYU Langone Hospitals,50 to 69,100,M,White,Not Span/Hispanic,1,Emergency,Home or Self Care,2020,SYM006,ABDOMINAL PAIN AND OTHER DIGESTIVE/ABDOMEN SIGNS AND SYMPTOMS,,,249,"OTHER GASTROENTERITIS, NAUSEA & VOMITING",06,DISEASES AND DISORDERS OF THE DIGESTIVE SYSTEM,1,Minor,Minor,Medical,Private Health Insurance,,,,,Y,37879.76,7025.87
New York City,Manhattan,7002053,001463,NYU Langone Hospitals,50 to 69,100,F,White,Not Span/Hispanic,1,Emergency,Home or Self Care,2020,DIG001,INTESTINAL INFECTION,OTR004,ISOLATION PROCEDURES,249,"OTHER GASTROENTERITIS, NAUSEA & VOMITING",06,DISEASES AND DISORDERS OF THE DIGESTIVE SYSTEM,2,Moderate,Major,Medical,Medicare,Private Health Insurance,,,,Y,46906.94,11906.46
New York City,Manhattan,7002053,001463,NYU Langone Hospitals,50 to 69,113,F,Black/African American,Not Span/Hispanic,3,Emergency,Home w/ Home Health Services,2020,DIG022,NONINFECTIOUS GASTROENTERITIS,OTR004,ISOLATION PROCEDURES,249,"OTHER GASTROENTERITIS, NAUSEA & VOMITING",06,DISEASES AND DISORDERS OF THE DIGESTIVE SYSTEM,2,Moderate,Moderate,Medical,Private Health Insurance,,,,,Y,45082.78,11868.2
New York City,Manhattan,7002053,001463,NYU Langone Hospitals,30 to 49,112,F,White,Not Span/Hispanic,1,Emergency,Home w/ Home Health Services,2020,DIG022,NONINFECTIOUS GASTROENTERITIS,,,249,"OTHER GASTROENTERITIS, NAUSEA & VOMITING",06,DISEASES AND DISORDERS OF THE DIGESTIVE SYSTEM,2,Moderate,Moderate,Medical,Medicaid,,,,,Y,56282.81,15043.93
New York City,Manhattan,7002053,001463,NYU Langone Hospitals,50 to 69,103,M,White,Not Span/Hispanic,3,Emergency,Home w/ Home Health Services,2020,DIG001,INTESTINAL INFECTION,RAD004,"RADIATION THERAPY, NEC",249,"OTHER GASTROENTERITIS, NAUSEA & VOMITING",06,DISEASES AND DISORDERS OF THE DIGESTIVE SYSTEM,3,Major,Major,Medical,Blue Cross/Blue Shield,,,,,Y,80982.33,26277.28
New York City,Manhattan,7002053,001463,NYU Langone Hospitals,70 or Older,113,F,White,Not Span/Hispanic,1,Emergency,Home w/ Home Health Services,2020,SYM004,NAUSEA AND VOMITING,,,249,"OTHER GASTROENTERITIS, NAUSEA & VOMITING",06,DISEASES AND DISORDERS OF THE DIGESTIVE SYSTEM,2,Moderate,Moderate,Medical,Medicare,Medicaid,,,,Y,22778.84,6317.17
New York City,Manhattan,7002053,001463,NYU Langone Hospitals,18 to 29,112,F,Black/African American,Not Span/Hispanic,4,Emergency,Home w/ Home Health Services,2020,DIG022,NONINFECTIOUS GASTROENTERITIS,ADM001,TRANSFUSION OF BLOOD AND BLOOD PRODUCTS,249,"OTHER GASTROENTERITIS, NAUSEA & VOMITING",06,DISEASES AND DISORDERS OF THE DIGESTIVE SYSTEM,3,Major,Major,Medical,Medicaid,,,,,N,70614.42,20752